{"text_format":"1","workbook":"xlsx","n_sheets":6,"sheets":["Arş. Gör. Ön. Değ.","Ön.Değ.Rapor","Arş.Gör. Sonuç","Sonuç Rapor","Önc. Alan Sonuç","Ön. Al. Sonuç Rapor"],"not_rendered":{"charts":0,"images":1,"macros":1,"external_links":0,"defined_names":2,"comments":0,"pivot_tables":0},"unopened":[],"bounds":{"document_bytes":16777216,"sheet_cells":100000,"rows_first":2000,"rows_last":500,"rows_between":2000,"halvings":0,"cell_chars":16384,"cell_head_chars":4096},"cells_cut":0,"cells_raw":0,"read":"whole","date_system":"1900"}

{"sheet":"Arş. Gör. Ön. Değ.","index":0,"n_rows":30,"n_cols":15,"rows_kept":30,"cut":false,"hidden":false,"merged":[[31,0,31,10],[4,0,4,1],[4,2,4,3],[4,4,4,6],[4,7,4,10],[9,0,9,3],[5,0,5,1],[10,0,11,0],[10,7,10,10],[7,7,7,10],[8,2,8,10],[9,4,9,10],[6,0,6,1],[7,2,7,3],[7,4,7,6],[10,4,10,6],[10,1,10,3],[0,0,0,10],[1,0,1,10],[2,0,2,10],[3,0,3,10],[7,0,7,1],[8,0,8,1],[5,2,5,3],[5,4,5,6],[5,7,5,10],[6,2,6,3],[6,4,6,6],[6,7,6,10]]}
["T.C."]
["BAYBURT ÜNİVERSİTESİ"]
["ÖĞRETİM ELEMANI ÖN DEĞERLENDİRME TUTANAĞI"]
["Üniversitemize bağlı birimlere, 2547 sayılı Kanunun ilgili maddeleri ve 09.11.2018 tarihli ve 30590 sayılı Resmi Gazetede yayımlanan \"Öğretim Üyesi Dışındaki Öğretim Elemanı Kadrolarına Yapılacak Atamalarda Uygulanacak Merkezi Sınav İle Giriş Sınavlarına İlişkin Usul ve Esaslar Hakkında Yönetmelik” 10. Maddesi Uyarınca Lisans ve Ön Lisans Düzeyindeki Eğitim Veren Yerlere Alınacak Akademik Personele Ait Ön Değerlendirme Sonuç Tutanağı  ",null,null,null,null,null,null,null,null,null,null,null,null,null,"                                                                                                                                                                   "]
["İlan No:",null,null,null,"Birimi:",null,null,"….. Fakültesi / Yüksekokulu"]
["İlan Tarihi:",null,"…/.../....",null,"Bölümü:",null,null,"….. Bölümü"]
["Kadro Unvanı:",null,"Araştırma Görevlisi",null,"Anabilim Dalı:",null,null,"….. Anabilim Dalı"]
["Kadro Adedi:",null,null,null,"Öndeğerlendirme Tarihi:",null,null,"…/.../...."]
["İlan Özel Şartı:"]
["SINAVIN YAPILACAĞI YER, TARİH ve SAAT :",null,null,null,"……...     ../…/…. Günü Saat: …:…."]
["Sıra No","Başvuranın",null,null,"Başvuru Şartı",null,null,"Ön Sıralama Değerlendirme Sonuçları"]
[null,"T.C. Kimlik No","Adı","Soyadı","Alanındaki Ales Puanı","Yabancı Dil Puanı","Talep Edilen Lisansüstü Alanda Öğrencilik","ALES  (%60)","Yabancı Dil Puanı (%40)","Toplam Puan","Ön Değerlendirme Sonucu      "]
[1,11111111111,"Örnek","Örnek",81.505549999999999,81.56,"Mevcut",{"$f":"E13*0.6","v":48.903329999999997},{"$f":"F13*0.4","v":32.624000000000002},{"$f":"H13+I13","v":81.527330000000006},"Sınava Girebilir"]
[2,11111111111,"Örnek Örnek","Örnek",80.607429999999994,82.03,"Mevcut",48.364457999999992,32.812000000000005,81.176457999999997,"Sınava Girebilir"]
[3,11111111111,"Örnek","Örnek Örnek",79.275630000000007,82.53,"Mevcut",47.565378000000003,33.012,80.57737800000001,"Sınava Girebilir"]
[4,11111111111,"Örnek Örnek","Örnek Örnek",78.113749999999996,81.56,"Mevcut",46.868249999999996,32.624000000000002,79.492249999999999,"Sınava Girebilir"]
[5,11111111111,"Örnek","Örnek",77.505549999999999,80.56,"Mevcut",46.503329999999998,32.224000000000004,78.727329999999995,"Sınava Girebilir"]
[6,11111111111,"Örnek","Örnek",76.607429999999994,79.03,"Mevcut",45.964457999999993,31.612000000000002,77.576458000000002,"Sınava Girebilir"]
[7,11111111111,"Örnek","Örnek",75.275630000000007,78.53,"Mevcut",45.165378000000004,31.412000000000003,76.57737800000001,"Sınava Girebilir"]
[8,11111111111,"Örnek","Örnek",74.113749999999996,77.56,"Mevcut",44.468249999999998,31.024000000000001,75.492249999999999,"Sınava Girebilir"]
[9,11111111111,"Örnek","Örnek",73.505549999999999,76.56,"Mevcut",44.10333,30.624000000000002,74.727329999999995,"Sınava Girebilir"]
[10,11111111111,"Örnek","Örnek",72.607429999999994,75.03,"Mevcut",43.564457999999995,30.012,73.576458000000002,"Sınava Girebilir"]
[11,11111111111,"Örnek","Örnek",71.275630000000007,74.53,"Mevcut",42.765378000000005,29.812000000000001,72.57737800000001,"Yönetmelik Gereği Elendi *"]
[12,11111111111,"Örnek","Örnek",70.113749999999996,73.56,"Mevcut",42.068249999999999,29.424000000000003,71.492249999999999,"Yönetmelik Gereği Elendi *"]
[13,11111111111,"Örnek","Örnek",70.505549999999999,72.56,"Mevcut",42.303329999999995,29.024000000000001,71.327329999999989,"Yönetmelik Gereği Elendi *"]
[14,11111111111,"Örnek","Örnek",70.607429999999994,72.03,"Mevcut Değil",42.364457999999992,28.812000000000001,71.176457999999997,"Başvuru Şartını Sağlamıyor (Talep Edilen alanda yüksek lisans/doktora yapıyor olduğunu gösterir belge yok)"]
[15,11111111111,"Örnek","Örnek",70.275630000000007,71.53,"Mevcut",42.165378000000004,28.612000000000002,70.777377999999999,"Başvuru Şartını Sağlamıyor (35 yaşını doldurmuş-Arş. Gör.)"]
[16,11111111111,"Örnek","Örnek",68,95,"Mevcut",40.799999999999997,38,78.8,"Başvuru Şartını Sağlamıyor (Ales puanı yetersiz)"]
[17,11111111111,"Örnek","Örnek",80,75,"Mevcut",48,30,78,"Başvuru Şartını Sağlamıyor (Lisans Mezuniyet alanı ilanla uyumlu değil)"]
[18,11111111111,"Örnek","Örnek",80,45,"Uygun Değil",48,18,66,"Başvuru Şartını Sağlamıyor (Yabancı Dil Puanı Yetersiz)"]

{"sheet":"Ön.Değ.Rapor","index":1,"n_rows":75,"n_cols":13,"rows_kept":75,"cut":false,"hidden":false,"merged":[[9,4,9,10],[9,0,9,3],[10,0,11,0],[10,1,10,3],[10,4,10,6],[10,7,10,10],[7,0,7,1],[7,2,7,3],[7,4,7,6],[7,7,7,10],[8,0,8,1],[8,2,8,10],[5,0,5,1],[5,2,5,3],[5,4,5,6],[5,7,5,10],[6,0,6,1],[6,2,6,3],[6,4,6,6],[6,7,6,10],[0,0,0,10],[1,0,1,10],[2,0,2,10],[3,0,3,10],[4,0,4,1],[4,2,4,3],[4,4,4,6],[4,7,4,10]]}
["T.C."]
["BAYBURT ÜNİVERSİTESİ"]
["ÖĞRETİM ELEMANI ÖN DEĞERLENDİRME TUTANAĞI"]
["Üniversitemize bağlı birimlere, 2547 sayılı Kanunun ilgili maddeleri ve 09.11.2018 tarihli ve 30590 sayılı Resmi Gazetede yayımlanan \"Öğretim Üyesi Dışındaki Öğretim Elemanı Kadrolarına Yapılacak Atamalarda Uygulanacak Merkezi Sınav İle Giriş Sınavlarına İlişkin Usul ve Esaslar Hakkında Yönetmelik” 10. Maddesi Uyarınca Lisans ve Ön Lisans Düzeyindeki Eğitim Veren Yerlere Alınacak Akademik Personele Ait Ön Değerlendirme Sonuç Tutanağı  ",null,null,null,null,null,null,null,null,null,null,null,"                                                                                                                                                                   "]
["İlan No:",null,{"$f":"IF('Arş. Gör. Ön. Değ.'!C5=\"\",\"\",'Arş. Gör. Ön. Değ.'!C5)","v":""},null,"Birimi:",null,null,{"$f":"IF('Arş. Gör. Ön. Değ.'!H5=\"\",\"\",'Arş. Gör. Ön. Değ.'!H5)","v":"….. Fakültesi / Yüksekokulu"}]
["İlan Tarihi:",null,{"$f":"IF('Arş. Gör. Ön. Değ.'!C6=\"\",\"\",'Arş. Gör. Ön. Değ.'!C6)","v":"…/.../...."},null,"Bölümü:",null,null,{"$f":"IF('Arş. Gör. Ön. Değ.'!H6=\"\",\"\",'Arş. Gör. Ön. Değ.'!H6)","v":"….. Bölümü"}]
["Kadro Unvanı:",null,{"$f":"IF('Arş. Gör. Ön. Değ.'!C7=\"\",\"\",'Arş. Gör. Ön. Değ.'!C7)","v":"Araştırma Görevlisi"},null,"Anabilim Dalı:",null,null,{"$f":"IF('Arş. Gör. Ön. Değ.'!H7=\"\",\"\",'Arş. Gör. Ön. Değ.'!H7)","v":"….. Anabilim Dalı"}]
["Kadro Adedi:",null,{"$f":"IF('Arş. Gör. Ön. Değ.'!C8=\"\",\"\",'Arş. Gör. Ön. Değ.'!C8)","v":""},null,"Öndeğerlendirme Tarihi:",null,null,{"$f":"IF('Arş. Gör. Ön. Değ.'!H8=\"\",\"\",'Arş. Gör. Ön. Değ.'!H8)","v":"…/.../...."}]
["İlan Özel Şartı:",null,{"$f":"IF('Arş. Gör. Ön. Değ.'!C9=\"\",\"\",'Arş. Gör. Ön. Değ.'!C9)","v":""}]
["SINAVIN YAPILACAĞI YER, TARİH ve SAAT :",null,null,null,{"$f":"IF('Arş. Gör. Ön. Değ.'!E10=\"\",\"\",'Arş. Gör. Ön. Değ.'!E10)","v":"……...     ../…/…. Günü Saat: …:…."}]
["Sıra No","Başvuranın",null,null,"Başvuru Şartı",null,null,"Ön Sıralama Değerlendirme Sonuçları"]
[null,"T.C. Kimlik No","Adı","Soyadı","Alanındaki Ales Puanı","Yabancı Dil Puanı","Talep Edilen Lisansüstü Alanda Öğrencilik","ALES  (%60)","Yabancı Dil Puanı (%40)","Toplam Puan","Ön Değerlendirme Sonucu      "]
[{"$f":"IF('Arş. Gör. Ön. Değ.'!A13=\"\",\"\",'Arş. Gör. Ön. Değ.'!A13)","v":1},{"$f":"IF('Arş. Gör. Ön. Değ.'!B13=\"\",\"\",LEFT('Arş. Gör. Ön. Değ.'!B13,3)&REPT(\"*\",4)&RIGHT('Arş. Gör. Ön. Değ.'!B13,2))","v":"111****11"},{"$f":"IF('Arş. Gör. Ön. Değ.'!C13=\"\",\"\",IF(ISERR(FIND(\" \",'Arş. Gör. Ön. Değ.'!C13))=TRUE,LEFT('Arş. Gör. Ön. Değ.'!C13,2)&REPT(\"*\",3),LEFT('Arş. Gör. Ön. Değ.'!C13,2)&REPT(\"*\",3)&\" \"&MID('Arş. Gör. Ön. Değ.'!C13,FIND(\" \",'Arş. Gör. Ön. Değ.'!C13)+1,2)&REPT(\"*\",3)))","v":"Ör***"},{"$f":"IF('Arş. Gör. Ön. Değ.'!D13=\"\",\"\",IF(ISERR(FIND(\" \",'Arş. Gör. Ön. Değ.'!D13))=TRUE,LEFT('Arş. Gör. Ön. Değ.'!D13,2)&REPT(\"*\",3),LEFT('Arş. Gör. Ön. Değ.'!D13,2)&REPT(\"*\",3)&\" \"&MID('Arş. Gör. Ön. Değ.'!D13,FIND(\" \",'Arş. Gör. Ön. Değ.'!D13)+1,2)&REPT(\"*\",3)))","v":"Ör***"},{"$f":"IF('Arş. Gör. Ön. Değ.'!E13=\"\",\"\",'Arş. Gör. Ön. Değ.'!E13)","v":81.505549999999999},{"$f":"IF('Arş. Gör. Ön. Değ.'!F13=\"\",\"\",'Arş. Gör. Ön. Değ.'!F13)","v":81.56},{"$f":"IF('Arş. Gör. Ön. Değ.'!G13=\"\",\"\",'Arş. Gör. Ön. Değ.'!G13)","v":"Mevcut"},{"$f":"IF('Arş. Gör. Ön. Değ.'!H13=\"\",\"\",'Arş. Gör. Ön. Değ.'!H13)","v":48.903329999999997},{"$f":"IF('Arş. Gör. Ön. Değ.'!I13=\"\",\"\",'Arş. Gör. Ön. Değ.'!I13)","v":32.624000000000002},{"$f":"IF('Arş. Gör. Ön. Değ.'!J13=\"\",\"\",'Arş. Gör. Ön. Değ.'!J13)","v":81.527330000000006},{"$f":"IF('Arş. Gör. Ön. Değ.'!K13=\"\",\"\",'Arş. Gör. Ön. Değ.'!K13)","v":"Sınava Girebilir"}]
[{"$f":"IF('Arş. Gör. Ön. Değ.'!A14=\"\",\"\",'Arş. Gör. Ön. Değ.'!A14)","v":2},{"$f":"IF('Arş. Gör. Ön. Değ.'!B14=\"\",\"\",LEFT('Arş. Gör. Ön. Değ.'!B14,3)&REPT(\"*\",4)&RIGHT('Arş. Gör. Ön. Değ.'!B14,2))","v":"111****11"},{"$f":"IF('Arş. Gör. Ön. Değ.'!C14=\"\",\"\",IF(ISERR(FIND(\" \",'Arş. Gör. Ön. Değ.'!C14))=TRUE,LEFT('Arş. Gör. Ön. Değ.'!C14,2)&REPT(\"*\",3),LEFT('Arş. Gör. Ön. Değ.'!C14,2)&REPT(\"*\",3)&\" \"&MID('Arş. Gör. Ön. Değ.'!C14,FIND(\" \",'Arş. Gör. Ön. Değ.'!C14)+1,2)&REPT(\"*\",3)))","v":"Ör*** Ör***"},{"$f":"IF('Arş. Gör. Ön. Değ.'!D14=\"\",\"\",IF(ISERR(FIND(\" \",'Arş. Gör. Ön. Değ.'!D14))=TRUE,LEFT('Arş. Gör. Ön. Değ.'!D14,2)&REPT(\"*\",3),LEFT('Arş. Gör. Ön. Değ.'!D14,2)&REPT(\"*\",3)&\" \"&MID('Arş. Gör. Ön. Değ.'!D14,FIND(\" \",'Arş. Gör. Ön. Değ.'!D14)+1,2)&REPT(\"*\",3)))","v":"Ör***"},{"$f":"IF('Arş. Gör. Ön. Değ.'!E14=\"\",\"\",'Arş. Gör. Ön. Değ.'!E14)","v":80.607429999999994},{"$f":"IF('Arş. Gör. Ön. Değ.'!F14=\"\",\"\",'Arş. Gör. Ön. Değ.'!F14)","v":82.03},{"$f":"IF('Arş. Gör. Ön. Değ.'!G14=\"\",\"\",'Arş. Gör. Ön. Değ.'!G14)","v":"Mevcut"},{"$f":"IF('Arş. Gör. Ön. Değ.'!H14=\"\",\"\",'Arş. Gör. Ön. Değ.'!H14)","v":48.364457999999992},{"$f":"IF('Arş. Gör. Ön. Değ.'!I14=\"\",\"\",'Arş. Gör. Ön. Değ.'!I14)","v":32.812000000000005},{"$f":"IF('Arş. Gör. Ön. Değ.'!J14=\"\",\"\",'Arş. Gör. Ön. Değ.'!J14)","v":81.176457999999997},{"$f":"IF('Arş. Gör. Ön. Değ.'!K14=\"\",\"\",'Arş. Gör. Ön. Değ.'!K14)","v":"Sınava Girebilir"}]
[{"$f":"IF('Arş. Gör. Ön. Değ.'!A15=\"\",\"\",'Arş. Gör. Ön. Değ.'!A15)","v":3},{"$f":"IF('Arş. Gör. Ön. Değ.'!B15=\"\",\"\",LEFT('Arş. Gör. Ön. Değ.'!B15,3)&REPT(\"*\",4)&RIGHT('Arş. Gör. Ön. Değ.'!B15,2))","v":"111****11"},{"$f":"IF('Arş. Gör. Ön. Değ.'!C15=\"\",\"\",IF(ISERR(FIND(\" \",'Arş. Gör. Ön. Değ.'!C15))=TRUE,LEFT('Arş. Gör. Ön. Değ.'!C15,2)&REPT(\"*\",3),LEFT('Arş. Gör. Ön. Değ.'!C15,2)&REPT(\"*\",3)&\" \"&MID('Arş. Gör. Ön. Değ.'!C15,FIND(\" \",'Arş. Gör. Ön. Değ.'!C15)+1,2)&REPT(\"*\",3)))","v":"Ör***"},{"$f":"IF('Arş. Gör. Ön. Değ.'!D15=\"\",\"\",IF(ISERR(FIND(\" \",'Arş. Gör. Ön. Değ.'!D15))=TRUE,LEFT('Arş. Gör. Ön. Değ.'!D15,2)&REPT(\"*\",3),LEFT('Arş. Gör. Ön. Değ.'!D15,2)&REPT(\"*\",3)&\" \"&MID('Arş. Gör. Ön. Değ.'!D15,FIND(\" \",'Arş. Gör. Ön. Değ.'!D15)+1,2)&REPT(\"*\",3)))","v":"Ör*** Ör***"},{"$f":"IF('Arş. Gör. Ön. Değ.'!E15=\"\",\"\",'Arş. Gör. Ön. Değ.'!E15)","v":79.275630000000007},{"$f":"IF('Arş. Gör. Ön. Değ.'!F15=\"\",\"\",'Arş. Gör. Ön. Değ.'!F15)","v":82.53},{"$f":"IF('Arş. Gör. Ön. Değ.'!G15=\"\",\"\",'Arş. Gör. Ön. Değ.'!G15)","v":"Mevcut"},{"$f":"IF('Arş. Gör. Ön. Değ.'!H15=\"\",\"\",'Arş. Gör. Ön. Değ.'!H15)","v":47.565378000000003},{"$f":"IF('Arş. Gör. Ön. Değ.'!I15=\"\",\"\",'Arş. Gör. Ön. Değ.'!I15)","v":33.012},{"$f":"IF('Arş. Gör. Ön. Değ.'!J15=\"\",\"\",'Arş. Gör. Ön. Değ.'!J15)","v":80.57737800000001},{"$f":"IF('Arş. Gör. Ön. Değ.'!K15=\"\",\"\",'Arş. Gör. Ön. Değ.'!K15)","v":"Sınava Girebilir"}]
[{"$f":"IF('Arş. Gör. Ön. Değ.'!A16=\"\",\"\",'Arş. Gör. Ön. Değ.'!A16)","v":4},{"$f":"IF('Arş. Gör. Ön. Değ.'!B16=\"\",\"\",LEFT('Arş. Gör. Ön. Değ.'!B16,3)&REPT(\"*\",4)&RIGHT('Arş. Gör. Ön. Değ.'!B16,2))","v":"111****11"},{"$f":"IF('Arş. Gör. Ön. Değ.'!C16=\"\",\"\",IF(ISERR(FIND(\" \",'Arş. Gör. Ön. Değ.'!C16))=TRUE,LEFT('Arş. Gör. Ön. Değ.'!C16,2)&REPT(\"*\",3),LEFT('Arş. Gör. Ön. Değ.'!C16,2)&REPT(\"*\",3)&\" \"&MID('Arş. Gör. Ön. Değ.'!C16,FIND(\" \",'Arş. Gör. Ön. Değ.'!C16)+1,2)&REPT(\"*\",3)))","v":"Ör*** Ör***"},{"$f":"IF('Arş. Gör. Ön. Değ.'!D16=\"\",\"\",IF(ISERR(FIND(\" \",'Arş. Gör. Ön. Değ.'!D16))=TRUE,LEFT('Arş. Gör. Ön. Değ.'!D16,2)&REPT(\"*\",3),LEFT('Arş. Gör. Ön. Değ.'!D16,2)&REPT(\"*\",3)&\" \"&MID('Arş. Gör. Ön. Değ.'!D16,FIND(\" \",'Arş. Gör. Ön. Değ.'!D16)+1,2)&REPT(\"*\",3)))","v":"Ör*** Ör***"},{"$f":"IF('Arş. Gör. Ön. Değ.'!E16=\"\",\"\",'Arş. Gör. Ön. Değ.'!E16)","v":78.113749999999996},{"$f":"IF('Arş. Gör. Ön. Değ.'!F16=\"\",\"\",'Arş. Gör. Ön. Değ.'!F16)","v":81.56},{"$f":"IF('Arş. Gör. Ön. Değ.'!G16=\"\",\"\",'Arş. Gör. Ön. Değ.'!G16)","v":"Mevcut"},{"$f":"IF('Arş. Gör. Ön. Değ.'!H16=\"\",\"\",'Arş. Gör. Ön. Değ.'!H16)","v":46.868249999999996},{"$f":"IF('Arş. Gör. Ön. Değ.'!I16=\"\",\"\",'Arş. Gör. Ön. Değ.'!I16)","v":32.624000000000002},{"$f":"IF('Arş. Gör. Ön. Değ.'!J16=\"\",\"\",'Arş. Gör. Ön. Değ.'!J16)","v":79.492249999999999},{"$f":"IF('Arş. Gör. Ön. Değ.'!K16=\"\",\"\",'Arş. Gör. Ön. Değ.'!K16)","v":"Sınava Girebilir"}]
[{"$f":"IF('Arş. Gör. Ön. Değ.'!A17=\"\",\"\",'Arş. Gör. Ön. Değ.'!A17)","v":5},{"$f":"IF('Arş. Gör. Ön. Değ.'!B17=\"\",\"\",LEFT('Arş. Gör. Ön. Değ.'!B17,3)&REPT(\"*\",4)&RIGHT('Arş. Gör. Ön. Değ.'!B17,2))","v":"111****11"},{"$f":"IF('Arş. Gör. Ön. Değ.'!C17=\"\",\"\",IF(ISERR(FIND(\" \",'Arş. Gör. Ön. Değ.'!C17))=TRUE,LEFT('Arş. Gör. Ön. Değ.'!C17,2)&REPT(\"*\",3),LEFT('Arş. Gör. Ön. Değ.'!C17,2)&REPT(\"*\",3)&\" \"&MID('Arş. Gör. Ön. Değ.'!C17,FIND(\" \",'Arş. Gör. Ön. Değ.'!C17)+1,2)&REPT(\"*\",3)))","v":"Ör***"},{"$f":"IF('Arş. Gör. Ön. Değ.'!D17=\"\",\"\",IF(ISERR(FIND(\" \",'Arş. Gör. Ön. Değ.'!D17))=TRUE,LEFT('Arş. Gör. Ön. Değ.'!D17,2)&REPT(\"*\",3),LEFT('Arş. Gör. Ön. Değ.'!D17,2)&REPT(\"*\",3)&\" \"&MID('Arş. Gör. Ön. Değ.'!D17,FIND(\" \",'Arş. Gör. Ön. Değ.'!D17)+1,2)&REPT(\"*\",3)))","v":"Ör***"},{"$f":"IF('Arş. Gör. Ön. Değ.'!E17=\"\",\"\",'Arş. Gör. Ön. Değ.'!E17)","v":77.505549999999999},{"$f":"IF('Arş. Gör. Ön. Değ.'!F17=\"\",\"\",'Arş. Gör. Ön. Değ.'!F17)","v":80.56},{"$f":"IF('Arş. Gör. Ön. Değ.'!G17=\"\",\"\",'Arş. Gör. Ön. Değ.'!G17)","v":"Mevcut"},{"$f":"IF('Arş. Gör. Ön. Değ.'!H17=\"\",\"\",'Arş. Gör. Ön. Değ.'!H17)","v":46.503329999999998},{"$f":"IF('Arş. Gör. Ön. Değ.'!I17=\"\",\"\",'Arş. Gör. Ön. Değ.'!I17)","v":32.224000000000004},{"$f":"IF('Arş. Gör. Ön. Değ.'!J17=\"\",\"\",'Arş. Gör. Ön. Değ.'!J17)","v":78.727329999999995},{"$f":"IF('Arş. Gör. Ön. Değ.'!K17=\"\",\"\",'Arş. Gör. Ön. Değ.'!K17)","v":"Sınava Girebilir"}]
[{"$f":"IF('Arş. Gör. Ön. Değ.'!A18=\"\",\"\",'Arş. Gör. Ön. Değ.'!A18)","v":6},{"$f":"IF('Arş. Gör. Ön. Değ.'!B18=\"\",\"\",LEFT('Arş. Gör. Ön. Değ.'!B18,3)&REPT(\"*\",4)&RIGHT('Arş. Gör. Ön. Değ.'!B18,2))","v":"111****11"},{"$f":"IF('Arş. Gör. Ön. Değ.'!C18=\"\",\"\",IF(ISERR(FIND(\" \",'Arş. Gör. Ön. Değ.'!C18))=TRUE,LEFT('Arş. Gör. Ön. Değ.'!C18,2)&REPT(\"*\",3),LEFT('Arş. Gör. Ön. Değ.'!C18,2)&REPT(\"*\",3)&\" \"&MID('Arş. Gör. Ön. Değ.'!C18,FIND(\" \",'Arş. Gör. Ön. Değ.'!C18)+1,2)&REPT(\"*\",3)))","v":"Ör***"},{"$f":"IF('Arş. Gör. Ön. Değ.'!D18=\"\",\"\",IF(ISERR(FIND(\" \",'Arş. Gör. Ön. Değ.'!D18))=TRUE,LEFT('Arş. Gör. Ön. Değ.'!D18,2)&REPT(\"*\",3),LEFT('Arş. Gör. Ön. Değ.'!D18,2)&REPT(\"*\",3)&\" \"&MID('Arş. Gör. Ön. Değ.'!D18,FIND(\" \",'Arş. Gör. Ön. Değ.'!D18)+1,2)&REPT(\"*\",3)))","v":"Ör***"},{"$f":"IF('Arş. Gör. Ön. Değ.'!E18=\"\",\"\",'Arş. Gör. Ön. Değ.'!E18)","v":76.607429999999994},{"$f":"IF('Arş. Gör. Ön. Değ.'!F18=\"\",\"\",'Arş. Gör. Ön. Değ.'!F18)","v":79.03},{"$f":"IF('Arş. Gör. Ön. Değ.'!G18=\"\",\"\",'Arş. Gör. Ön. Değ.'!G18)","v":"Mevcut"},{"$f":"IF('Arş. Gör. Ön. Değ.'!H18=\"\",\"\",'Arş. Gör. Ön. Değ.'!H18)","v":45.964457999999993},{"$f":"IF('Arş. Gör. Ön. Değ.'!I18=\"\",\"\",'Arş. Gör. Ön. Değ.'!I18)","v":31.612000000000002},{"$f":"IF('Arş. Gör. Ön. Değ.'!J18=\"\",\"\",'Arş. Gör. Ön. Değ.'!J18)","v":77.576458000000002},{"$f":"IF('Arş. Gör. Ön. Değ.'!K18=\"\",\"\",'Arş. Gör. Ön. Değ.'!K18)","v":"Sınava Girebilir"}]
[{"$f":"IF('Arş. Gör. Ön. Değ.'!A19=\"\",\"\",'Arş. Gör. Ön. Değ.'!A19)","v":7},{"$f":"IF('Arş. Gör. Ön. Değ.'!B19=\"\",\"\",LEFT('Arş. Gör. Ön. Değ.'!B19,3)&REPT(\"*\",4)&RIGHT('Arş. Gör. Ön. Değ.'!B19,2))","v":"111****11"},{"$f":"IF('Arş. Gör. Ön. Değ.'!C19=\"\",\"\",IF(ISERR(FIND(\" \",'Arş. Gör. Ön. Değ.'!C19))=TRUE,LEFT('Arş. Gör. Ön. Değ.'!C19,2)&REPT(\"*\",3),LEFT('Arş. Gör. Ön. Değ.'!C19,2)&REPT(\"*\",3)&\" \"&MID('Arş. Gör. Ön. Değ.'!C19,FIND(\" \",'Arş. Gör. Ön. Değ.'!C19)+1,2)&REPT(\"*\",3)))","v":"Ör***"},{"$f":"IF('Arş. Gör. Ön. Değ.'!D19=\"\",\"\",IF(ISERR(FIND(\" \",'Arş. Gör. Ön. Değ.'!D19))=TRUE,LEFT('Arş. Gör. Ön. Değ.'!D19,2)&REPT(\"*\",3),LEFT('Arş. Gör. Ön. Değ.'!D19,2)&REPT(\"*\",3)&\" \"&MID('Arş. Gör. Ön. Değ.'!D19,FIND(\" \",'Arş. Gör. Ön. Değ.'!D19)+1,2)&REPT(\"*\",3)))","v":"Ör***"},{"$f":"IF('Arş. Gör. Ön. Değ.'!E19=\"\",\"\",'Arş. Gör. Ön. Değ.'!E19)","v":75.275630000000007},{"$f":"IF('Arş. Gör. Ön. Değ.'!F19=\"\",\"\",'Arş. Gör. Ön. Değ.'!F19)","v":78.53},{"$f":"IF('Arş. Gör. Ön. Değ.'!G19=\"\",\"\",'Arş. Gör. Ön. Değ.'!G19)","v":"Mevcut"},{"$f":"IF('Arş. Gör. Ön. Değ.'!H19=\"\",\"\",'Arş. Gör. Ön. Değ.'!H19)","v":45.165378000000004},{"$f":"IF('Arş. Gör. Ön. Değ.'!I19=\"\",\"\",'Arş. Gör. Ön. Değ.'!I19)","v":31.412000000000003},{"$f":"IF('Arş. Gör. Ön. Değ.'!J19=\"\",\"\",'Arş. Gör. Ön. Değ.'!J19)","v":76.57737800000001},{"$f":"IF('Arş. Gör. Ön. Değ.'!K19=\"\",\"\",'Arş. Gör. Ön. Değ.'!K19)","v":"Sınava Girebilir"}]
[{"$f":"IF('Arş. Gör. Ön. Değ.'!A20=\"\",\"\",'Arş. Gör. Ön. Değ.'!A20)","v":8},{"$f":"IF('Arş. Gör. Ön. Değ.'!B20=\"\",\"\",LEFT('Arş. Gör. Ön. Değ.'!B20,3)&REPT(\"*\",4)&RIGHT('Arş. Gör. Ön. Değ.'!B20,2))","v":"111****11"},{"$f":"IF('Arş. Gör. Ön. Değ.'!C20=\"\",\"\",IF(ISERR(FIND(\" \",'Arş. Gör. Ön. Değ.'!C20))=TRUE,LEFT('Arş. Gör. Ön. Değ.'!C20,2)&REPT(\"*\",3),LEFT('Arş. Gör. Ön. Değ.'!C20,2)&REPT(\"*\",3)&\" \"&MID('Arş. Gör. Ön. Değ.'!C20,FIND(\" \",'Arş. Gör. Ön. Değ.'!C20)+1,2)&REPT(\"*\",3)))","v":"Ör***"},{"$f":"IF('Arş. Gör. Ön. Değ.'!D20=\"\",\"\",IF(ISERR(FIND(\" \",'Arş. Gör. Ön. Değ.'!D20))=TRUE,LEFT('Arş. Gör. Ön. Değ.'!D20,2)&REPT(\"*\",3),LEFT('Arş. Gör. Ön. Değ.'!D20,2)&REPT(\"*\",3)&\" \"&MID('Arş. Gör. Ön. Değ.'!D20,FIND(\" \",'Arş. Gör. Ön. Değ.'!D20)+1,2)&REPT(\"*\",3)))","v":"Ör***"},{"$f":"IF('Arş. Gör. Ön. Değ.'!E20=\"\",\"\",'Arş. Gör. Ön. Değ.'!E20)","v":74.113749999999996},{"$f":"IF('Arş. Gör. Ön. Değ.'!F20=\"\",\"\",'Arş. Gör. Ön. Değ.'!F20)","v":77.56},{"$f":"IF('Arş. Gör. Ön. Değ.'!G20=\"\",\"\",'Arş. Gör. Ön. Değ.'!G20)","v":"Mevcut"},{"$f":"IF('Arş. Gör. Ön. Değ.'!H20=\"\",\"\",'Arş. Gör. Ön. Değ.'!H20)","v":44.468249999999998},{"$f":"IF('Arş. Gör. Ön. Değ.'!I20=\"\",\"\",'Arş. Gör. Ön. Değ.'!I20)","v":31.024000000000001},{"$f":"IF('Arş. Gör. Ön. Değ.'!J20=\"\",\"\",'Arş. Gör. Ön. Değ.'!J20)","v":75.492249999999999},{"$f":"IF('Arş. Gör. Ön. Değ.'!K20=\"\",\"\",'Arş. Gör. Ön. Değ.'!K20)","v":"Sınava Girebilir"}]
[{"$f":"IF('Arş. Gör. Ön. Değ.'!A21=\"\",\"\",'Arş. Gör. Ön. Değ.'!A21)","v":9},{"$f":"IF('Arş. Gör. Ön. Değ.'!B21=\"\",\"\",LEFT('Arş. Gör. Ön. Değ.'!B21,3)&REPT(\"*\",4)&RIGHT('Arş. Gör. Ön. Değ.'!B21,2))","v":"111****11"},{"$f":"IF('Arş. Gör. Ön. Değ.'!C21=\"\",\"\",IF(ISERR(FIND(\" \",'Arş. Gör. Ön. Değ.'!C21))=TRUE,LEFT('Arş. Gör. Ön. Değ.'!C21,2)&REPT(\"*\",3),LEFT('Arş. Gör. Ön. Değ.'!C21,2)&REPT(\"*\",3)&\" \"&MID('Arş. Gör. Ön. Değ.'!C21,FIND(\" \",'Arş. Gör. Ön. Değ.'!C21)+1,2)&REPT(\"*\",3)))","v":"Ör***"},{"$f":"IF('Arş. Gör. Ön. Değ.'!D21=\"\",\"\",IF(ISERR(FIND(\" \",'Arş. Gör. Ön. Değ.'!D21))=TRUE,LEFT('Arş. Gör. Ön. Değ.'!D21,2)&REPT(\"*\",3),LEFT('Arş. Gör. Ön. Değ.'!D21,2)&REPT(\"*\",3)&\" \"&MID('Arş. Gör. Ön. Değ.'!D21,FIND(\" \",'Arş. Gör. Ön. Değ.'!D21)+1,2)&REPT(\"*\",3)))","v":"Ör***"},{"$f":"IF('Arş. Gör. Ön. Değ.'!E21=\"\",\"\",'Arş. Gör. Ön. Değ.'!E21)","v":73.505549999999999},{"$f":"IF('Arş. Gör. Ön. Değ.'!F21=\"\",\"\",'Arş. Gör. Ön. Değ.'!F21)","v":76.56},{"$f":"IF('Arş. Gör. Ön. Değ.'!G21=\"\",\"\",'Arş. Gör. Ön. Değ.'!G21)","v":"Mevcut"},{"$f":"IF('Arş. Gör. Ön. Değ.'!H21=\"\",\"\",'Arş. Gör. Ön. Değ.'!H21)","v":44.10333},{"$f":"IF('Arş. Gör. Ön. Değ.'!I21=\"\",\"\",'Arş. Gör. Ön. Değ.'!I21)","v":30.624000000000002},{"$f":"IF('Arş. Gör. Ön. Değ.'!J21=\"\",\"\",'Arş. Gör. Ön. Değ.'!J21)","v":74.727329999999995},{"$f":"IF('Arş. Gör. Ön. Değ.'!K21=\"\",\"\",'Arş. Gör. Ön. Değ.'!K21)","v":"Sınava Girebilir"}]
[{"$f":"IF('Arş. Gör. Ön. Değ.'!A22=\"\",\"\",'Arş. Gör. Ön. Değ.'!A22)","v":10},{"$f":"IF('Arş. Gör. Ön. Değ.'!B22=\"\",\"\",LEFT('Arş. Gör. Ön. Değ.'!B22,3)&REPT(\"*\",4)&RIGHT('Arş. Gör. Ön. Değ.'!B22,2))","v":"111****11"},{"$f":"IF('Arş. Gör. Ön. Değ.'!C22=\"\",\"\",IF(ISERR(FIND(\" \",'Arş. Gör. Ön. Değ.'!C22))=TRUE,LEFT('Arş. Gör. Ön. Değ.'!C22,2)&REPT(\"*\",3),LEFT('Arş. Gör. Ön. Değ.'!C22,2)&REPT(\"*\",3)&\" \"&MID('Arş. Gör. Ön. Değ.'!C22,FIND(\" \",'Arş. Gör. Ön. Değ.'!C22)+1,2)&REPT(\"*\",3)))","v":"Ör***"},{"$f":"IF('Arş. Gör. Ön. Değ.'!D22=\"\",\"\",IF(ISERR(FIND(\" \",'Arş. Gör. Ön. Değ.'!D22))=TRUE,LEFT('Arş. Gör. Ön. Değ.'!D22,2)&REPT(\"*\",3),LEFT('Arş. Gör. Ön. Değ.'!D22,2)&REPT(\"*\",3)&\" \"&MID('Arş. Gör. Ön. Değ.'!D22,FIND(\" \",'Arş. Gör. Ön. Değ.'!D22)+1,2)&REPT(\"*\",3)))","v":"Ör***"},{"$f":"IF('Arş. Gör. Ön. Değ.'!E22=\"\",\"\",'Arş. Gör. Ön. Değ.'!E22)","v":72.607429999999994},{"$f":"IF('Arş. Gör. Ön. Değ.'!F22=\"\",\"\",'Arş. Gör. Ön. Değ.'!F22)","v":75.03},{"$f":"IF('Arş. Gör. Ön. Değ.'!G22=\"\",\"\",'Arş. Gör. Ön. Değ.'!G22)","v":"Mevcut"},{"$f":"IF('Arş. Gör. Ön. Değ.'!H22=\"\",\"\",'Arş. Gör. Ön. Değ.'!H22)","v":43.564457999999995},{"$f":"IF('Arş. Gör. Ön. Değ.'!I22=\"\",\"\",'Arş. Gör. Ön. Değ.'!I22)","v":30.012},{"$f":"IF('Arş. Gör. Ön. Değ.'!J22=\"\",\"\",'Arş. Gör. Ön. Değ.'!J22)","v":73.576458000000002},{"$f":"IF('Arş. Gör. Ön. Değ.'!K22=\"\",\"\",'Arş. Gör. Ön. Değ.'!K22)","v":"Sınava Girebilir"}]
[{"$f":"IF('Arş. Gör. Ön. Değ.'!A23=\"\",\"\",'Arş. Gör. Ön. Değ.'!A23)","v":11},{"$f":"IF('Arş. Gör. Ön. Değ.'!B23=\"\",\"\",LEFT('Arş. Gör. Ön. Değ.'!B23,3)&REPT(\"*\",4)&RIGHT('Arş. Gör. Ön. Değ.'!B23,2))","v":"111****11"},{"$f":"IF('Arş. Gör. Ön. Değ.'!C23=\"\",\"\",IF(ISERR(FIND(\" \",'Arş. Gör. Ön. Değ.'!C23))=TRUE,LEFT('Arş. Gör. Ön. Değ.'!C23,2)&REPT(\"*\",3),LEFT('Arş. Gör. Ön. Değ.'!C23,2)&REPT(\"*\",3)&\" \"&MID('Arş. Gör. Ön. Değ.'!C23,FIND(\" \",'Arş. Gör. Ön. Değ.'!C23)+1,2)&REPT(\"*\",3)))","v":"Ör***"},{"$f":"IF('Arş. Gör. Ön. Değ.'!D23=\"\",\"\",IF(ISERR(FIND(\" \",'Arş. Gör. Ön. Değ.'!D23))=TRUE,LEFT('Arş. Gör. Ön. Değ.'!D23,2)&REPT(\"*\",3),LEFT('Arş. Gör. Ön. Değ.'!D23,2)&REPT(\"*\",3)&\" \"&MID('Arş. Gör. Ön. Değ.'!D23,FIND(\" \",'Arş. Gör. Ön. Değ.'!D23)+1,2)&REPT(\"*\",3)))","v":"Ör***"},{"$f":"IF('Arş. Gör. Ön. Değ.'!E23=\"\",\"\",'Arş. Gör. Ön. Değ.'!E23)","v":71.275630000000007},{"$f":"IF('Arş. Gör. Ön. Değ.'!F23=\"\",\"\",'Arş. Gör. Ön. Değ.'!F23)","v":74.53},{"$f":"IF('Arş. Gör. Ön. Değ.'!G23=\"\",\"\",'Arş. Gör. Ön. Değ.'!G23)","v":"Mevcut"},{"$f":"IF('Arş. Gör. Ön. Değ.'!H23=\"\",\"\",'Arş. Gör. Ön. Değ.'!H23)","v":42.765378000000005},{"$f":"IF('Arş. Gör. Ön. Değ.'!I23=\"\",\"\",'Arş. Gör. Ön. Değ.'!I23)","v":29.812000000000001},{"$f":"IF('Arş. Gör. Ön. Değ.'!J23=\"\",\"\",'Arş. Gör. Ön. Değ.'!J23)","v":72.57737800000001},{"$f":"IF('Arş. Gör. Ön. Değ.'!K23=\"\",\"\",'Arş. Gör. Ön. Değ.'!K23)","v":"Yönetmelik Gereği Elendi *"}]
[{"$f":"IF('Arş. Gör. Ön. Değ.'!A24=\"\",\"\",'Arş. Gör. Ön. Değ.'!A24)","v":12},{"$f":"IF('Arş. Gör. Ön. Değ.'!B24=\"\",\"\",LEFT('Arş. Gör. Ön. Değ.'!B24,3)&REPT(\"*\",4)&RIGHT('Arş. Gör. Ön. Değ.'!B24,2))","v":"111****11"},{"$f":"IF('Arş. Gör. Ön. Değ.'!C24=\"\",\"\",IF(ISERR(FIND(\" \",'Arş. Gör. Ön. Değ.'!C24))=TRUE,LEFT('Arş. Gör. Ön. Değ.'!C24,2)&REPT(\"*\",3),LEFT('Arş. Gör. Ön. Değ.'!C24,2)&REPT(\"*\",3)&\" \"&MID('Arş. Gör. Ön. Değ.'!C24,FIND(\" \",'Arş. Gör. Ön. Değ.'!C24)+1,2)&REPT(\"*\",3)))","v":"Ör***"},{"$f":"IF('Arş. Gör. Ön. Değ.'!D24=\"\",\"\",IF(ISERR(FIND(\" \",'Arş. Gör. Ön. Değ.'!D24))=TRUE,LEFT('Arş. Gör. Ön. Değ.'!D24,2)&REPT(\"*\",3),LEFT('Arş. Gör. Ön. Değ.'!D24,2)&REPT(\"*\",3)&\" \"&MID('Arş. Gör. Ön. Değ.'!D24,FIND(\" \",'Arş. Gör. Ön. Değ.'!D24)+1,2)&REPT(\"*\",3)))","v":"Ör***"},{"$f":"IF('Arş. Gör. Ön. Değ.'!E24=\"\",\"\",'Arş. Gör. Ön. Değ.'!E24)","v":70.113749999999996},{"$f":"IF('Arş. Gör. Ön. Değ.'!F24=\"\",\"\",'Arş. Gör. Ön. Değ.'!F24)","v":73.56},{"$f":"IF('Arş. Gör. Ön. Değ.'!G24=\"\",\"\",'Arş. Gör. Ön. Değ.'!G24)","v":"Mevcut"},{"$f":"IF('Arş. Gör. Ön. Değ.'!H24=\"\",\"\",'Arş. Gör. Ön. Değ.'!H24)","v":42.068249999999999},{"$f":"IF('Arş. Gör. Ön. Değ.'!I24=\"\",\"\",'Arş. Gör. Ön. Değ.'!I24)","v":29.424000000000003},{"$f":"IF('Arş. Gör. Ön. Değ.'!J24=\"\",\"\",'Arş. Gör. Ön. Değ.'!J24)","v":71.492249999999999},{"$f":"IF('Arş. Gör. Ön. Değ.'!K24=\"\",\"\",'Arş. Gör. Ön. Değ.'!K24)","v":"Yönetmelik Gereği Elendi *"}]
[{"$f":"IF('Arş. Gör. Ön. Değ.'!A25=\"\",\"\",'Arş. Gör. Ön. Değ.'!A25)","v":13},{"$f":"IF('Arş. Gör. Ön. Değ.'!B25=\"\",\"\",LEFT('Arş. Gör. Ön. Değ.'!B25,3)&REPT(\"*\",4)&RIGHT('Arş. Gör. Ön. Değ.'!B25,2))","v":"111****11"},{"$f":"IF('Arş. Gör. Ön. Değ.'!C25=\"\",\"\",IF(ISERR(FIND(\" \",'Arş. Gör. Ön. Değ.'!C25))=TRUE,LEFT('Arş. Gör. Ön. Değ.'!C25,2)&REPT(\"*\",3),LEFT('Arş. Gör. Ön. Değ.'!C25,2)&REPT(\"*\",3)&\" \"&MID('Arş. Gör. Ön. Değ.'!C25,FIND(\" \",'Arş. Gör. Ön. Değ.'!C25)+1,2)&REPT(\"*\",3)))","v":"Ör***"},{"$f":"IF('Arş. Gör. Ön. Değ.'!D25=\"\",\"\",IF(ISERR(FIND(\" \",'Arş. Gör. Ön. Değ.'!D25))=TRUE,LEFT('Arş. Gör. Ön. Değ.'!D25,2)&REPT(\"*\",3),LEFT('Arş. Gör. Ön. Değ.'!D25,2)&REPT(\"*\",3)&\" \"&MID('Arş. Gör. Ön. Değ.'!D25,FIND(\" \",'Arş. Gör. Ön. Değ.'!D25)+1,2)&REPT(\"*\",3)))","v":"Ör***"},{"$f":"IF('Arş. Gör. Ön. Değ.'!E25=\"\",\"\",'Arş. Gör. Ön. Değ.'!E25)","v":70.505549999999999},{"$f":"IF('Arş. Gör. Ön. Değ.'!F25=\"\",\"\",'Arş. Gör. Ön. Değ.'!F25)","v":72.56},{"$f":"IF('Arş. Gör. Ön. Değ.'!G25=\"\",\"\",'Arş. Gör. Ön. Değ.'!G25)","v":"Mevcut"},{"$f":"IF('Arş. Gör. Ön. Değ.'!H25=\"\",\"\",'Arş. Gör. Ön. Değ.'!H25)","v":42.303329999999995},{"$f":"IF('Arş. Gör. Ön. Değ.'!I25=\"\",\"\",'Arş. Gör. Ön. Değ.'!I25)","v":29.024000000000001},{"$f":"IF('Arş. Gör. Ön. Değ.'!J25=\"\",\"\",'Arş. Gör. Ön. Değ.'!J25)","v":71.327329999999989},{"$f":"IF('Arş. Gör. Ön. Değ.'!K25=\"\",\"\",'Arş. Gör. Ön. Değ.'!K25)","v":"Yönetmelik Gereği Elendi *"}]
[{"$f":"IF('Arş. Gör. Ön. Değ.'!A26=\"\",\"\",'Arş. Gör. Ön. Değ.'!A26)","v":14},{"$f":"IF('Arş. Gör. Ön. Değ.'!B26=\"\",\"\",LEFT('Arş. Gör. Ön. Değ.'!B26,3)&REPT(\"*\",4)&RIGHT('Arş. Gör. Ön. Değ.'!B26,2))","v":"111****11"},{"$f":"IF('Arş. Gör. Ön. Değ.'!C26=\"\",\"\",IF(ISERR(FIND(\" \",'Arş. Gör. Ön. Değ.'!C26))=TRUE,LEFT('Arş. Gör. Ön. Değ.'!C26,2)&REPT(\"*\",3),LEFT('Arş. Gör. Ön. Değ.'!C26,2)&REPT(\"*\",3)&\" \"&MID('Arş. Gör. Ön. Değ.'!C26,FIND(\" \",'Arş. Gör. Ön. Değ.'!C26)+1,2)&REPT(\"*\",3)))","v":"Ör***"},{"$f":"IF('Arş. Gör. Ön. Değ.'!D26=\"\",\"\",IF(ISERR(FIND(\" \",'Arş. Gör. Ön. Değ.'!D26))=TRUE,LEFT('Arş. Gör. Ön. Değ.'!D26,2)&REPT(\"*\",3),LEFT('Arş. Gör. Ön. Değ.'!D26,2)&REPT(\"*\",3)&\" \"&MID('Arş. Gör. Ön. Değ.'!D26,FIND(\" \",'Arş. Gör. Ön. Değ.'!D26)+1,2)&REPT(\"*\",3)))","v":"Ör***"},{"$f":"IF('Arş. Gör. Ön. Değ.'!E26=\"\",\"\",'Arş. Gör. Ön. Değ.'!E26)","v":70.607429999999994},{"$f":"IF('Arş. Gör. Ön. Değ.'!F26=\"\",\"\",'Arş. Gör. Ön. Değ.'!F26)","v":72.03},{"$f":"IF('Arş. Gör. Ön. Değ.'!G26=\"\",\"\",'Arş. Gör. Ön. Değ.'!G26)","v":"Mevcut Değil"},{"$f":"IF('Arş. Gör. Ön. Değ.'!H26=\"\",\"\",'Arş. Gör. Ön. Değ.'!H26)","v":42.364457999999992},{"$f":"IF('Arş. Gör. Ön. Değ.'!I26=\"\",\"\",'Arş. Gör. Ön. Değ.'!I26)","v":28.812000000000001},{"$f":"IF('Arş. Gör. Ön. Değ.'!J26=\"\",\"\",'Arş. Gör. Ön. Değ.'!J26)","v":71.176457999999997},{"$f":"IF('Arş. Gör. Ön. Değ.'!K26=\"\",\"\",'Arş. Gör. Ön. Değ.'!K26)","v":"Başvuru Şartını Sağlamıyor (Talep Edilen alanda yüksek lisans/doktora yapıyor olduğunu gösterir belge yok)"}]
[{"$f":"IF('Arş. Gör. Ön. Değ.'!A27=\"\",\"\",'Arş. Gör. Ön. Değ.'!A27)","v":15},{"$f":"IF('Arş. Gör. Ön. Değ.'!B27=\"\",\"\",LEFT('Arş. Gör. Ön. Değ.'!B27,3)&REPT(\"*\",4)&RIGHT('Arş. Gör. Ön. Değ.'!B27,2))","v":"111****11"},{"$f":"IF('Arş. Gör. Ön. Değ.'!C27=\"\",\"\",IF(ISERR(FIND(\" \",'Arş. Gör. Ön. Değ.'!C27))=TRUE,LEFT('Arş. Gör. Ön. Değ.'!C27,2)&REPT(\"*\",3),LEFT('Arş. Gör. Ön. Değ.'!C27,2)&REPT(\"*\",3)&\" \"&MID('Arş. Gör. Ön. Değ.'!C27,FIND(\" \",'Arş. Gör. Ön. Değ.'!C27)+1,2)&REPT(\"*\",3)))","v":"Ör***"},{"$f":"IF('Arş. Gör. Ön. Değ.'!D27=\"\",\"\",IF(ISERR(FIND(\" \",'Arş. Gör. Ön. Değ.'!D27))=TRUE,LEFT('Arş. Gör. Ön. Değ.'!D27,2)&REPT(\"*\",3),LEFT('Arş. Gör. Ön. Değ.'!D27,2)&REPT(\"*\",3)&\" \"&MID('Arş. Gör. Ön. Değ.'!D27,FIND(\" \",'Arş. Gör. Ön. Değ.'!D27)+1,2)&REPT(\"*\",3)))","v":"Ör***"},{"$f":"IF('Arş. Gör. Ön. Değ.'!E27=\"\",\"\",'Arş. Gör. Ön. Değ.'!E27)","v":70.275630000000007},{"$f":"IF('Arş. Gör. Ön. Değ.'!F27=\"\",\"\",'Arş. Gör. Ön. Değ.'!F27)","v":71.53},{"$f":"IF('Arş. Gör. Ön. Değ.'!G27=\"\",\"\",'Arş. Gör. Ön. Değ.'!G27)","v":"Mevcut"},{"$f":"IF('Arş. Gör. Ön. Değ.'!H27=\"\",\"\",'Arş. Gör. Ön. Değ.'!H27)","v":42.165378000000004},{"$f":"IF('Arş. Gör. Ön. Değ.'!I27=\"\",\"\",'Arş. Gör. Ön. Değ.'!I27)","v":28.612000000000002},{"$f":"IF('Arş. Gör. Ön. Değ.'!J27=\"\",\"\",'Arş. Gör. Ön. Değ.'!J27)","v":70.777377999999999},{"$f":"IF('Arş. Gör. Ön. Değ.'!K27=\"\",\"\",'Arş. Gör. Ön. Değ.'!K27)","v":"Başvuru Şartını Sağlamıyor (35 yaşını doldurmuş-Arş. Gör.)"}]
[{"$f":"IF('Arş. Gör. Ön. Değ.'!A28=\"\",\"\",'Arş. Gör. Ön. Değ.'!A28)","v":16},{"$f":"IF('Arş. Gör. Ön. Değ.'!B28=\"\",\"\",LEFT('Arş. Gör. Ön. Değ.'!B28,3)&REPT(\"*\",4)&RIGHT('Arş. Gör. Ön. Değ.'!B28,2))","v":"111****11"},{"$f":"IF('Arş. Gör. Ön. Değ.'!C28=\"\",\"\",IF(ISERR(FIND(\" \",'Arş. Gör. Ön. Değ.'!C28))=TRUE,LEFT('Arş. Gör. Ön. Değ.'!C28,2)&REPT(\"*\",3),LEFT('Arş. Gör. Ön. Değ.'!C28,2)&REPT(\"*\",3)&\" \"&MID('Arş. Gör. Ön. Değ.'!C28,FIND(\" \",'Arş. Gör. Ön. Değ.'!C28)+1,2)&REPT(\"*\",3)))","v":"Ör***"},{"$f":"IF('Arş. Gör. Ön. Değ.'!D28=\"\",\"\",IF(ISERR(FIND(\" \",'Arş. Gör. Ön. Değ.'!D28))=TRUE,LEFT('Arş. Gör. Ön. Değ.'!D28,2)&REPT(\"*\",3),LEFT('Arş. Gör. Ön. Değ.'!D28,2)&REPT(\"*\",3)&\" \"&MID('Arş. Gör. Ön. Değ.'!D28,FIND(\" \",'Arş. Gör. Ön. Değ.'!D28)+1,2)&REPT(\"*\",3)))","v":"Ör***"},{"$f":"IF('Arş. Gör. Ön. Değ.'!E28=\"\",\"\",'Arş. Gör. Ön. Değ.'!E28)","v":68},{"$f":"IF('Arş. Gör. Ön. Değ.'!F28=\"\",\"\",'Arş. Gör. Ön. Değ.'!F28)","v":95},{"$f":"IF('Arş. Gör. Ön. Değ.'!G28=\"\",\"\",'Arş. Gör. Ön. Değ.'!G28)","v":"Mevcut"},{"$f":"IF('Arş. Gör. Ön. Değ.'!H28=\"\",\"\",'Arş. Gör. Ön. Değ.'!H28)","v":40.799999999999997},{"$f":"IF('Arş. Gör. Ön. Değ.'!I28=\"\",\"\",'Arş. Gör. Ön. Değ.'!I28)","v":38},{"$f":"IF('Arş. Gör. Ön. Değ.'!J28=\"\",\"\",'Arş. Gör. Ön. Değ.'!J28)","v":78.8},{"$f":"IF('Arş. Gör. Ön. Değ.'!K28=\"\",\"\",'Arş. Gör. Ön. Değ.'!K28)","v":"Başvuru Şartını Sağlamıyor (Ales puanı yetersiz)"}]
[{"$f":"IF('Arş. Gör. Ön. Değ.'!A29=\"\",\"\",'Arş. Gör. Ön. Değ.'!A29)","v":17},{"$f":"IF('Arş. Gör. Ön. Değ.'!B29=\"\",\"\",LEFT('Arş. Gör. Ön. Değ.'!B29,3)&REPT(\"*\",4)&RIGHT('Arş. Gör. Ön. Değ.'!B29,2))","v":"111****11"},{"$f":"IF('Arş. Gör. Ön. Değ.'!C29=\"\",\"\",IF(ISERR(FIND(\" \",'Arş. Gör. Ön. Değ.'!C29))=TRUE,LEFT('Arş. Gör. Ön. Değ.'!C29,2)&REPT(\"*\",3),LEFT('Arş. Gör. Ön. Değ.'!C29,2)&REPT(\"*\",3)&\" \"&MID('Arş. Gör. Ön. Değ.'!C29,FIND(\" \",'Arş. Gör. Ön. Değ.'!C29)+1,2)&REPT(\"*\",3)))","v":"Ör***"},{"$f":"IF('Arş. Gör. Ön. Değ.'!D29=\"\",\"\",IF(ISERR(FIND(\" \",'Arş. Gör. Ön. Değ.'!D29))=TRUE,LEFT('Arş. Gör. Ön. Değ.'!D29,2)&REPT(\"*\",3),LEFT('Arş. Gör. Ön. Değ.'!D29,2)&REPT(\"*\",3)&\" \"&MID('Arş. Gör. Ön. Değ.'!D29,FIND(\" \",'Arş. Gör. Ön. Değ.'!D29)+1,2)&REPT(\"*\",3)))","v":"Ör***"},{"$f":"IF('Arş. Gör. Ön. Değ.'!E29=\"\",\"\",'Arş. Gör. Ön. Değ.'!E29)","v":80},{"$f":"IF('Arş. Gör. Ön. Değ.'!F29=\"\",\"\",'Arş. Gör. Ön. Değ.'!F29)","v":75},{"$f":"IF('Arş. Gör. Ön. Değ.'!G29=\"\",\"\",'Arş. Gör. Ön. Değ.'!G29)","v":"Mevcut"},{"$f":"IF('Arş. Gör. Ön. Değ.'!H29=\"\",\"\",'Arş. Gör. Ön. Değ.'!H29)","v":48},{"$f":"IF('Arş. Gör. Ön. Değ.'!I29=\"\",\"\",'Arş. Gör. Ön. Değ.'!I29)","v":30},{"$f":"IF('Arş. Gör. Ön. Değ.'!J29=\"\",\"\",'Arş. Gör. Ön. Değ.'!J29)","v":78},{"$f":"IF('Arş. Gör. Ön. Değ.'!K29=\"\",\"\",'Arş. Gör. Ön. Değ.'!K29)","v":"Başvuru Şartını Sağlamıyor (Lisans Mezuniyet alanı ilanla uyumlu değil)"}]
[{"$f":"IF('Arş. Gör. Ön. Değ.'!A30=\"\",\"\",'Arş. Gör. Ön. Değ.'!A30)","v":18},{"$f":"IF('Arş. Gör. Ön. Değ.'!B30=\"\",\"\",LEFT('Arş. Gör. Ön. Değ.'!B30,3)&REPT(\"*\",4)&RIGHT('Arş. Gör. Ön. Değ.'!B30,2))","v":"111****11"},{"$f":"IF('Arş. Gör. Ön. Değ.'!C30=\"\",\"\",IF(ISERR(FIND(\" \",'Arş. Gör. Ön. Değ.'!C30))=TRUE,LEFT('Arş. Gör. Ön. Değ.'!C30,2)&REPT(\"*\",3),LEFT('Arş. Gör. Ön. Değ.'!C30,2)&REPT(\"*\",3)&\" \"&MID('Arş. Gör. Ön. Değ.'!C30,FIND(\" \",'Arş. Gör. Ön. Değ.'!C30)+1,2)&REPT(\"*\",3)))","v":"Ör***"},{"$f":"IF('Arş. Gör. Ön. Değ.'!D30=\"\",\"\",IF(ISERR(FIND(\" \",'Arş. Gör. Ön. Değ.'!D30))=TRUE,LEFT('Arş. Gör. Ön. Değ.'!D30,2)&REPT(\"*\",3),LEFT('Arş. Gör. Ön. Değ.'!D30,2)&REPT(\"*\",3)&\" \"&MID('Arş. Gör. Ön. Değ.'!D30,FIND(\" \",'Arş. Gör. Ön. Değ.'!D30)+1,2)&REPT(\"*\",3)))","v":"Ör***"},{"$f":"IF('Arş. Gör. Ön. Değ.'!E30=\"\",\"\",'Arş. Gör. Ön. Değ.'!E30)","v":80},{"$f":"IF('Arş. Gör. Ön. Değ.'!F30=\"\",\"\",'Arş. Gör. Ön. Değ.'!F30)","v":45},{"$f":"IF('Arş. Gör. Ön. Değ.'!G30=\"\",\"\",'Arş. Gör. Ön. Değ.'!G30)","v":"Uygun Değil"},{"$f":"IF('Arş. Gör. Ön. Değ.'!H30=\"\",\"\",'Arş. Gör. Ön. Değ.'!H30)","v":48},{"$f":"IF('Arş. Gör. Ön. Değ.'!I30=\"\",\"\",'Arş. Gör. Ön. Değ.'!I30)","v":18},{"$f":"IF('Arş. Gör. Ön. Değ.'!J30=\"\",\"\",'Arş. Gör. Ön. Değ.'!J30)","v":66},{"$f":"IF('Arş. Gör. Ön. Değ.'!K30=\"\",\"\",'Arş. Gör. Ön. Değ.'!K30)","v":"Başvuru Şartını Sağlamıyor (Yabancı Dil Puanı Yetersiz)"}]
[{"$f":"IF('Arş. Gör. Ön. Değ.'!A31=\"\",\"\",'Arş. Gör. Ön. Değ.'!A31)","v":""},{"$f":"IF('Arş. Gör. Ön. Değ.'!B31=\"\",\"\",LEFT('Arş. Gör. Ön. Değ.'!B31,3)&REPT(\"*\",4)&RIGHT('Arş. Gör. Ön. Değ.'!B31,2))","v":""},{"$f":"IF('Arş. Gör. Ön. Değ.'!C31=\"\",\"\",IF(ISERR(FIND(\" \",'Arş. Gör. Ön. Değ.'!C31))=TRUE,LEFT('Arş. Gör. Ön. Değ.'!C31,2)&REPT(\"*\",3),LEFT('Arş. Gör. Ön. Değ.'!C31,2)&REPT(\"*\",3)&\" \"&MID('Arş. Gör. Ön. Değ.'!C31,FIND(\" \",'Arş. Gör. Ön. Değ.'!C31)+1,2)&REPT(\"*\",3)))","v":""},{"$f":"IF('Arş. Gör. Ön. Değ.'!D31=\"\",\"\",IF(ISERR(FIND(\" \",'Arş. Gör. Ön. Değ.'!D31))=TRUE,LEFT('Arş. Gör. Ön. Değ.'!D31,2)&REPT(\"*\",3),LEFT('Arş. Gör. Ön. Değ.'!D31,2)&REPT(\"*\",3)&\" \"&MID('Arş. Gör. Ön. Değ.'!D31,FIND(\" \",'Arş. Gör. Ön. Değ.'!D31)+1,2)&REPT(\"*\",3)))","v":""},{"$f":"IF('Arş. Gör. Ön. Değ.'!E31=\"\",\"\",'Arş. Gör. Ön. Değ.'!E31)","v":""},{"$f":"IF('Arş. Gör. Ön. Değ.'!F31=\"\",\"\",'Arş. Gör. Ön. Değ.'!F31)","v":""},{"$f":"IF('Arş. Gör. Ön. Değ.'!G31=\"\",\"\",'Arş. Gör. Ön. Değ.'!G31)","v":""},{"$f":"IF('Arş. Gör. Ön. Değ.'!H31=\"\",\"\",'Arş. Gör. Ön. Değ.'!H31)","v":""},{"$f":"IF('Arş. Gör. Ön. Değ.'!I31=\"\",\"\",'Arş. Gör. Ön. Değ.'!I31)","v":""},{"$f":"IF('Arş. Gör. Ön. Değ.'!J31=\"\",\"\",'Arş. Gör. Ön. Değ.'!J31)","v":""},{"$f":"IF('Arş. Gör. Ön. Değ.'!K31=\"\",\"\",'Arş. Gör. Ön. Değ.'!K31)","v":""}]
[{"$f":"IF('Arş. Gör. Ön. Değ.'!A32=\"\",\"\",'Arş. Gör. Ön. Değ.'!A32)","v":""},{"$f":"IF('Arş. Gör. Ön. Değ.'!B32=\"\",\"\",LEFT('Arş. Gör. Ön. Değ.'!B32,3)&REPT(\"*\",4)&RIGHT('Arş. Gör. Ön. Değ.'!B32,2))","v":""},{"$f":"IF('Arş. Gör. Ön. Değ.'!C32=\"\",\"\",IF(ISERR(FIND(\" \",'Arş. Gör. Ön. Değ.'!C32))=TRUE,LEFT('Arş. Gör. Ön. Değ.'!C32,2)&REPT(\"*\",3),LEFT('Arş. Gör. Ön. Değ.'!C32,2)&REPT(\"*\",3)&\" \"&MID('Arş. Gör. Ön. Değ.'!C32,FIND(\" \",'Arş. Gör. Ön. Değ.'!C32)+1,2)&REPT(\"*\",3)))","v":""},{"$f":"IF('Arş. Gör. Ön. Değ.'!D32=\"\",\"\",IF(ISERR(FIND(\" \",'Arş. Gör. Ön. Değ.'!D32))=TRUE,LEFT('Arş. Gör. Ön. Değ.'!D32,2)&REPT(\"*\",3),LEFT('Arş. Gör. Ön. Değ.'!D32,2)&REPT(\"*\",3)&\" \"&MID('Arş. Gör. Ön. Değ.'!D32,FIND(\" \",'Arş. Gör. Ön. Değ.'!D32)+1,2)&REPT(\"*\",3)))","v":""},{"$f":"IF('Arş. Gör. Ön. Değ.'!E32=\"\",\"\",'Arş. Gör. Ön. Değ.'!E32)","v":""},{"$f":"IF('Arş. Gör. Ön. Değ.'!F32=\"\",\"\",'Arş. Gör. Ön. Değ.'!F32)","v":""},{"$f":"IF('Arş. Gör. Ön. Değ.'!G32=\"\",\"\",'Arş. Gör. Ön. Değ.'!G32)","v":""},{"$f":"IF('Arş. Gör. Ön. Değ.'!H32=\"\",\"\",'Arş. Gör. Ön. Değ.'!H32)","v":""},{"$f":"IF('Arş. Gör. Ön. Değ.'!I32=\"\",\"\",'Arş. Gör. Ön. Değ.'!I32)","v":""},{"$f":"IF('Arş. Gör. Ön. Değ.'!J32=\"\",\"\",'Arş. Gör. Ön. Değ.'!J32)","v":""},{"$f":"IF('Arş. Gör. Ön. Değ.'!K32=\"\",\"\",'Arş. Gör. Ön. Değ.'!K32)","v":""}]
[{"$f":"IF('Arş. Gör. Ön. Değ.'!A33=\"\",\"\",'Arş. Gör. Ön. Değ.'!A33)","v":""},{"$f":"IF('Arş. Gör. Ön. Değ.'!B33=\"\",\"\",LEFT('Arş. Gör. Ön. Değ.'!B33,3)&REPT(\"*\",4)&RIGHT('Arş. Gör. Ön. Değ.'!B33,2))","v":""},{"$f":"IF('Arş. Gör. Ön. Değ.'!C33=\"\",\"\",IF(ISERR(FIND(\" \",'Arş. Gör. Ön. Değ.'!C33))=TRUE,LEFT('Arş. Gör. Ön. Değ.'!C33,2)&REPT(\"*\",3),LEFT('Arş. Gör. Ön. Değ.'!C33,2)&REPT(\"*\",3)&\" \"&MID('Arş. Gör. Ön. Değ.'!C33,FIND(\" \",'Arş. Gör. Ön. Değ.'!C33)+1,2)&REPT(\"*\",3)))","v":""},{"$f":"IF('Arş. Gör. Ön. Değ.'!D33=\"\",\"\",IF(ISERR(FIND(\" \",'Arş. Gör. Ön. Değ.'!D33))=TRUE,LEFT('Arş. Gör. Ön. Değ.'!D33,2)&REPT(\"*\",3),LEFT('Arş. Gör. Ön. Değ.'!D33,2)&REPT(\"*\",3)&\" \"&MID('Arş. Gör. Ön. Değ.'!D33,FIND(\" \",'Arş. Gör. Ön. Değ.'!D33)+1,2)&REPT(\"*\",3)))","v":""},{"$f":"IF('Arş. Gör. Ön. Değ.'!E33=\"\",\"\",'Arş. Gör. Ön. Değ.'!E33)","v":""},{"$f":"IF('Arş. Gör. Ön. Değ.'!F33=\"\",\"\",'Arş. Gör. Ön. Değ.'!F33)","v":""},{"$f":"IF('Arş. Gör. Ön. Değ.'!G33=\"\",\"\",'Arş. Gör. Ön. Değ.'!G33)","v":""},{"$f":"IF('Arş. Gör. Ön. Değ.'!H33=\"\",\"\",'Arş. Gör. Ön. Değ.'!H33)","v":""},{"$f":"IF('Arş. Gör. Ön. Değ.'!I33=\"\",\"\",'Arş. Gör. Ön. Değ.'!I33)","v":""},{"$f":"IF('Arş. Gör. Ön. Değ.'!J33=\"\",\"\",'Arş. Gör. Ön. Değ.'!J33)","v":""},{"$f":"IF('Arş. Gör. Ön. Değ.'!K33=\"\",\"\",'Arş. Gör. Ön. Değ.'!K33)","v":""}]
[{"$f":"IF('Arş. Gör. Ön. Değ.'!A34=\"\",\"\",'Arş. Gör. Ön. Değ.'!A34)","v":""},{"$f":"IF('Arş. Gör. Ön. Değ.'!B34=\"\",\"\",LEFT('Arş. Gör. Ön. Değ.'!B34,3)&REPT(\"*\",4)&RIGHT('Arş. Gör. Ön. Değ.'!B34,2))","v":""},{"$f":"IF('Arş. Gör. Ön. Değ.'!C34=\"\",\"\",IF(ISERR(FIND(\" \",'Arş. Gör. Ön. Değ.'!C34))=TRUE,LEFT('Arş. Gör. Ön. Değ.'!C34,2)&REPT(\"*\",3),LEFT('Arş. Gör. Ön. Değ.'!C34,2)&REPT(\"*\",3)&\" \"&MID('Arş. Gör. Ön. Değ.'!C34,FIND(\" \",'Arş. Gör. Ön. Değ.'!C34)+1,2)&REPT(\"*\",3)))","v":""},{"$f":"IF('Arş. Gör. Ön. Değ.'!D34=\"\",\"\",IF(ISERR(FIND(\" \",'Arş. Gör. Ön. Değ.'!D34))=TRUE,LEFT('Arş. Gör. Ön. Değ.'!D34,2)&REPT(\"*\",3),LEFT('Arş. Gör. Ön. Değ.'!D34,2)&REPT(\"*\",3)&\" \"&MID('Arş. Gör. Ön. Değ.'!D34,FIND(\" \",'Arş. Gör. Ön. Değ.'!D34)+1,2)&REPT(\"*\",3)))","v":""},{"$f":"IF('Arş. Gör. Ön. Değ.'!E34=\"\",\"\",'Arş. Gör. Ön. Değ.'!E34)","v":""},{"$f":"IF('Arş. Gör. Ön. Değ.'!F34=\"\",\"\",'Arş. Gör. Ön. Değ.'!F34)","v":""},{"$f":"IF('Arş. Gör. Ön. Değ.'!G34=\"\",\"\",'Arş. Gör. Ön. Değ.'!G34)","v":""},{"$f":"IF('Arş. Gör. Ön. Değ.'!H34=\"\",\"\",'Arş. Gör. Ön. Değ.'!H34)","v":""},{"$f":"IF('Arş. Gör. Ön. Değ.'!I34=\"\",\"\",'Arş. Gör. Ön. Değ.'!I34)","v":""},{"$f":"IF('Arş. Gör. Ön. Değ.'!J34=\"\",\"\",'Arş. Gör. Ön. Değ.'!J34)","v":""},{"$f":"IF('Arş. Gör. Ön. Değ.'!K34=\"\",\"\",'Arş. Gör. Ön. Değ.'!K34)","v":""}]
[{"$f":"IF('Arş. Gör. Ön. Değ.'!A35=\"\",\"\",'Arş. Gör. Ön. Değ.'!A35)","v":""},{"$f":"IF('Arş. Gör. Ön. Değ.'!B35=\"\",\"\",LEFT('Arş. Gör. Ön. Değ.'!B35,3)&REPT(\"*\",4)&RIGHT('Arş. Gör. Ön. Değ.'!B35,2))","v":""},{"$f":"IF('Arş. Gör. Ön. Değ.'!C35=\"\",\"\",IF(ISERR(FIND(\" \",'Arş. Gör. Ön. Değ.'!C35))=TRUE,LEFT('Arş. Gör. Ön. Değ.'!C35,2)&REPT(\"*\",3),LEFT('Arş. Gör. Ön. Değ.'!C35,2)&REPT(\"*\",3)&\" \"&MID('Arş. Gör. Ön. Değ.'!C35,FIND(\" \",'Arş. Gör. Ön. Değ.'!C35)+1,2)&REPT(\"*\",3)))","v":""},{"$f":"IF('Arş. Gör. Ön. Değ.'!D35=\"\",\"\",IF(ISERR(FIND(\" \",'Arş. Gör. Ön. Değ.'!D35))=TRUE,LEFT('Arş. Gör. Ön. Değ.'!D35,2)&REPT(\"*\",3),LEFT('Arş. Gör. Ön. Değ.'!D35,2)&REPT(\"*\",3)&\" \"&MID('Arş. Gör. Ön. Değ.'!D35,FIND(\" \",'Arş. Gör. Ön. Değ.'!D35)+1,2)&REPT(\"*\",3)))","v":""},{"$f":"IF('Arş. Gör. Ön. Değ.'!E35=\"\",\"\",'Arş. Gör. Ön. Değ.'!E35)","v":""},{"$f":"IF('Arş. Gör. Ön. Değ.'!F35=\"\",\"\",'Arş. Gör. Ön. Değ.'!F35)","v":""},{"$f":"IF('Arş. Gör. Ön. Değ.'!G35=\"\",\"\",'Arş. Gör. Ön. Değ.'!G35)","v":""},{"$f":"IF('Arş. Gör. Ön. Değ.'!H35=\"\",\"\",'Arş. Gör. Ön. Değ.'!H35)","v":""},{"$f":"IF('Arş. Gör. Ön. Değ.'!I35=\"\",\"\",'Arş. Gör. Ön. Değ.'!I35)","v":""},{"$f":"IF('Arş. Gör. Ön. Değ.'!J35=\"\",\"\",'Arş. Gör. Ön. Değ.'!J35)","v":""},{"$f":"IF('Arş. Gör. Ön. Değ.'!K35=\"\",\"\",'Arş. Gör. Ön. Değ.'!K35)","v":""}]
[{"$f":"IF('Arş. Gör. Ön. Değ.'!A36=\"\",\"\",'Arş. Gör. Ön. Değ.'!A36)","v":""},{"$f":"IF('Arş. Gör. Ön. Değ.'!B36=\"\",\"\",LEFT('Arş. Gör. Ön. Değ.'!B36,3)&REPT(\"*\",4)&RIGHT('Arş. Gör. Ön. Değ.'!B36,2))","v":""},{"$f":"IF('Arş. Gör. Ön. Değ.'!C36=\"\",\"\",IF(ISERR(FIND(\" \",'Arş. Gör. Ön. Değ.'!C36))=TRUE,LEFT('Arş. Gör. Ön. Değ.'!C36,2)&REPT(\"*\",3),LEFT('Arş. Gör. Ön. Değ.'!C36,2)&REPT(\"*\",3)&\" \"&MID('Arş. Gör. Ön. Değ.'!C36,FIND(\" \",'Arş. Gör. Ön. Değ.'!C36)+1,2)&REPT(\"*\",3)))","v":""},{"$f":"IF('Arş. Gör. Ön. Değ.'!D36=\"\",\"\",IF(ISERR(FIND(\" \",'Arş. Gör. Ön. Değ.'!D36))=TRUE,LEFT('Arş. Gör. Ön. Değ.'!D36,2)&REPT(\"*\",3),LEFT('Arş. Gör. Ön. Değ.'!D36,2)&REPT(\"*\",3)&\" \"&MID('Arş. Gör. Ön. Değ.'!D36,FIND(\" \",'Arş. Gör. Ön. Değ.'!D36)+1,2)&REPT(\"*\",3)))","v":""},{"$f":"IF('Arş. Gör. Ön. Değ.'!E36=\"\",\"\",'Arş. Gör. Ön. Değ.'!E36)","v":""},{"$f":"IF('Arş. Gör. Ön. Değ.'!F36=\"\",\"\",'Arş. Gör. Ön. Değ.'!F36)","v":""},{"$f":"IF('Arş. Gör. Ön. Değ.'!G36=\"\",\"\",'Arş. Gör. Ön. Değ.'!G36)","v":""},{"$f":"IF('Arş. Gör. Ön. Değ.'!H36=\"\",\"\",'Arş. Gör. Ön. Değ.'!H36)","v":""},{"$f":"IF('Arş. Gör. Ön. Değ.'!I36=\"\",\"\",'Arş. Gör. Ön. Değ.'!I36)","v":""},{"$f":"IF('Arş. Gör. Ön. Değ.'!J36=\"\",\"\",'Arş. Gör. Ön. Değ.'!J36)","v":""},{"$f":"IF('Arş. Gör. Ön. Değ.'!K36=\"\",\"\",'Arş. Gör. Ön. Değ.'!K36)","v":""}]
[{"$f":"IF('Arş. Gör. Ön. Değ.'!A37=\"\",\"\",'Arş. Gör. Ön. Değ.'!A37)","v":""},{"$f":"IF('Arş. Gör. Ön. Değ.'!B37=\"\",\"\",LEFT('Arş. Gör. Ön. Değ.'!B37,3)&REPT(\"*\",4)&RIGHT('Arş. Gör. Ön. Değ.'!B37,2))","v":""},{"$f":"IF('Arş. Gör. Ön. Değ.'!C37=\"\",\"\",IF(ISERR(FIND(\" \",'Arş. Gör. Ön. Değ.'!C37))=TRUE,LEFT('Arş. Gör. Ön. Değ.'!C37,2)&REPT(\"*\",3),LEFT('Arş. Gör. Ön. Değ.'!C37,2)&REPT(\"*\",3)&\" \"&MID('Arş. Gör. Ön. Değ.'!C37,FIND(\" \",'Arş. Gör. Ön. Değ.'!C37)+1,2)&REPT(\"*\",3)))","v":""},{"$f":"IF('Arş. Gör. Ön. Değ.'!D37=\"\",\"\",IF(ISERR(FIND(\" \",'Arş. Gör. Ön. Değ.'!D37))=TRUE,LEFT('Arş. Gör. Ön. Değ.'!D37,2)&REPT(\"*\",3),LEFT('Arş. Gör. Ön. Değ.'!D37,2)&REPT(\"*\",3)&\" \"&MID('Arş. Gör. Ön. Değ.'!D37,FIND(\" \",'Arş. Gör. Ön. Değ.'!D37)+1,2)&REPT(\"*\",3)))","v":""},{"$f":"IF('Arş. Gör. Ön. Değ.'!E37=\"\",\"\",'Arş. Gör. Ön. Değ.'!E37)","v":""},{"$f":"IF('Arş. Gör. Ön. Değ.'!F37=\"\",\"\",'Arş. Gör. Ön. Değ.'!F37)","v":""},{"$f":"IF('Arş. Gör. Ön. Değ.'!G37=\"\",\"\",'Arş. Gör. Ön. Değ.'!G37)","v":""},{"$f":"IF('Arş. Gör. Ön. Değ.'!H37=\"\",\"\",'Arş. Gör. Ön. Değ.'!H37)","v":""},{"$f":"IF('Arş. Gör. Ön. Değ.'!I37=\"\",\"\",'Arş. Gör. Ön. Değ.'!I37)","v":""},{"$f":"IF('Arş. Gör. Ön. Değ.'!J37=\"\",\"\",'Arş. Gör. Ön. Değ.'!J37)","v":""},{"$f":"IF('Arş. Gör. Ön. Değ.'!K37=\"\",\"\",'Arş. Gör. Ön. Değ.'!K37)","v":""}]
[{"$f":"IF('Arş. Gör. Ön. Değ.'!A38=\"\",\"\",'Arş. Gör. Ön. Değ.'!A38)","v":""},{"$f":"IF('Arş. Gör. Ön. Değ.'!B38=\"\",\"\",LEFT('Arş. Gör. Ön. Değ.'!B38,3)&REPT(\"*\",4)&RIGHT('Arş. Gör. Ön. Değ.'!B38,2))","v":""},{"$f":"IF('Arş. Gör. Ön. Değ.'!C38=\"\",\"\",IF(ISERR(FIND(\" \",'Arş. Gör. Ön. Değ.'!C38))=TRUE,LEFT('Arş. Gör. Ön. Değ.'!C38,2)&REPT(\"*\",3),LEFT('Arş. Gör. Ön. Değ.'!C38,2)&REPT(\"*\",3)&\" \"&MID('Arş. Gör. Ön. Değ.'!C38,FIND(\" \",'Arş. Gör. Ön. Değ.'!C38)+1,2)&REPT(\"*\",3)))","v":""},{"$f":"IF('Arş. Gör. Ön. Değ.'!D38=\"\",\"\",IF(ISERR(FIND(\" \",'Arş. Gör. Ön. Değ.'!D38))=TRUE,LEFT('Arş. Gör. Ön. Değ.'!D38,2)&REPT(\"*\",3),LEFT('Arş. Gör. Ön. Değ.'!D38,2)&REPT(\"*\",3)&\" \"&MID('Arş. Gör. Ön. Değ.'!D38,FIND(\" \",'Arş. Gör. Ön. Değ.'!D38)+1,2)&REPT(\"*\",3)))","v":""},{"$f":"IF('Arş. Gör. Ön. Değ.'!E38=\"\",\"\",'Arş. Gör. Ön. Değ.'!E38)","v":""},{"$f":"IF('Arş. Gör. Ön. Değ.'!F38=\"\",\"\",'Arş. Gör. Ön. Değ.'!F38)","v":""},{"$f":"IF('Arş. Gör. Ön. Değ.'!G38=\"\",\"\",'Arş. Gör. Ön. Değ.'!G38)","v":""},{"$f":"IF('Arş. Gör. Ön. Değ.'!H38=\"\",\"\",'Arş. Gör. Ön. Değ.'!H38)","v":""},{"$f":"IF('Arş. Gör. Ön. Değ.'!I38=\"\",\"\",'Arş. Gör. Ön. Değ.'!I38)","v":""},{"$f":"IF('Arş. Gör. Ön. Değ.'!J38=\"\",\"\",'Arş. Gör. Ön. Değ.'!J38)","v":""},{"$f":"IF('Arş. Gör. Ön. Değ.'!K38=\"\",\"\",'Arş. Gör. Ön. Değ.'!K38)","v":""}]
[{"$f":"IF('Arş. Gör. Ön. Değ.'!A39=\"\",\"\",'Arş. Gör. Ön. Değ.'!A39)","v":""},{"$f":"IF('Arş. Gör. Ön. Değ.'!B39=\"\",\"\",LEFT('Arş. Gör. Ön. Değ.'!B39,3)&REPT(\"*\",4)&RIGHT('Arş. Gör. Ön. Değ.'!B39,2))","v":""},{"$f":"IF('Arş. Gör. Ön. Değ.'!C39=\"\",\"\",IF(ISERR(FIND(\" \",'Arş. Gör. Ön. Değ.'!C39))=TRUE,LEFT('Arş. Gör. Ön. Değ.'!C39,2)&REPT(\"*\",3),LEFT('Arş. Gör. Ön. Değ.'!C39,2)&REPT(\"*\",3)&\" \"&MID('Arş. Gör. Ön. Değ.'!C39,FIND(\" \",'Arş. Gör. Ön. Değ.'!C39)+1,2)&REPT(\"*\",3)))","v":""},{"$f":"IF('Arş. Gör. Ön. Değ.'!D39=\"\",\"\",IF(ISERR(FIND(\" \",'Arş. Gör. Ön. Değ.'!D39))=TRUE,LEFT('Arş. Gör. Ön. Değ.'!D39,2)&REPT(\"*\",3),LEFT('Arş. Gör. Ön. Değ.'!D39,2)&REPT(\"*\",3)&\" \"&MID('Arş. Gör. Ön. Değ.'!D39,FIND(\" \",'Arş. Gör. Ön. Değ.'!D39)+1,2)&REPT(\"*\",3)))","v":""},{"$f":"IF('Arş. Gör. Ön. Değ.'!E39=\"\",\"\",'Arş. Gör. Ön. Değ.'!E39)","v":""},{"$f":"IF('Arş. Gör. Ön. Değ.'!F39=\"\",\"\",'Arş. Gör. Ön. Değ.'!F39)","v":""},{"$f":"IF('Arş. Gör. Ön. Değ.'!G39=\"\",\"\",'Arş. Gör. Ön. Değ.'!G39)","v":""},{"$f":"IF('Arş. Gör. Ön. Değ.'!H39=\"\",\"\",'Arş. Gör. Ön. Değ.'!H39)","v":""},{"$f":"IF('Arş. Gör. Ön. Değ.'!I39=\"\",\"\",'Arş. Gör. Ön. Değ.'!I39)","v":""},{"$f":"IF('Arş. Gör. Ön. Değ.'!J39=\"\",\"\",'Arş. Gör. Ön. Değ.'!J39)","v":""},{"$f":"IF('Arş. Gör. Ön. Değ.'!K39=\"\",\"\",'Arş. Gör. Ön. Değ.'!K39)","v":""}]
[{"$f":"IF('Arş. Gör. Ön. Değ.'!A40=\"\",\"\",'Arş. Gör. Ön. Değ.'!A40)","v":""},{"$f":"IF('Arş. Gör. Ön. Değ.'!B40=\"\",\"\",LEFT('Arş. Gör. Ön. Değ.'!B40,3)&REPT(\"*\",4)&RIGHT('Arş. Gör. Ön. Değ.'!B40,2))","v":""},{"$f":"IF('Arş. Gör. Ön. Değ.'!C40=\"\",\"\",IF(ISERR(FIND(\" \",'Arş. Gör. Ön. Değ.'!C40))=TRUE,LEFT('Arş. Gör. Ön. Değ.'!C40,2)&REPT(\"*\",3),LEFT('Arş. Gör. Ön. Değ.'!C40,2)&REPT(\"*\",3)&\" \"&MID('Arş. Gör. Ön. Değ.'!C40,FIND(\" \",'Arş. Gör. Ön. Değ.'!C40)+1,2)&REPT(\"*\",3)))","v":""},{"$f":"IF('Arş. Gör. Ön. Değ.'!D40=\"\",\"\",IF(ISERR(FIND(\" \",'Arş. Gör. Ön. Değ.'!D40))=TRUE,LEFT('Arş. Gör. Ön. Değ.'!D40,2)&REPT(\"*\",3),LEFT('Arş. Gör. Ön. Değ.'!D40,2)&REPT(\"*\",3)&\" \"&MID('Arş. Gör. Ön. Değ.'!D40,FIND(\" \",'Arş. Gör. Ön. Değ.'!D40)+1,2)&REPT(\"*\",3)))","v":""},{"$f":"IF('Arş. Gör. Ön. Değ.'!E40=\"\",\"\",'Arş. Gör. Ön. Değ.'!E40)","v":""},{"$f":"IF('Arş. Gör. Ön. Değ.'!F40=\"\",\"\",'Arş. Gör. Ön. Değ.'!F40)","v":""},{"$f":"IF('Arş. Gör. Ön. Değ.'!G40=\"\",\"\",'Arş. Gör. Ön. Değ.'!G40)","v":""},{"$f":"IF('Arş. Gör. Ön. Değ.'!H40=\"\",\"\",'Arş. Gör. Ön. Değ.'!H40)","v":""},{"$f":"IF('Arş. Gör. Ön. Değ.'!I40=\"\",\"\",'Arş. Gör. Ön. Değ.'!I40)","v":""},{"$f":"IF('Arş. Gör. Ön. Değ.'!J40=\"\",\"\",'Arş. Gör. Ön. Değ.'!J40)","v":""},{"$f":"IF('Arş. Gör. Ön. Değ.'!K40=\"\",\"\",'Arş. Gör. Ön. Değ.'!K40)","v":""}]
[{"$f":"IF('Arş. Gör. Ön. Değ.'!A41=\"\",\"\",'Arş. Gör. Ön. Değ.'!A41)","v":""},{"$f":"IF('Arş. Gör. Ön. Değ.'!B41=\"\",\"\",LEFT('Arş. Gör. Ön. Değ.'!B41,3)&REPT(\"*\",4)&RIGHT('Arş. Gör. Ön. Değ.'!B41,2))","v":""},{"$f":"IF('Arş. Gör. Ön. Değ.'!C41=\"\",\"\",IF(ISERR(FIND(\" \",'Arş. Gör. Ön. Değ.'!C41))=TRUE,LEFT('Arş. Gör. Ön. Değ.'!C41,2)&REPT(\"*\",3),LEFT('Arş. Gör. Ön. Değ.'!C41,2)&REPT(\"*\",3)&\" \"&MID('Arş. Gör. Ön. Değ.'!C41,FIND(\" \",'Arş. Gör. Ön. Değ.'!C41)+1,2)&REPT(\"*\",3)))","v":""},{"$f":"IF('Arş. Gör. Ön. Değ.'!D41=\"\",\"\",IF(ISERR(FIND(\" \",'Arş. Gör. Ön. Değ.'!D41))=TRUE,LEFT('Arş. Gör. Ön. Değ.'!D41,2)&REPT(\"*\",3),LEFT('Arş. Gör. Ön. Değ.'!D41,2)&REPT(\"*\",3)&\" \"&MID('Arş. Gör. Ön. Değ.'!D41,FIND(\" \",'Arş. Gör. Ön. Değ.'!D41)+1,2)&REPT(\"*\",3)))","v":""},{"$f":"IF('Arş. Gör. Ön. Değ.'!E41=\"\",\"\",'Arş. Gör. Ön. Değ.'!E41)","v":""},{"$f":"IF('Arş. Gör. Ön. Değ.'!F41=\"\",\"\",'Arş. Gör. Ön. Değ.'!F41)","v":""},{"$f":"IF('Arş. Gör. Ön. Değ.'!G41=\"\",\"\",'Arş. Gör. Ön. Değ.'!G41)","v":""},{"$f":"IF('Arş. Gör. Ön. Değ.'!H41=\"\",\"\",'Arş. Gör. Ön. Değ.'!H41)","v":""},{"$f":"IF('Arş. Gör. Ön. Değ.'!I41=\"\",\"\",'Arş. Gör. Ön. Değ.'!I41)","v":""},{"$f":"IF('Arş. Gör. Ön. Değ.'!J41=\"\",\"\",'Arş. Gör. Ön. Değ.'!J41)","v":""},{"$f":"IF('Arş. Gör. Ön. Değ.'!K41=\"\",\"\",'Arş. Gör. Ön. Değ.'!K41)","v":""}]
[{"$f":"IF('Arş. Gör. Ön. Değ.'!A42=\"\",\"\",'Arş. Gör. Ön. Değ.'!A42)","v":""},{"$f":"IF('Arş. Gör. Ön. Değ.'!B42=\"\",\"\",LEFT('Arş. Gör. Ön. Değ.'!B42,3)&REPT(\"*\",4)&RIGHT('Arş. Gör. Ön. Değ.'!B42,2))","v":""},{"$f":"IF('Arş. Gör. Ön. Değ.'!C42=\"\",\"\",IF(ISERR(FIND(\" \",'Arş. Gör. Ön. Değ.'!C42))=TRUE,LEFT('Arş. Gör. Ön. Değ.'!C42,2)&REPT(\"*\",3),LEFT('Arş. Gör. Ön. Değ.'!C42,2)&REPT(\"*\",3)&\" \"&MID('Arş. Gör. Ön. Değ.'!C42,FIND(\" \",'Arş. Gör. Ön. Değ.'!C42)+1,2)&REPT(\"*\",3)))","v":""},{"$f":"IF('Arş. Gör. Ön. Değ.'!D42=\"\",\"\",IF(ISERR(FIND(\" \",'Arş. Gör. Ön. Değ.'!D42))=TRUE,LEFT('Arş. Gör. Ön. Değ.'!D42,2)&REPT(\"*\",3),LEFT('Arş. Gör. Ön. Değ.'!D42,2)&REPT(\"*\",3)&\" \"&MID('Arş. Gör. Ön. Değ.'!D42,FIND(\" \",'Arş. Gör. Ön. Değ.'!D42)+1,2)&REPT(\"*\",3)))","v":""},{"$f":"IF('Arş. Gör. Ön. Değ.'!E42=\"\",\"\",'Arş. Gör. Ön. Değ.'!E42)","v":""},{"$f":"IF('Arş. Gör. Ön. Değ.'!F42=\"\",\"\",'Arş. Gör. Ön. Değ.'!F42)","v":""},{"$f":"IF('Arş. Gör. Ön. Değ.'!G42=\"\",\"\",'Arş. Gör. Ön. Değ.'!G42)","v":""},{"$f":"IF('Arş. Gör. Ön. Değ.'!H42=\"\",\"\",'Arş. Gör. Ön. Değ.'!H42)","v":""},{"$f":"IF('Arş. Gör. Ön. Değ.'!I42=\"\",\"\",'Arş. Gör. Ön. Değ.'!I42)","v":""},{"$f":"IF('Arş. Gör. Ön. Değ.'!J42=\"\",\"\",'Arş. Gör. Ön. Değ.'!J42)","v":""},{"$f":"IF('Arş. Gör. Ön. Değ.'!K42=\"\",\"\",'Arş. Gör. Ön. Değ.'!K42)","v":""}]
[{"$f":"IF('Arş. Gör. Ön. Değ.'!A43=\"\",\"\",'Arş. Gör. Ön. Değ.'!A43)","v":""},{"$f":"IF('Arş. Gör. Ön. Değ.'!B43=\"\",\"\",LEFT('Arş. Gör. Ön. Değ.'!B43,3)&REPT(\"*\",4)&RIGHT('Arş. Gör. Ön. Değ.'!B43,2))","v":""},{"$f":"IF('Arş. Gör. Ön. Değ.'!C43=\"\",\"\",IF(ISERR(FIND(\" \",'Arş. Gör. Ön. Değ.'!C43))=TRUE,LEFT('Arş. Gör. Ön. Değ.'!C43,2)&REPT(\"*\",3),LEFT('Arş. Gör. Ön. Değ.'!C43,2)&REPT(\"*\",3)&\" \"&MID('Arş. Gör. Ön. Değ.'!C43,FIND(\" \",'Arş. Gör. Ön. Değ.'!C43)+1,2)&REPT(\"*\",3)))","v":""},{"$f":"IF('Arş. Gör. Ön. Değ.'!D43=\"\",\"\",IF(ISERR(FIND(\" \",'Arş. Gör. Ön. Değ.'!D43))=TRUE,LEFT('Arş. Gör. Ön. Değ.'!D43,2)&REPT(\"*\",3),LEFT('Arş. Gör. Ön. Değ.'!D43,2)&REPT(\"*\",3)&\" \"&MID('Arş. Gör. Ön. Değ.'!D43,FIND(\" \",'Arş. Gör. Ön. Değ.'!D43)+1,2)&REPT(\"*\",3)))","v":""},{"$f":"IF('Arş. Gör. Ön. Değ.'!E43=\"\",\"\",'Arş. Gör. Ön. Değ.'!E43)","v":""},{"$f":"IF('Arş. Gör. Ön. Değ.'!F43=\"\",\"\",'Arş. Gör. Ön. Değ.'!F43)","v":""},{"$f":"IF('Arş. Gör. Ön. Değ.'!G43=\"\",\"\",'Arş. Gör. Ön. Değ.'!G43)","v":""},{"$f":"IF('Arş. Gör. Ön. Değ.'!H43=\"\",\"\",'Arş. Gör. Ön. Değ.'!H43)","v":""},{"$f":"IF('Arş. Gör. Ön. Değ.'!I43=\"\",\"\",'Arş. Gör. Ön. Değ.'!I43)","v":""},{"$f":"IF('Arş. Gör. Ön. Değ.'!J43=\"\",\"\",'Arş. Gör. Ön. Değ.'!J43)","v":""},{"$f":"IF('Arş. Gör. Ön. Değ.'!K43=\"\",\"\",'Arş. Gör. Ön. Değ.'!K43)","v":""}]
[{"$f":"IF('Arş. Gör. Ön. Değ.'!A44=\"\",\"\",'Arş. Gör. Ön. Değ.'!A44)","v":""},{"$f":"IF('Arş. Gör. Ön. Değ.'!B44=\"\",\"\",LEFT('Arş. Gör. Ön. Değ.'!B44,3)&REPT(\"*\",4)&RIGHT('Arş. Gör. Ön. Değ.'!B44,2))","v":""},{"$f":"IF('Arş. Gör. Ön. Değ.'!C44=\"\",\"\",IF(ISERR(FIND(\" \",'Arş. Gör. Ön. Değ.'!C44))=TRUE,LEFT('Arş. Gör. Ön. Değ.'!C44,2)&REPT(\"*\",3),LEFT('Arş. Gör. Ön. Değ.'!C44,2)&REPT(\"*\",3)&\" \"&MID('Arş. Gör. Ön. Değ.'!C44,FIND(\" \",'Arş. Gör. Ön. Değ.'!C44)+1,2)&REPT(\"*\",3)))","v":""},{"$f":"IF('Arş. Gör. Ön. Değ.'!D44=\"\",\"\",IF(ISERR(FIND(\" \",'Arş. Gör. Ön. Değ.'!D44))=TRUE,LEFT('Arş. Gör. Ön. Değ.'!D44,2)&REPT(\"*\",3),LEFT('Arş. Gör. Ön. Değ.'!D44,2)&REPT(\"*\",3)&\" \"&MID('Arş. Gör. Ön. Değ.'!D44,FIND(\" \",'Arş. Gör. Ön. Değ.'!D44)+1,2)&REPT(\"*\",3)))","v":""},{"$f":"IF('Arş. Gör. Ön. Değ.'!E44=\"\",\"\",'Arş. Gör. Ön. Değ.'!E44)","v":""},{"$f":"IF('Arş. Gör. Ön. Değ.'!F44=\"\",\"\",'Arş. Gör. Ön. Değ.'!F44)","v":""},{"$f":"IF('Arş. Gör. Ön. Değ.'!G44=\"\",\"\",'Arş. Gör. Ön. Değ.'!G44)","v":""},{"$f":"IF('Arş. Gör. Ön. Değ.'!H44=\"\",\"\",'Arş. Gör. Ön. Değ.'!H44)","v":""},{"$f":"IF('Arş. Gör. Ön. Değ.'!I44=\"\",\"\",'Arş. Gör. Ön. Değ.'!I44)","v":""},{"$f":"IF('Arş. Gör. Ön. Değ.'!J44=\"\",\"\",'Arş. Gör. Ön. Değ.'!J44)","v":""},{"$f":"IF('Arş. Gör. Ön. Değ.'!K44=\"\",\"\",'Arş. Gör. Ön. Değ.'!K44)","v":""}]
[{"$f":"IF('Arş. Gör. Ön. Değ.'!A45=\"\",\"\",'Arş. Gör. Ön. Değ.'!A45)","v":""},{"$f":"IF('Arş. Gör. Ön. Değ.'!B45=\"\",\"\",LEFT('Arş. Gör. Ön. Değ.'!B45,3)&REPT(\"*\",4)&RIGHT('Arş. Gör. Ön. Değ.'!B45,2))","v":""},{"$f":"IF('Arş. Gör. Ön. Değ.'!C45=\"\",\"\",IF(ISERR(FIND(\" \",'Arş. Gör. Ön. Değ.'!C45))=TRUE,LEFT('Arş. Gör. Ön. Değ.'!C45,2)&REPT(\"*\",3),LEFT('Arş. Gör. Ön. Değ.'!C45,2)&REPT(\"*\",3)&\" \"&MID('Arş. Gör. Ön. Değ.'!C45,FIND(\" \",'Arş. Gör. Ön. Değ.'!C45)+1,2)&REPT(\"*\",3)))","v":""},{"$f":"IF('Arş. Gör. Ön. Değ.'!D45=\"\",\"\",IF(ISERR(FIND(\" \",'Arş. Gör. Ön. Değ.'!D45))=TRUE,LEFT('Arş. Gör. Ön. Değ.'!D45,2)&REPT(\"*\",3),LEFT('Arş. Gör. Ön. Değ.'!D45,2)&REPT(\"*\",3)&\" \"&MID('Arş. Gör. Ön. Değ.'!D45,FIND(\" \",'Arş. Gör. Ön. Değ.'!D45)+1,2)&REPT(\"*\",3)))","v":""},{"$f":"IF('Arş. Gör. Ön. Değ.'!E45=\"\",\"\",'Arş. Gör. Ön. Değ.'!E45)","v":""},{"$f":"IF('Arş. Gör. Ön. Değ.'!F45=\"\",\"\",'Arş. Gör. Ön. Değ.'!F45)","v":""},{"$f":"IF('Arş. Gör. Ön. Değ.'!G45=\"\",\"\",'Arş. Gör. Ön. Değ.'!G45)","v":""},{"$f":"IF('Arş. Gör. Ön. Değ.'!H45=\"\",\"\",'Arş. Gör. Ön. Değ.'!H45)","v":""},{"$f":"IF('Arş. Gör. Ön. Değ.'!I45=\"\",\"\",'Arş. Gör. Ön. Değ.'!I45)","v":""},{"$f":"IF('Arş. Gör. Ön. Değ.'!J45=\"\",\"\",'Arş. Gör. Ön. Değ.'!J45)","v":""},{"$f":"IF('Arş. Gör. Ön. Değ.'!K45=\"\",\"\",'Arş. Gör. Ön. Değ.'!K45)","v":""}]
[{"$f":"IF('Arş. Gör. Ön. Değ.'!A46=\"\",\"\",'Arş. Gör. Ön. Değ.'!A46)","v":""},{"$f":"IF('Arş. Gör. Ön. Değ.'!B46=\"\",\"\",LEFT('Arş. Gör. Ön. Değ.'!B46,3)&REPT(\"*\",4)&RIGHT('Arş. Gör. Ön. Değ.'!B46,2))","v":""},{"$f":"IF('Arş. Gör. Ön. Değ.'!C46=\"\",\"\",IF(ISERR(FIND(\" \",'Arş. Gör. Ön. Değ.'!C46))=TRUE,LEFT('Arş. Gör. Ön. Değ.'!C46,2)&REPT(\"*\",3),LEFT('Arş. Gör. Ön. Değ.'!C46,2)&REPT(\"*\",3)&\" \"&MID('Arş. Gör. Ön. Değ.'!C46,FIND(\" \",'Arş. Gör. Ön. Değ.'!C46)+1,2)&REPT(\"*\",3)))","v":""},{"$f":"IF('Arş. Gör. Ön. Değ.'!D46=\"\",\"\",IF(ISERR(FIND(\" \",'Arş. Gör. Ön. Değ.'!D46))=TRUE,LEFT('Arş. Gör. Ön. Değ.'!D46,2)&REPT(\"*\",3),LEFT('Arş. Gör. Ön. Değ.'!D46,2)&REPT(\"*\",3)&\" \"&MID('Arş. Gör. Ön. Değ.'!D46,FIND(\" \",'Arş. Gör. Ön. Değ.'!D46)+1,2)&REPT(\"*\",3)))","v":""},{"$f":"IF('Arş. Gör. Ön. Değ.'!E46=\"\",\"\",'Arş. Gör. Ön. Değ.'!E46)","v":""},{"$f":"IF('Arş. Gör. Ön. Değ.'!F46=\"\",\"\",'Arş. Gör. Ön. Değ.'!F46)","v":""},{"$f":"IF('Arş. Gör. Ön. Değ.'!G46=\"\",\"\",'Arş. Gör. Ön. Değ.'!G46)","v":""},{"$f":"IF('Arş. Gör. Ön. Değ.'!H46=\"\",\"\",'Arş. Gör. Ön. Değ.'!H46)","v":""},{"$f":"IF('Arş. Gör. Ön. Değ.'!I46=\"\",\"\",'Arş. Gör. Ön. Değ.'!I46)","v":""},{"$f":"IF('Arş. Gör. Ön. Değ.'!J46=\"\",\"\",'Arş. Gör. Ön. Değ.'!J46)","v":""},{"$f":"IF('Arş. Gör. Ön. Değ.'!K46=\"\",\"\",'Arş. Gör. Ön. Değ.'!K46)","v":""}]
[{"$f":"IF('Arş. Gör. Ön. Değ.'!A47=\"\",\"\",'Arş. Gör. Ön. Değ.'!A47)","v":""},{"$f":"IF('Arş. Gör. Ön. Değ.'!B47=\"\",\"\",LEFT('Arş. Gör. Ön. Değ.'!B47,3)&REPT(\"*\",4)&RIGHT('Arş. Gör. Ön. Değ.'!B47,2))","v":""},{"$f":"IF('Arş. Gör. Ön. Değ.'!C47=\"\",\"\",IF(ISERR(FIND(\" \",'Arş. Gör. Ön. Değ.'!C47))=TRUE,LEFT('Arş. Gör. Ön. Değ.'!C47,2)&REPT(\"*\",3),LEFT('Arş. Gör. Ön. Değ.'!C47,2)&REPT(\"*\",3)&\" \"&MID('Arş. Gör. Ön. Değ.'!C47,FIND(\" \",'Arş. Gör. Ön. Değ.'!C47)+1,2)&REPT(\"*\",3)))","v":""},{"$f":"IF('Arş. Gör. Ön. Değ.'!D47=\"\",\"\",IF(ISERR(FIND(\" \",'Arş. Gör. Ön. Değ.'!D47))=TRUE,LEFT('Arş. Gör. Ön. Değ.'!D47,2)&REPT(\"*\",3),LEFT('Arş. Gör. Ön. Değ.'!D47,2)&REPT(\"*\",3)&\" \"&MID('Arş. Gör. Ön. Değ.'!D47,FIND(\" \",'Arş. Gör. Ön. Değ.'!D47)+1,2)&REPT(\"*\",3)))","v":""},{"$f":"IF('Arş. Gör. Ön. Değ.'!E47=\"\",\"\",'Arş. Gör. Ön. Değ.'!E47)","v":""},{"$f":"IF('Arş. Gör. Ön. Değ.'!F47=\"\",\"\",'Arş. Gör. Ön. Değ.'!F47)","v":""},{"$f":"IF('Arş. Gör. Ön. Değ.'!G47=\"\",\"\",'Arş. Gör. Ön. Değ.'!G47)","v":""},{"$f":"IF('Arş. Gör. Ön. Değ.'!H47=\"\",\"\",'Arş. Gör. Ön. Değ.'!H47)","v":""},{"$f":"IF('Arş. Gör. Ön. Değ.'!I47=\"\",\"\",'Arş. Gör. Ön. Değ.'!I47)","v":""},{"$f":"IF('Arş. Gör. Ön. Değ.'!J47=\"\",\"\",'Arş. Gör. Ön. Değ.'!J47)","v":""},{"$f":"IF('Arş. Gör. Ön. Değ.'!K47=\"\",\"\",'Arş. Gör. Ön. Değ.'!K47)","v":""}]
[{"$f":"IF('Arş. Gör. Ön. Değ.'!A48=\"\",\"\",'Arş. Gör. Ön. Değ.'!A48)","v":""},{"$f":"IF('Arş. Gör. Ön. Değ.'!B48=\"\",\"\",LEFT('Arş. Gör. Ön. Değ.'!B48,3)&REPT(\"*\",4)&RIGHT('Arş. Gör. Ön. Değ.'!B48,2))","v":""},{"$f":"IF('Arş. Gör. Ön. Değ.'!C48=\"\",\"\",IF(ISERR(FIND(\" \",'Arş. Gör. Ön. Değ.'!C48))=TRUE,LEFT('Arş. Gör. Ön. Değ.'!C48,2)&REPT(\"*\",3),LEFT('Arş. Gör. Ön. Değ.'!C48,2)&REPT(\"*\",3)&\" \"&MID('Arş. Gör. Ön. Değ.'!C48,FIND(\" \",'Arş. Gör. Ön. Değ.'!C48)+1,2)&REPT(\"*\",3)))","v":""},{"$f":"IF('Arş. Gör. Ön. Değ.'!D48=\"\",\"\",IF(ISERR(FIND(\" \",'Arş. Gör. Ön. Değ.'!D48))=TRUE,LEFT('Arş. Gör. Ön. Değ.'!D48,2)&REPT(\"*\",3),LEFT('Arş. Gör. Ön. Değ.'!D48,2)&REPT(\"*\",3)&\" \"&MID('Arş. Gör. Ön. Değ.'!D48,FIND(\" \",'Arş. Gör. Ön. Değ.'!D48)+1,2)&REPT(\"*\",3)))","v":""},{"$f":"IF('Arş. Gör. Ön. Değ.'!E48=\"\",\"\",'Arş. Gör. Ön. Değ.'!E48)","v":""},{"$f":"IF('Arş. Gör. Ön. Değ.'!F48=\"\",\"\",'Arş. Gör. Ön. Değ.'!F48)","v":""},{"$f":"IF('Arş. Gör. Ön. Değ.'!G48=\"\",\"\",'Arş. Gör. Ön. Değ.'!G48)","v":""},{"$f":"IF('Arş. Gör. Ön. Değ.'!H48=\"\",\"\",'Arş. Gör. Ön. Değ.'!H48)","v":""},{"$f":"IF('Arş. Gör. Ön. Değ.'!I48=\"\",\"\",'Arş. Gör. Ön. Değ.'!I48)","v":""},{"$f":"IF('Arş. Gör. Ön. Değ.'!J48=\"\",\"\",'Arş. Gör. Ön. Değ.'!J48)","v":""},{"$f":"IF('Arş. Gör. Ön. Değ.'!K48=\"\",\"\",'Arş. Gör. Ön. Değ.'!K48)","v":""}]
[{"$f":"IF('Arş. Gör. Ön. Değ.'!A49=\"\",\"\",'Arş. Gör. Ön. Değ.'!A49)","v":""},{"$f":"IF('Arş. Gör. Ön. Değ.'!B49=\"\",\"\",LEFT('Arş. Gör. Ön. Değ.'!B49,3)&REPT(\"*\",4)&RIGHT('Arş. Gör. Ön. Değ.'!B49,2))","v":""},{"$f":"IF('Arş. Gör. Ön. Değ.'!C49=\"\",\"\",IF(ISERR(FIND(\" \",'Arş. Gör. Ön. Değ.'!C49))=TRUE,LEFT('Arş. Gör. Ön. Değ.'!C49,2)&REPT(\"*\",3),LEFT('Arş. Gör. Ön. Değ.'!C49,2)&REPT(\"*\",3)&\" \"&MID('Arş. Gör. Ön. Değ.'!C49,FIND(\" \",'Arş. Gör. Ön. Değ.'!C49)+1,2)&REPT(\"*\",3)))","v":""},{"$f":"IF('Arş. Gör. Ön. Değ.'!D49=\"\",\"\",IF(ISERR(FIND(\" \",'Arş. Gör. Ön. Değ.'!D49))=TRUE,LEFT('Arş. Gör. Ön. Değ.'!D49,2)&REPT(\"*\",3),LEFT('Arş. Gör. Ön. Değ.'!D49,2)&REPT(\"*\",3)&\" \"&MID('Arş. Gör. Ön. Değ.'!D49,FIND(\" \",'Arş. Gör. Ön. Değ.'!D49)+1,2)&REPT(\"*\",3)))","v":""},{"$f":"IF('Arş. Gör. Ön. Değ.'!E49=\"\",\"\",'Arş. Gör. Ön. Değ.'!E49)","v":""},{"$f":"IF('Arş. Gör. Ön. Değ.'!F49=\"\",\"\",'Arş. Gör. Ön. Değ.'!F49)","v":""},{"$f":"IF('Arş. Gör. Ön. Değ.'!G49=\"\",\"\",'Arş. Gör. Ön. Değ.'!G49)","v":""},{"$f":"IF('Arş. Gör. Ön. Değ.'!H49=\"\",\"\",'Arş. Gör. Ön. Değ.'!H49)","v":""},{"$f":"IF('Arş. Gör. Ön. Değ.'!I49=\"\",\"\",'Arş. Gör. Ön. Değ.'!I49)","v":""},{"$f":"IF('Arş. Gör. Ön. Değ.'!J49=\"\",\"\",'Arş. Gör. Ön. Değ.'!J49)","v":""},{"$f":"IF('Arş. Gör. Ön. Değ.'!K49=\"\",\"\",'Arş. Gör. Ön. Değ.'!K49)","v":""}]
[{"$f":"IF('Arş. Gör. Ön. Değ.'!A50=\"\",\"\",'Arş. Gör. Ön. Değ.'!A50)","v":""},{"$f":"IF('Arş. Gör. Ön. Değ.'!B50=\"\",\"\",LEFT('Arş. Gör. Ön. Değ.'!B50,3)&REPT(\"*\",4)&RIGHT('Arş. Gör. Ön. Değ.'!B50,2))","v":""},{"$f":"IF('Arş. Gör. Ön. Değ.'!C50=\"\",\"\",IF(ISERR(FIND(\" \",'Arş. Gör. Ön. Değ.'!C50))=TRUE,LEFT('Arş. Gör. Ön. Değ.'!C50,2)&REPT(\"*\",3),LEFT('Arş. Gör. Ön. Değ.'!C50,2)&REPT(\"*\",3)&\" \"&MID('Arş. Gör. Ön. Değ.'!C50,FIND(\" \",'Arş. Gör. Ön. Değ.'!C50)+1,2)&REPT(\"*\",3)))","v":""},{"$f":"IF('Arş. Gör. Ön. Değ.'!D50=\"\",\"\",IF(ISERR(FIND(\" \",'Arş. Gör. Ön. Değ.'!D50))=TRUE,LEFT('Arş. Gör. Ön. Değ.'!D50,2)&REPT(\"*\",3),LEFT('Arş. Gör. Ön. Değ.'!D50,2)&REPT(\"*\",3)&\" \"&MID('Arş. Gör. Ön. Değ.'!D50,FIND(\" \",'Arş. Gör. Ön. Değ.'!D50)+1,2)&REPT(\"*\",3)))","v":""},{"$f":"IF('Arş. Gör. Ön. Değ.'!E50=\"\",\"\",'Arş. Gör. Ön. Değ.'!E50)","v":""},{"$f":"IF('Arş. Gör. Ön. Değ.'!F50=\"\",\"\",'Arş. Gör. Ön. Değ.'!F50)","v":""},{"$f":"IF('Arş. Gör. Ön. Değ.'!G50=\"\",\"\",'Arş. Gör. Ön. Değ.'!G50)","v":""},{"$f":"IF('Arş. Gör. Ön. Değ.'!H50=\"\",\"\",'Arş. Gör. Ön. Değ.'!H50)","v":""},{"$f":"IF('Arş. Gör. Ön. Değ.'!I50=\"\",\"\",'Arş. Gör. Ön. Değ.'!I50)","v":""},{"$f":"IF('Arş. Gör. Ön. Değ.'!J50=\"\",\"\",'Arş. Gör. Ön. Değ.'!J50)","v":""},{"$f":"IF('Arş. Gör. Ön. Değ.'!K50=\"\",\"\",'Arş. Gör. Ön. Değ.'!K50)","v":""}]
[{"$f":"IF('Arş. Gör. Ön. Değ.'!A51=\"\",\"\",'Arş. Gör. Ön. Değ.'!A51)","v":""},{"$f":"IF('Arş. Gör. Ön. Değ.'!B51=\"\",\"\",LEFT('Arş. Gör. Ön. Değ.'!B51,3)&REPT(\"*\",4)&RIGHT('Arş. Gör. Ön. Değ.'!B51,2))","v":""},{"$f":"IF('Arş. Gör. Ön. Değ.'!C51=\"\",\"\",IF(ISERR(FIND(\" \",'Arş. Gör. Ön. Değ.'!C51))=TRUE,LEFT('Arş. Gör. Ön. Değ.'!C51,2)&REPT(\"*\",3),LEFT('Arş. Gör. Ön. Değ.'!C51,2)&REPT(\"*\",3)&\" \"&MID('Arş. Gör. Ön. Değ.'!C51,FIND(\" \",'Arş. Gör. Ön. Değ.'!C51)+1,2)&REPT(\"*\",3)))","v":""},{"$f":"IF('Arş. Gör. Ön. Değ.'!D51=\"\",\"\",IF(ISERR(FIND(\" \",'Arş. Gör. Ön. Değ.'!D51))=TRUE,LEFT('Arş. Gör. Ön. Değ.'!D51,2)&REPT(\"*\",3),LEFT('Arş. Gör. Ön. Değ.'!D51,2)&REPT(\"*\",3)&\" \"&MID('Arş. Gör. Ön. Değ.'!D51,FIND(\" \",'Arş. Gör. Ön. Değ.'!D51)+1,2)&REPT(\"*\",3)))","v":""},{"$f":"IF('Arş. Gör. Ön. Değ.'!E51=\"\",\"\",'Arş. Gör. Ön. Değ.'!E51)","v":""},{"$f":"IF('Arş. Gör. Ön. Değ.'!F51=\"\",\"\",'Arş. Gör. Ön. Değ.'!F51)","v":""},{"$f":"IF('Arş. Gör. Ön. Değ.'!G51=\"\",\"\",'Arş. Gör. Ön. Değ.'!G51)","v":""},{"$f":"IF('Arş. Gör. Ön. Değ.'!H51=\"\",\"\",'Arş. Gör. Ön. Değ.'!H51)","v":""},{"$f":"IF('Arş. Gör. Ön. Değ.'!I51=\"\",\"\",'Arş. Gör. Ön. Değ.'!I51)","v":""},{"$f":"IF('Arş. Gör. Ön. Değ.'!J51=\"\",\"\",'Arş. Gör. Ön. Değ.'!J51)","v":""},{"$f":"IF('Arş. Gör. Ön. Değ.'!K51=\"\",\"\",'Arş. Gör. Ön. Değ.'!K51)","v":""}]
[{"$f":"IF('Arş. Gör. Ön. Değ.'!A52=\"\",\"\",'Arş. Gör. Ön. Değ.'!A52)","v":""},{"$f":"IF('Arş. Gör. Ön. Değ.'!B52=\"\",\"\",LEFT('Arş. Gör. Ön. Değ.'!B52,3)&REPT(\"*\",4)&RIGHT('Arş. Gör. Ön. Değ.'!B52,2))","v":""},{"$f":"IF('Arş. Gör. Ön. Değ.'!C52=\"\",\"\",IF(ISERR(FIND(\" \",'Arş. Gör. Ön. Değ.'!C52))=TRUE,LEFT('Arş. Gör. Ön. Değ.'!C52,2)&REPT(\"*\",3),LEFT('Arş. Gör. Ön. Değ.'!C52,2)&REPT(\"*\",3)&\" \"&MID('Arş. Gör. Ön. Değ.'!C52,FIND(\" \",'Arş. Gör. Ön. Değ.'!C52)+1,2)&REPT(\"*\",3)))","v":""},{"$f":"IF('Arş. Gör. Ön. Değ.'!D52=\"\",\"\",IF(ISERR(FIND(\" \",'Arş. Gör. Ön. Değ.'!D52))=TRUE,LEFT('Arş. Gör. Ön. Değ.'!D52,2)&REPT(\"*\",3),LEFT('Arş. Gör. Ön. Değ.'!D52,2)&REPT(\"*\",3)&\" \"&MID('Arş. Gör. Ön. Değ.'!D52,FIND(\" \",'Arş. Gör. Ön. Değ.'!D52)+1,2)&REPT(\"*\",3)))","v":""},{"$f":"IF('Arş. Gör. Ön. Değ.'!E52=\"\",\"\",'Arş. Gör. Ön. Değ.'!E52)","v":""},{"$f":"IF('Arş. Gör. Ön. Değ.'!F52=\"\",\"\",'Arş. Gör. Ön. Değ.'!F52)","v":""},{"$f":"IF('Arş. Gör. Ön. Değ.'!G52=\"\",\"\",'Arş. Gör. Ön. Değ.'!G52)","v":""},{"$f":"IF('Arş. Gör. Ön. Değ.'!H52=\"\",\"\",'Arş. Gör. Ön. Değ.'!H52)","v":""},{"$f":"IF('Arş. Gör. Ön. Değ.'!I52=\"\",\"\",'Arş. Gör. Ön. Değ.'!I52)","v":""},{"$f":"IF('Arş. Gör. Ön. Değ.'!J52=\"\",\"\",'Arş. Gör. Ön. Değ.'!J52)","v":""},{"$f":"IF('Arş. Gör. Ön. Değ.'!K52=\"\",\"\",'Arş. Gör. Ön. Değ.'!K52)","v":""}]
[{"$f":"IF('Arş. Gör. Ön. Değ.'!A53=\"\",\"\",'Arş. Gör. Ön. Değ.'!A53)","v":""},{"$f":"IF('Arş. Gör. Ön. Değ.'!B53=\"\",\"\",LEFT('Arş. Gör. Ön. Değ.'!B53,3)&REPT(\"*\",4)&RIGHT('Arş. Gör. Ön. Değ.'!B53,2))","v":""},{"$f":"IF('Arş. Gör. Ön. Değ.'!C53=\"\",\"\",IF(ISERR(FIND(\" \",'Arş. Gör. Ön. Değ.'!C53))=TRUE,LEFT('Arş. Gör. Ön. Değ.'!C53,2)&REPT(\"*\",3),LEFT('Arş. Gör. Ön. Değ.'!C53,2)&REPT(\"*\",3)&\" \"&MID('Arş. Gör. Ön. Değ.'!C53,FIND(\" \",'Arş. Gör. Ön. Değ.'!C53)+1,2)&REPT(\"*\",3)))","v":""},{"$f":"IF('Arş. Gör. Ön. Değ.'!D53=\"\",\"\",IF(ISERR(FIND(\" \",'Arş. Gör. Ön. Değ.'!D53))=TRUE,LEFT('Arş. Gör. Ön. Değ.'!D53,2)&REPT(\"*\",3),LEFT('Arş. Gör. Ön. Değ.'!D53,2)&REPT(\"*\",3)&\" \"&MID('Arş. Gör. Ön. Değ.'!D53,FIND(\" \",'Arş. Gör. Ön. Değ.'!D53)+1,2)&REPT(\"*\",3)))","v":""},{"$f":"IF('Arş. Gör. Ön. Değ.'!E53=\"\",\"\",'Arş. Gör. Ön. Değ.'!E53)","v":""},{"$f":"IF('Arş. Gör. Ön. Değ.'!F53=\"\",\"\",'Arş. Gör. Ön. Değ.'!F53)","v":""},{"$f":"IF('Arş. Gör. Ön. Değ.'!G53=\"\",\"\",'Arş. Gör. Ön. Değ.'!G53)","v":""},{"$f":"IF('Arş. Gör. Ön. Değ.'!H53=\"\",\"\",'Arş. Gör. Ön. Değ.'!H53)","v":""},{"$f":"IF('Arş. Gör. Ön. Değ.'!I53=\"\",\"\",'Arş. Gör. Ön. Değ.'!I53)","v":""},{"$f":"IF('Arş. Gör. Ön. Değ.'!J53=\"\",\"\",'Arş. Gör. Ön. Değ.'!J53)","v":""},{"$f":"IF('Arş. Gör. Ön. Değ.'!K53=\"\",\"\",'Arş. Gör. Ön. Değ.'!K53)","v":""}]
[{"$f":"IF('Arş. Gör. Ön. Değ.'!A54=\"\",\"\",'Arş. Gör. Ön. Değ.'!A54)","v":""},{"$f":"IF('Arş. Gör. Ön. Değ.'!B54=\"\",\"\",LEFT('Arş. Gör. Ön. Değ.'!B54,3)&REPT(\"*\",4)&RIGHT('Arş. Gör. Ön. Değ.'!B54,2))","v":""},{"$f":"IF('Arş. Gör. Ön. Değ.'!C54=\"\",\"\",IF(ISERR(FIND(\" \",'Arş. Gör. Ön. Değ.'!C54))=TRUE,LEFT('Arş. Gör. Ön. Değ.'!C54,2)&REPT(\"*\",3),LEFT('Arş. Gör. Ön. Değ.'!C54,2)&REPT(\"*\",3)&\" \"&MID('Arş. Gör. Ön. Değ.'!C54,FIND(\" \",'Arş. Gör. Ön. Değ.'!C54)+1,2)&REPT(\"*\",3)))","v":""},{"$f":"IF('Arş. Gör. Ön. Değ.'!D54=\"\",\"\",IF(ISERR(FIND(\" \",'Arş. Gör. Ön. Değ.'!D54))=TRUE,LEFT('Arş. Gör. Ön. Değ.'!D54,2)&REPT(\"*\",3),LEFT('Arş. Gör. Ön. Değ.'!D54,2)&REPT(\"*\",3)&\" \"&MID('Arş. Gör. Ön. Değ.'!D54,FIND(\" \",'Arş. Gör. Ön. Değ.'!D54)+1,2)&REPT(\"*\",3)))","v":""},{"$f":"IF('Arş. Gör. Ön. Değ.'!E54=\"\",\"\",'Arş. Gör. Ön. Değ.'!E54)","v":""},{"$f":"IF('Arş. Gör. Ön. Değ.'!F54=\"\",\"\",'Arş. Gör. Ön. Değ.'!F54)","v":""},{"$f":"IF('Arş. Gör. Ön. Değ.'!G54=\"\",\"\",'Arş. Gör. Ön. Değ.'!G54)","v":""},{"$f":"IF('Arş. Gör. Ön. Değ.'!H54=\"\",\"\",'Arş. Gör. Ön. Değ.'!H54)","v":""},{"$f":"IF('Arş. Gör. Ön. Değ.'!I54=\"\",\"\",'Arş. Gör. Ön. Değ.'!I54)","v":""},{"$f":"IF('Arş. Gör. Ön. Değ.'!J54=\"\",\"\",'Arş. Gör. Ön. Değ.'!J54)","v":""},{"$f":"IF('Arş. Gör. Ön. Değ.'!K54=\"\",\"\",'Arş. Gör. Ön. Değ.'!K54)","v":""}]
[{"$f":"IF('Arş. Gör. Ön. Değ.'!A55=\"\",\"\",'Arş. Gör. Ön. Değ.'!A55)","v":""},{"$f":"IF('Arş. Gör. Ön. Değ.'!B55=\"\",\"\",LEFT('Arş. Gör. Ön. Değ.'!B55,3)&REPT(\"*\",4)&RIGHT('Arş. Gör. Ön. Değ.'!B55,2))","v":""},{"$f":"IF('Arş. Gör. Ön. Değ.'!C55=\"\",\"\",IF(ISERR(FIND(\" \",'Arş. Gör. Ön. Değ.'!C55))=TRUE,LEFT('Arş. Gör. Ön. Değ.'!C55,2)&REPT(\"*\",3),LEFT('Arş. Gör. Ön. Değ.'!C55,2)&REPT(\"*\",3)&\" \"&MID('Arş. Gör. Ön. Değ.'!C55,FIND(\" \",'Arş. Gör. Ön. Değ.'!C55)+1,2)&REPT(\"*\",3)))","v":""},{"$f":"IF('Arş. Gör. Ön. Değ.'!D55=\"\",\"\",IF(ISERR(FIND(\" \",'Arş. Gör. Ön. Değ.'!D55))=TRUE,LEFT('Arş. Gör. Ön. Değ.'!D55,2)&REPT(\"*\",3),LEFT('Arş. Gör. Ön. Değ.'!D55,2)&REPT(\"*\",3)&\" \"&MID('Arş. Gör. Ön. Değ.'!D55,FIND(\" \",'Arş. Gör. Ön. Değ.'!D55)+1,2)&REPT(\"*\",3)))","v":""},{"$f":"IF('Arş. Gör. Ön. Değ.'!E55=\"\",\"\",'Arş. Gör. Ön. Değ.'!E55)","v":""},{"$f":"IF('Arş. Gör. Ön. Değ.'!F55=\"\",\"\",'Arş. Gör. Ön. Değ.'!F55)","v":""},{"$f":"IF('Arş. Gör. Ön. Değ.'!G55=\"\",\"\",'Arş. Gör. Ön. Değ.'!G55)","v":""},{"$f":"IF('Arş. Gör. Ön. Değ.'!H55=\"\",\"\",'Arş. Gör. Ön. Değ.'!H55)","v":""},{"$f":"IF('Arş. Gör. Ön. Değ.'!I55=\"\",\"\",'Arş. Gör. Ön. Değ.'!I55)","v":""},{"$f":"IF('Arş. Gör. Ön. Değ.'!J55=\"\",\"\",'Arş. Gör. Ön. Değ.'!J55)","v":""},{"$f":"IF('Arş. Gör. Ön. Değ.'!K55=\"\",\"\",'Arş. Gör. Ön. Değ.'!K55)","v":""}]
[{"$f":"IF('Arş. Gör. Ön. Değ.'!A56=\"\",\"\",'Arş. Gör. Ön. Değ.'!A56)","v":""},{"$f":"IF('Arş. Gör. Ön. Değ.'!B56=\"\",\"\",LEFT('Arş. Gör. Ön. Değ.'!B56,3)&REPT(\"*\",4)&RIGHT('Arş. Gör. Ön. Değ.'!B56,2))","v":""},{"$f":"IF('Arş. Gör. Ön. Değ.'!C56=\"\",\"\",IF(ISERR(FIND(\" \",'Arş. Gör. Ön. Değ.'!C56))=TRUE,LEFT('Arş. Gör. Ön. Değ.'!C56,2)&REPT(\"*\",3),LEFT('Arş. Gör. Ön. Değ.'!C56,2)&REPT(\"*\",3)&\" \"&MID('Arş. Gör. Ön. Değ.'!C56,FIND(\" \",'Arş. Gör. Ön. Değ.'!C56)+1,2)&REPT(\"*\",3)))","v":""},{"$f":"IF('Arş. Gör. Ön. Değ.'!D56=\"\",\"\",IF(ISERR(FIND(\" \",'Arş. Gör. Ön. Değ.'!D56))=TRUE,LEFT('Arş. Gör. Ön. Değ.'!D56,2)&REPT(\"*\",3),LEFT('Arş. Gör. Ön. Değ.'!D56,2)&REPT(\"*\",3)&\" \"&MID('Arş. Gör. Ön. Değ.'!D56,FIND(\" \",'Arş. Gör. Ön. Değ.'!D56)+1,2)&REPT(\"*\",3)))","v":""},{"$f":"IF('Arş. Gör. Ön. Değ.'!E56=\"\",\"\",'Arş. Gör. Ön. Değ.'!E56)","v":""},{"$f":"IF('Arş. Gör. Ön. Değ.'!F56=\"\",\"\",'Arş. Gör. Ön. Değ.'!F56)","v":""},{"$f":"IF('Arş. Gör. Ön. Değ.'!G56=\"\",\"\",'Arş. Gör. Ön. Değ.'!G56)","v":""},{"$f":"IF('Arş. Gör. Ön. Değ.'!H56=\"\",\"\",'Arş. Gör. Ön. Değ.'!H56)","v":""},{"$f":"IF('Arş. Gör. Ön. Değ.'!I56=\"\",\"\",'Arş. Gör. Ön. Değ.'!I56)","v":""},{"$f":"IF('Arş. Gör. Ön. Değ.'!J56=\"\",\"\",'Arş. Gör. Ön. Değ.'!J56)","v":""},{"$f":"IF('Arş. Gör. Ön. Değ.'!K56=\"\",\"\",'Arş. Gör. Ön. Değ.'!K56)","v":""}]
[{"$f":"IF('Arş. Gör. Ön. Değ.'!A57=\"\",\"\",'Arş. Gör. Ön. Değ.'!A57)","v":""},{"$f":"IF('Arş. Gör. Ön. Değ.'!B57=\"\",\"\",LEFT('Arş. Gör. Ön. Değ.'!B57,3)&REPT(\"*\",4)&RIGHT('Arş. Gör. Ön. Değ.'!B57,2))","v":""},{"$f":"IF('Arş. Gör. Ön. Değ.'!C57=\"\",\"\",IF(ISERR(FIND(\" \",'Arş. Gör. Ön. Değ.'!C57))=TRUE,LEFT('Arş. Gör. Ön. Değ.'!C57,2)&REPT(\"*\",3),LEFT('Arş. Gör. Ön. Değ.'!C57,2)&REPT(\"*\",3)&\" \"&MID('Arş. Gör. Ön. Değ.'!C57,FIND(\" \",'Arş. Gör. Ön. Değ.'!C57)+1,2)&REPT(\"*\",3)))","v":""},{"$f":"IF('Arş. Gör. Ön. Değ.'!D57=\"\",\"\",IF(ISERR(FIND(\" \",'Arş. Gör. Ön. Değ.'!D57))=TRUE,LEFT('Arş. Gör. Ön. Değ.'!D57,2)&REPT(\"*\",3),LEFT('Arş. Gör. Ön. Değ.'!D57,2)&REPT(\"*\",3)&\" \"&MID('Arş. Gör. Ön. Değ.'!D57,FIND(\" \",'Arş. Gör. Ön. Değ.'!D57)+1,2)&REPT(\"*\",3)))","v":""},{"$f":"IF('Arş. Gör. Ön. Değ.'!E57=\"\",\"\",'Arş. Gör. Ön. Değ.'!E57)","v":""},{"$f":"IF('Arş. Gör. Ön. Değ.'!F57=\"\",\"\",'Arş. Gör. Ön. Değ.'!F57)","v":""},{"$f":"IF('Arş. Gör. Ön. Değ.'!G57=\"\",\"\",'Arş. Gör. Ön. Değ.'!G57)","v":""},{"$f":"IF('Arş. Gör. Ön. Değ.'!H57=\"\",\"\",'Arş. Gör. Ön. Değ.'!H57)","v":""},{"$f":"IF('Arş. Gör. Ön. Değ.'!I57=\"\",\"\",'Arş. Gör. Ön. Değ.'!I57)","v":""},{"$f":"IF('Arş. Gör. Ön. Değ.'!J57=\"\",\"\",'Arş. Gör. Ön. Değ.'!J57)","v":""},{"$f":"IF('Arş. Gör. Ön. Değ.'!K57=\"\",\"\",'Arş. Gör. Ön. Değ.'!K57)","v":""}]
[{"$f":"IF('Arş. Gör. Ön. Değ.'!A58=\"\",\"\",'Arş. Gör. Ön. Değ.'!A58)","v":""},{"$f":"IF('Arş. Gör. Ön. Değ.'!B58=\"\",\"\",LEFT('Arş. Gör. Ön. Değ.'!B58,3)&REPT(\"*\",4)&RIGHT('Arş. Gör. Ön. Değ.'!B58,2))","v":""},{"$f":"IF('Arş. Gör. Ön. Değ.'!C58=\"\",\"\",IF(ISERR(FIND(\" \",'Arş. Gör. Ön. Değ.'!C58))=TRUE,LEFT('Arş. Gör. Ön. Değ.'!C58,2)&REPT(\"*\",3),LEFT('Arş. Gör. Ön. Değ.'!C58,2)&REPT(\"*\",3)&\" \"&MID('Arş. Gör. Ön. Değ.'!C58,FIND(\" \",'Arş. Gör. Ön. Değ.'!C58)+1,2)&REPT(\"*\",3)))","v":""},{"$f":"IF('Arş. Gör. Ön. Değ.'!D58=\"\",\"\",IF(ISERR(FIND(\" \",'Arş. Gör. Ön. Değ.'!D58))=TRUE,LEFT('Arş. Gör. Ön. Değ.'!D58,2)&REPT(\"*\",3),LEFT('Arş. Gör. Ön. Değ.'!D58,2)&REPT(\"*\",3)&\" \"&MID('Arş. Gör. Ön. Değ.'!D58,FIND(\" \",'Arş. Gör. Ön. Değ.'!D58)+1,2)&REPT(\"*\",3)))","v":""},{"$f":"IF('Arş. Gör. Ön. Değ.'!E58=\"\",\"\",'Arş. Gör. Ön. Değ.'!E58)","v":""},{"$f":"IF('Arş. Gör. Ön. Değ.'!F58=\"\",\"\",'Arş. Gör. Ön. Değ.'!F58)","v":""},{"$f":"IF('Arş. Gör. Ön. Değ.'!G58=\"\",\"\",'Arş. Gör. Ön. Değ.'!G58)","v":""},{"$f":"IF('Arş. Gör. Ön. Değ.'!H58=\"\",\"\",'Arş. Gör. Ön. Değ.'!H58)","v":""},{"$f":"IF('Arş. Gör. Ön. Değ.'!I58=\"\",\"\",'Arş. Gör. Ön. Değ.'!I58)","v":""},{"$f":"IF('Arş. Gör. Ön. Değ.'!J58=\"\",\"\",'Arş. Gör. Ön. Değ.'!J58)","v":""},{"$f":"IF('Arş. Gör. Ön. Değ.'!K58=\"\",\"\",'Arş. Gör. Ön. Değ.'!K58)","v":""}]
[{"$f":"IF('Arş. Gör. Ön. Değ.'!A59=\"\",\"\",'Arş. Gör. Ön. Değ.'!A59)","v":""},{"$f":"IF('Arş. Gör. Ön. Değ.'!B59=\"\",\"\",LEFT('Arş. Gör. Ön. Değ.'!B59,3)&REPT(\"*\",4)&RIGHT('Arş. Gör. Ön. Değ.'!B59,2))","v":""},{"$f":"IF('Arş. Gör. Ön. Değ.'!C59=\"\",\"\",IF(ISERR(FIND(\" \",'Arş. Gör. Ön. Değ.'!C59))=TRUE,LEFT('Arş. Gör. Ön. Değ.'!C59,2)&REPT(\"*\",3),LEFT('Arş. Gör. Ön. Değ.'!C59,2)&REPT(\"*\",3)&\" \"&MID('Arş. Gör. Ön. Değ.'!C59,FIND(\" \",'Arş. Gör. Ön. Değ.'!C59)+1,2)&REPT(\"*\",3)))","v":""},{"$f":"IF('Arş. Gör. Ön. Değ.'!D59=\"\",\"\",IF(ISERR(FIND(\" \",'Arş. Gör. Ön. Değ.'!D59))=TRUE,LEFT('Arş. Gör. Ön. Değ.'!D59,2)&REPT(\"*\",3),LEFT('Arş. Gör. Ön. Değ.'!D59,2)&REPT(\"*\",3)&\" \"&MID('Arş. Gör. Ön. Değ.'!D59,FIND(\" \",'Arş. Gör. Ön. Değ.'!D59)+1,2)&REPT(\"*\",3)))","v":""},{"$f":"IF('Arş. Gör. Ön. Değ.'!E59=\"\",\"\",'Arş. Gör. Ön. Değ.'!E59)","v":""},{"$f":"IF('Arş. Gör. Ön. Değ.'!F59=\"\",\"\",'Arş. Gör. Ön. Değ.'!F59)","v":""},{"$f":"IF('Arş. Gör. Ön. Değ.'!G59=\"\",\"\",'Arş. Gör. Ön. Değ.'!G59)","v":""},{"$f":"IF('Arş. Gör. Ön. Değ.'!H59=\"\",\"\",'Arş. Gör. Ön. Değ.'!H59)","v":""},{"$f":"IF('Arş. Gör. Ön. Değ.'!I59=\"\",\"\",'Arş. Gör. Ön. Değ.'!I59)","v":""},{"$f":"IF('Arş. Gör. Ön. Değ.'!J59=\"\",\"\",'Arş. Gör. Ön. Değ.'!J59)","v":""},{"$f":"IF('Arş. Gör. Ön. Değ.'!K59=\"\",\"\",'Arş. Gör. Ön. Değ.'!K59)","v":""}]
[{"$f":"IF('Arş. Gör. Ön. Değ.'!A60=\"\",\"\",'Arş. Gör. Ön. Değ.'!A60)","v":""},{"$f":"IF('Arş. Gör. Ön. Değ.'!B60=\"\",\"\",LEFT('Arş. Gör. Ön. Değ.'!B60,3)&REPT(\"*\",4)&RIGHT('Arş. Gör. Ön. Değ.'!B60,2))","v":""},{"$f":"IF('Arş. Gör. Ön. Değ.'!C60=\"\",\"\",IF(ISERR(FIND(\" \",'Arş. Gör. Ön. Değ.'!C60))=TRUE,LEFT('Arş. Gör. Ön. Değ.'!C60,2)&REPT(\"*\",3),LEFT('Arş. Gör. Ön. Değ.'!C60,2)&REPT(\"*\",3)&\" \"&MID('Arş. Gör. Ön. Değ.'!C60,FIND(\" \",'Arş. Gör. Ön. Değ.'!C60)+1,2)&REPT(\"*\",3)))","v":""},{"$f":"IF('Arş. Gör. Ön. Değ.'!D60=\"\",\"\",IF(ISERR(FIND(\" \",'Arş. Gör. Ön. Değ.'!D60))=TRUE,LEFT('Arş. Gör. Ön. Değ.'!D60,2)&REPT(\"*\",3),LEFT('Arş. Gör. Ön. Değ.'!D60,2)&REPT(\"*\",3)&\" \"&MID('Arş. Gör. Ön. Değ.'!D60,FIND(\" \",'Arş. Gör. Ön. Değ.'!D60)+1,2)&REPT(\"*\",3)))","v":""},{"$f":"IF('Arş. Gör. Ön. Değ.'!E60=\"\",\"\",'Arş. Gör. Ön. Değ.'!E60)","v":""},{"$f":"IF('Arş. Gör. Ön. Değ.'!F60=\"\",\"\",'Arş. Gör. Ön. Değ.'!F60)","v":""},{"$f":"IF('Arş. Gör. Ön. Değ.'!G60=\"\",\"\",'Arş. Gör. Ön. Değ.'!G60)","v":""},{"$f":"IF('Arş. Gör. Ön. Değ.'!H60=\"\",\"\",'Arş. Gör. Ön. Değ.'!H60)","v":""},{"$f":"IF('Arş. Gör. Ön. Değ.'!I60=\"\",\"\",'Arş. Gör. Ön. Değ.'!I60)","v":""},{"$f":"IF('Arş. Gör. Ön. Değ.'!J60=\"\",\"\",'Arş. Gör. Ön. Değ.'!J60)","v":""},{"$f":"IF('Arş. Gör. Ön. Değ.'!K60=\"\",\"\",'Arş. Gör. Ön. Değ.'!K60)","v":""}]
[{"$f":"IF('Arş. Gör. Ön. Değ.'!A61=\"\",\"\",'Arş. Gör. Ön. Değ.'!A61)","v":""},{"$f":"IF('Arş. Gör. Ön. Değ.'!B61=\"\",\"\",LEFT('Arş. Gör. Ön. Değ.'!B61,3)&REPT(\"*\",4)&RIGHT('Arş. Gör. Ön. Değ.'!B61,2))","v":""},{"$f":"IF('Arş. Gör. Ön. Değ.'!C61=\"\",\"\",IF(ISERR(FIND(\" \",'Arş. Gör. Ön. Değ.'!C61))=TRUE,LEFT('Arş. Gör. Ön. Değ.'!C61,2)&REPT(\"*\",3),LEFT('Arş. Gör. Ön. Değ.'!C61,2)&REPT(\"*\",3)&\" \"&MID('Arş. Gör. Ön. Değ.'!C61,FIND(\" \",'Arş. Gör. Ön. Değ.'!C61)+1,2)&REPT(\"*\",3)))","v":""},{"$f":"IF('Arş. Gör. Ön. Değ.'!D61=\"\",\"\",IF(ISERR(FIND(\" \",'Arş. Gör. Ön. Değ.'!D61))=TRUE,LEFT('Arş. Gör. Ön. Değ.'!D61,2)&REPT(\"*\",3),LEFT('Arş. Gör. Ön. Değ.'!D61,2)&REPT(\"*\",3)&\" \"&MID('Arş. Gör. Ön. Değ.'!D61,FIND(\" \",'Arş. Gör. Ön. Değ.'!D61)+1,2)&REPT(\"*\",3)))","v":""},{"$f":"IF('Arş. Gör. Ön. Değ.'!E61=\"\",\"\",'Arş. Gör. Ön. Değ.'!E61)","v":""},{"$f":"IF('Arş. Gör. Ön. Değ.'!F61=\"\",\"\",'Arş. Gör. Ön. Değ.'!F61)","v":""},{"$f":"IF('Arş. Gör. Ön. Değ.'!G61=\"\",\"\",'Arş. Gör. Ön. Değ.'!G61)","v":""},{"$f":"IF('Arş. Gör. Ön. Değ.'!H61=\"\",\"\",'Arş. Gör. Ön. Değ.'!H61)","v":""},{"$f":"IF('Arş. Gör. Ön. Değ.'!I61=\"\",\"\",'Arş. Gör. Ön. Değ.'!I61)","v":""},{"$f":"IF('Arş. Gör. Ön. Değ.'!J61=\"\",\"\",'Arş. Gör. Ön. Değ.'!J61)","v":""},{"$f":"IF('Arş. Gör. Ön. Değ.'!K61=\"\",\"\",'Arş. Gör. Ön. Değ.'!K61)","v":""}]
[{"$f":"IF('Arş. Gör. Ön. Değ.'!A62=\"\",\"\",'Arş. Gör. Ön. Değ.'!A62)","v":""},{"$f":"IF('Arş. Gör. Ön. Değ.'!B62=\"\",\"\",LEFT('Arş. Gör. Ön. Değ.'!B62,3)&REPT(\"*\",4)&RIGHT('Arş. Gör. Ön. Değ.'!B62,2))","v":""},{"$f":"IF('Arş. Gör. Ön. Değ.'!C62=\"\",\"\",IF(ISERR(FIND(\" \",'Arş. Gör. Ön. Değ.'!C62))=TRUE,LEFT('Arş. Gör. Ön. Değ.'!C62,2)&REPT(\"*\",3),LEFT('Arş. Gör. Ön. Değ.'!C62,2)&REPT(\"*\",3)&\" \"&MID('Arş. Gör. Ön. Değ.'!C62,FIND(\" \",'Arş. Gör. Ön. Değ.'!C62)+1,2)&REPT(\"*\",3)))","v":""},{"$f":"IF('Arş. Gör. Ön. Değ.'!D62=\"\",\"\",IF(ISERR(FIND(\" \",'Arş. Gör. Ön. Değ.'!D62))=TRUE,LEFT('Arş. Gör. Ön. Değ.'!D62,2)&REPT(\"*\",3),LEFT('Arş. Gör. Ön. Değ.'!D62,2)&REPT(\"*\",3)&\" \"&MID('Arş. Gör. Ön. Değ.'!D62,FIND(\" \",'Arş. Gör. Ön. Değ.'!D62)+1,2)&REPT(\"*\",3)))","v":""},{"$f":"IF('Arş. Gör. Ön. Değ.'!E62=\"\",\"\",'Arş. Gör. Ön. Değ.'!E62)","v":""},{"$f":"IF('Arş. Gör. Ön. Değ.'!F62=\"\",\"\",'Arş. Gör. Ön. Değ.'!F62)","v":""},{"$f":"IF('Arş. Gör. Ön. Değ.'!G62=\"\",\"\",'Arş. Gör. Ön. Değ.'!G62)","v":""},{"$f":"IF('Arş. Gör. Ön. Değ.'!H62=\"\",\"\",'Arş. Gör. Ön. Değ.'!H62)","v":""},{"$f":"IF('Arş. Gör. Ön. Değ.'!I62=\"\",\"\",'Arş. Gör. Ön. Değ.'!I62)","v":""},{"$f":"IF('Arş. Gör. Ön. Değ.'!J62=\"\",\"\",'Arş. Gör. Ön. Değ.'!J62)","v":""},{"$f":"IF('Arş. Gör. Ön. Değ.'!K62=\"\",\"\",'Arş. Gör. Ön. Değ.'!K62)","v":""}]
[{"$f":"IF('Arş. Gör. Ön. Değ.'!A63=\"\",\"\",'Arş. Gör. Ön. Değ.'!A63)","v":""},{"$f":"IF('Arş. Gör. Ön. Değ.'!B63=\"\",\"\",LEFT('Arş. Gör. Ön. Değ.'!B63,3)&REPT(\"*\",4)&RIGHT('Arş. Gör. Ön. Değ.'!B63,2))","v":""},{"$f":"IF('Arş. Gör. Ön. Değ.'!C63=\"\",\"\",IF(ISERR(FIND(\" \",'Arş. Gör. Ön. Değ.'!C63))=TRUE,LEFT('Arş. Gör. Ön. Değ.'!C63,2)&REPT(\"*\",3),LEFT('Arş. Gör. Ön. Değ.'!C63,2)&REPT(\"*\",3)&\" \"&MID('Arş. Gör. Ön. Değ.'!C63,FIND(\" \",'Arş. Gör. Ön. Değ.'!C63)+1,2)&REPT(\"*\",3)))","v":""},{"$f":"IF('Arş. Gör. Ön. Değ.'!D63=\"\",\"\",IF(ISERR(FIND(\" \",'Arş. Gör. Ön. Değ.'!D63))=TRUE,LEFT('Arş. Gör. Ön. Değ.'!D63,2)&REPT(\"*\",3),LEFT('Arş. Gör. Ön. Değ.'!D63,2)&REPT(\"*\",3)&\" \"&MID('Arş. Gör. Ön. Değ.'!D63,FIND(\" \",'Arş. Gör. Ön. Değ.'!D63)+1,2)&REPT(\"*\",3)))","v":""},{"$f":"IF('Arş. Gör. Ön. Değ.'!E63=\"\",\"\",'Arş. Gör. Ön. Değ.'!E63)","v":""},{"$f":"IF('Arş. Gör. Ön. Değ.'!F63=\"\",\"\",'Arş. Gör. Ön. Değ.'!F63)","v":""},{"$f":"IF('Arş. Gör. Ön. Değ.'!G63=\"\",\"\",'Arş. Gör. Ön. Değ.'!G63)","v":""},{"$f":"IF('Arş. Gör. Ön. Değ.'!H63=\"\",\"\",'Arş. Gör. Ön. Değ.'!H63)","v":""},{"$f":"IF('Arş. Gör. Ön. Değ.'!I63=\"\",\"\",'Arş. Gör. Ön. Değ.'!I63)","v":""},{"$f":"IF('Arş. Gör. Ön. Değ.'!J63=\"\",\"\",'Arş. Gör. Ön. Değ.'!J63)","v":""},{"$f":"IF('Arş. Gör. Ön. Değ.'!K63=\"\",\"\",'Arş. Gör. Ön. Değ.'!K63)","v":""}]
[{"$f":"IF('Arş. Gör. Ön. Değ.'!A64=\"\",\"\",'Arş. Gör. Ön. Değ.'!A64)","v":""},{"$f":"IF('Arş. Gör. Ön. Değ.'!B64=\"\",\"\",LEFT('Arş. Gör. Ön. Değ.'!B64,3)&REPT(\"*\",4)&RIGHT('Arş. Gör. Ön. Değ.'!B64,2))","v":""},{"$f":"IF('Arş. Gör. Ön. Değ.'!C64=\"\",\"\",IF(ISERR(FIND(\" \",'Arş. Gör. Ön. Değ.'!C64))=TRUE,LEFT('Arş. Gör. Ön. Değ.'!C64,2)&REPT(\"*\",3),LEFT('Arş. Gör. Ön. Değ.'!C64,2)&REPT(\"*\",3)&\" \"&MID('Arş. Gör. Ön. Değ.'!C64,FIND(\" \",'Arş. Gör. Ön. Değ.'!C64)+1,2)&REPT(\"*\",3)))","v":""},{"$f":"IF('Arş. Gör. Ön. Değ.'!D64=\"\",\"\",IF(ISERR(FIND(\" \",'Arş. Gör. Ön. Değ.'!D64))=TRUE,LEFT('Arş. Gör. Ön. Değ.'!D64,2)&REPT(\"*\",3),LEFT('Arş. Gör. Ön. Değ.'!D64,2)&REPT(\"*\",3)&\" \"&MID('Arş. Gör. Ön. Değ.'!D64,FIND(\" \",'Arş. Gör. Ön. Değ.'!D64)+1,2)&REPT(\"*\",3)))","v":""},{"$f":"IF('Arş. Gör. Ön. Değ.'!E64=\"\",\"\",'Arş. Gör. Ön. Değ.'!E64)","v":""},{"$f":"IF('Arş. Gör. Ön. Değ.'!F64=\"\",\"\",'Arş. Gör. Ön. Değ.'!F64)","v":""},{"$f":"IF('Arş. Gör. Ön. Değ.'!G64=\"\",\"\",'Arş. Gör. Ön. Değ.'!G64)","v":""},{"$f":"IF('Arş. Gör. Ön. Değ.'!H64=\"\",\"\",'Arş. Gör. Ön. Değ.'!H64)","v":""},{"$f":"IF('Arş. Gör. Ön. Değ.'!I64=\"\",\"\",'Arş. Gör. Ön. Değ.'!I64)","v":""},{"$f":"IF('Arş. Gör. Ön. Değ.'!J64=\"\",\"\",'Arş. Gör. Ön. Değ.'!J64)","v":""},{"$f":"IF('Arş. Gör. Ön. Değ.'!K64=\"\",\"\",'Arş. Gör. Ön. Değ.'!K64)","v":""}]
[{"$f":"IF('Arş. Gör. Ön. Değ.'!A65=\"\",\"\",'Arş. Gör. Ön. Değ.'!A65)","v":""},{"$f":"IF('Arş. Gör. Ön. Değ.'!B65=\"\",\"\",LEFT('Arş. Gör. Ön. Değ.'!B65,3)&REPT(\"*\",4)&RIGHT('Arş. Gör. Ön. Değ.'!B65,2))","v":""},{"$f":"IF('Arş. Gör. Ön. Değ.'!C65=\"\",\"\",IF(ISERR(FIND(\" \",'Arş. Gör. Ön. Değ.'!C65))=TRUE,LEFT('Arş. Gör. Ön. Değ.'!C65,2)&REPT(\"*\",3),LEFT('Arş. Gör. Ön. Değ.'!C65,2)&REPT(\"*\",3)&\" \"&MID('Arş. Gör. Ön. Değ.'!C65,FIND(\" \",'Arş. Gör. Ön. Değ.'!C65)+1,2)&REPT(\"*\",3)))","v":""},{"$f":"IF('Arş. Gör. Ön. Değ.'!D65=\"\",\"\",IF(ISERR(FIND(\" \",'Arş. Gör. Ön. Değ.'!D65))=TRUE,LEFT('Arş. Gör. Ön. Değ.'!D65,2)&REPT(\"*\",3),LEFT('Arş. Gör. Ön. Değ.'!D65,2)&REPT(\"*\",3)&\" \"&MID('Arş. Gör. Ön. Değ.'!D65,FIND(\" \",'Arş. Gör. Ön. Değ.'!D65)+1,2)&REPT(\"*\",3)))","v":""},{"$f":"IF('Arş. Gör. Ön. Değ.'!E65=\"\",\"\",'Arş. Gör. Ön. Değ.'!E65)","v":""},{"$f":"IF('Arş. Gör. Ön. Değ.'!F65=\"\",\"\",'Arş. Gör. Ön. Değ.'!F65)","v":""},{"$f":"IF('Arş. Gör. Ön. Değ.'!G65=\"\",\"\",'Arş. Gör. Ön. Değ.'!G65)","v":""},{"$f":"IF('Arş. Gör. Ön. Değ.'!H65=\"\",\"\",'Arş. Gör. Ön. Değ.'!H65)","v":""},{"$f":"IF('Arş. Gör. Ön. Değ.'!I65=\"\",\"\",'Arş. Gör. Ön. Değ.'!I65)","v":""},{"$f":"IF('Arş. Gör. Ön. Değ.'!J65=\"\",\"\",'Arş. Gör. Ön. Değ.'!J65)","v":""},{"$f":"IF('Arş. Gör. Ön. Değ.'!K65=\"\",\"\",'Arş. Gör. Ön. Değ.'!K65)","v":""}]
[{"$f":"IF('Arş. Gör. Ön. Değ.'!A66=\"\",\"\",'Arş. Gör. Ön. Değ.'!A66)","v":""},{"$f":"IF('Arş. Gör. Ön. Değ.'!B66=\"\",\"\",LEFT('Arş. Gör. Ön. Değ.'!B66,3)&REPT(\"*\",4)&RIGHT('Arş. Gör. Ön. Değ.'!B66,2))","v":""},{"$f":"IF('Arş. Gör. Ön. Değ.'!C66=\"\",\"\",IF(ISERR(FIND(\" \",'Arş. Gör. Ön. Değ.'!C66))=TRUE,LEFT('Arş. Gör. Ön. Değ.'!C66,2)&REPT(\"*\",3),LEFT('Arş. Gör. Ön. Değ.'!C66,2)&REPT(\"*\",3)&\" \"&MID('Arş. Gör. Ön. Değ.'!C66,FIND(\" \",'Arş. Gör. Ön. Değ.'!C66)+1,2)&REPT(\"*\",3)))","v":""},{"$f":"IF('Arş. Gör. Ön. Değ.'!D66=\"\",\"\",IF(ISERR(FIND(\" \",'Arş. Gör. Ön. Değ.'!D66))=TRUE,LEFT('Arş. Gör. Ön. Değ.'!D66,2)&REPT(\"*\",3),LEFT('Arş. Gör. Ön. Değ.'!D66,2)&REPT(\"*\",3)&\" \"&MID('Arş. Gör. Ön. Değ.'!D66,FIND(\" \",'Arş. Gör. Ön. Değ.'!D66)+1,2)&REPT(\"*\",3)))","v":""},{"$f":"IF('Arş. Gör. Ön. Değ.'!E66=\"\",\"\",'Arş. Gör. Ön. Değ.'!E66)","v":""},{"$f":"IF('Arş. Gör. Ön. Değ.'!F66=\"\",\"\",'Arş. Gör. Ön. Değ.'!F66)","v":""},{"$f":"IF('Arş. Gör. Ön. Değ.'!G66=\"\",\"\",'Arş. Gör. Ön. Değ.'!G66)","v":""},{"$f":"IF('Arş. Gör. Ön. Değ.'!H66=\"\",\"\",'Arş. Gör. Ön. Değ.'!H66)","v":""},{"$f":"IF('Arş. Gör. Ön. Değ.'!I66=\"\",\"\",'Arş. Gör. Ön. Değ.'!I66)","v":""},{"$f":"IF('Arş. Gör. Ön. Değ.'!J66=\"\",\"\",'Arş. Gör. Ön. Değ.'!J66)","v":""},{"$f":"IF('Arş. Gör. Ön. Değ.'!K66=\"\",\"\",'Arş. Gör. Ön. Değ.'!K66)","v":""}]
[{"$f":"IF('Arş. Gör. Ön. Değ.'!A67=\"\",\"\",'Arş. Gör. Ön. Değ.'!A67)","v":""},{"$f":"IF('Arş. Gör. Ön. Değ.'!B67=\"\",\"\",LEFT('Arş. Gör. Ön. Değ.'!B67,3)&REPT(\"*\",4)&RIGHT('Arş. Gör. Ön. Değ.'!B67,2))","v":""},{"$f":"IF('Arş. Gör. Ön. Değ.'!C67=\"\",\"\",IF(ISERR(FIND(\" \",'Arş. Gör. Ön. Değ.'!C67))=TRUE,LEFT('Arş. Gör. Ön. Değ.'!C67,2)&REPT(\"*\",3),LEFT('Arş. Gör. Ön. Değ.'!C67,2)&REPT(\"*\",3)&\" \"&MID('Arş. Gör. Ön. Değ.'!C67,FIND(\" \",'Arş. Gör. Ön. Değ.'!C67)+1,2)&REPT(\"*\",3)))","v":""},{"$f":"IF('Arş. Gör. Ön. Değ.'!D67=\"\",\"\",IF(ISERR(FIND(\" \",'Arş. Gör. Ön. Değ.'!D67))=TRUE,LEFT('Arş. Gör. Ön. Değ.'!D67,2)&REPT(\"*\",3),LEFT('Arş. Gör. Ön. Değ.'!D67,2)&REPT(\"*\",3)&\" \"&MID('Arş. Gör. Ön. Değ.'!D67,FIND(\" \",'Arş. Gör. Ön. Değ.'!D67)+1,2)&REPT(\"*\",3)))","v":""},{"$f":"IF('Arş. Gör. Ön. Değ.'!E67=\"\",\"\",'Arş. Gör. Ön. Değ.'!E67)","v":""},{"$f":"IF('Arş. Gör. Ön. Değ.'!F67=\"\",\"\",'Arş. Gör. Ön. Değ.'!F67)","v":""},{"$f":"IF('Arş. Gör. Ön. Değ.'!G67=\"\",\"\",'Arş. Gör. Ön. Değ.'!G67)","v":""},{"$f":"IF('Arş. Gör. Ön. Değ.'!H67=\"\",\"\",'Arş. Gör. Ön. Değ.'!H67)","v":""},{"$f":"IF('Arş. Gör. Ön. Değ.'!I67=\"\",\"\",'Arş. Gör. Ön. Değ.'!I67)","v":""},{"$f":"IF('Arş. Gör. Ön. Değ.'!J67=\"\",\"\",'Arş. Gör. Ön. Değ.'!J67)","v":""},{"$f":"IF('Arş. Gör. Ön. Değ.'!K67=\"\",\"\",'Arş. Gör. Ön. Değ.'!K67)","v":""}]
[{"$f":"IF('Arş. Gör. Ön. Değ.'!A68=\"\",\"\",'Arş. Gör. Ön. Değ.'!A68)","v":""},{"$f":"IF('Arş. Gör. Ön. Değ.'!B68=\"\",\"\",LEFT('Arş. Gör. Ön. Değ.'!B68,3)&REPT(\"*\",4)&RIGHT('Arş. Gör. Ön. Değ.'!B68,2))","v":""},{"$f":"IF('Arş. Gör. Ön. Değ.'!C68=\"\",\"\",IF(ISERR(FIND(\" \",'Arş. Gör. Ön. Değ.'!C68))=TRUE,LEFT('Arş. Gör. Ön. Değ.'!C68,2)&REPT(\"*\",3),LEFT('Arş. Gör. Ön. Değ.'!C68,2)&REPT(\"*\",3)&\" \"&MID('Arş. Gör. Ön. Değ.'!C68,FIND(\" \",'Arş. Gör. Ön. Değ.'!C68)+1,2)&REPT(\"*\",3)))","v":""},{"$f":"IF('Arş. Gör. Ön. Değ.'!D68=\"\",\"\",IF(ISERR(FIND(\" \",'Arş. Gör. Ön. Değ.'!D68))=TRUE,LEFT('Arş. Gör. Ön. Değ.'!D68,2)&REPT(\"*\",3),LEFT('Arş. Gör. Ön. Değ.'!D68,2)&REPT(\"*\",3)&\" \"&MID('Arş. Gör. Ön. Değ.'!D68,FIND(\" \",'Arş. Gör. Ön. Değ.'!D68)+1,2)&REPT(\"*\",3)))","v":""},{"$f":"IF('Arş. Gör. Ön. Değ.'!E68=\"\",\"\",'Arş. Gör. Ön. Değ.'!E68)","v":""},{"$f":"IF('Arş. Gör. Ön. Değ.'!F68=\"\",\"\",'Arş. Gör. Ön. Değ.'!F68)","v":""},{"$f":"IF('Arş. Gör. Ön. Değ.'!G68=\"\",\"\",'Arş. Gör. Ön. Değ.'!G68)","v":""},{"$f":"IF('Arş. Gör. Ön. Değ.'!H68=\"\",\"\",'Arş. Gör. Ön. Değ.'!H68)","v":""},{"$f":"IF('Arş. Gör. Ön. Değ.'!I68=\"\",\"\",'Arş. Gör. Ön. Değ.'!I68)","v":""},{"$f":"IF('Arş. Gör. Ön. Değ.'!J68=\"\",\"\",'Arş. Gör. Ön. Değ.'!J68)","v":""},{"$f":"IF('Arş. Gör. Ön. Değ.'!K68=\"\",\"\",'Arş. Gör. Ön. Değ.'!K68)","v":""}]
[{"$f":"IF('Arş. Gör. Ön. Değ.'!A69=\"\",\"\",'Arş. Gör. Ön. Değ.'!A69)","v":""},{"$f":"IF('Arş. Gör. Ön. Değ.'!B69=\"\",\"\",LEFT('Arş. Gör. Ön. Değ.'!B69,3)&REPT(\"*\",4)&RIGHT('Arş. Gör. Ön. Değ.'!B69,2))","v":""},{"$f":"IF('Arş. Gör. Ön. Değ.'!C69=\"\",\"\",IF(ISERR(FIND(\" \",'Arş. Gör. Ön. Değ.'!C69))=TRUE,LEFT('Arş. Gör. Ön. Değ.'!C69,2)&REPT(\"*\",3),LEFT('Arş. Gör. Ön. Değ.'!C69,2)&REPT(\"*\",3)&\" \"&MID('Arş. Gör. Ön. Değ.'!C69,FIND(\" \",'Arş. Gör. Ön. Değ.'!C69)+1,2)&REPT(\"*\",3)))","v":""},{"$f":"IF('Arş. Gör. Ön. Değ.'!D69=\"\",\"\",IF(ISERR(FIND(\" \",'Arş. Gör. Ön. Değ.'!D69))=TRUE,LEFT('Arş. Gör. Ön. Değ.'!D69,2)&REPT(\"*\",3),LEFT('Arş. Gör. Ön. Değ.'!D69,2)&REPT(\"*\",3)&\" \"&MID('Arş. Gör. Ön. Değ.'!D69,FIND(\" \",'Arş. Gör. Ön. Değ.'!D69)+1,2)&REPT(\"*\",3)))","v":""},{"$f":"IF('Arş. Gör. Ön. Değ.'!E69=\"\",\"\",'Arş. Gör. Ön. Değ.'!E69)","v":""},{"$f":"IF('Arş. Gör. Ön. Değ.'!F69=\"\",\"\",'Arş. Gör. Ön. Değ.'!F69)","v":""},{"$f":"IF('Arş. Gör. Ön. Değ.'!G69=\"\",\"\",'Arş. Gör. Ön. Değ.'!G69)","v":""},{"$f":"IF('Arş. Gör. Ön. Değ.'!H69=\"\",\"\",'Arş. Gör. Ön. Değ.'!H69)","v":""},{"$f":"IF('Arş. Gör. Ön. Değ.'!I69=\"\",\"\",'Arş. Gör. Ön. Değ.'!I69)","v":""},{"$f":"IF('Arş. Gör. Ön. Değ.'!J69=\"\",\"\",'Arş. Gör. Ön. Değ.'!J69)","v":""},{"$f":"IF('Arş. Gör. Ön. Değ.'!K69=\"\",\"\",'Arş. Gör. Ön. Değ.'!K69)","v":""}]
[{"$f":"IF('Arş. Gör. Ön. Değ.'!A70=\"\",\"\",'Arş. Gör. Ön. Değ.'!A70)","v":""},{"$f":"IF('Arş. Gör. Ön. Değ.'!B70=\"\",\"\",LEFT('Arş. Gör. Ön. Değ.'!B70,3)&REPT(\"*\",4)&RIGHT('Arş. Gör. Ön. Değ.'!B70,2))","v":""},{"$f":"IF('Arş. Gör. Ön. Değ.'!C70=\"\",\"\",IF(ISERR(FIND(\" \",'Arş. Gör. Ön. Değ.'!C70))=TRUE,LEFT('Arş. Gör. Ön. Değ.'!C70,2)&REPT(\"*\",3),LEFT('Arş. Gör. Ön. Değ.'!C70,2)&REPT(\"*\",3)&\" \"&MID('Arş. Gör. Ön. Değ.'!C70,FIND(\" \",'Arş. Gör. Ön. Değ.'!C70)+1,2)&REPT(\"*\",3)))","v":""},{"$f":"IF('Arş. Gör. Ön. Değ.'!D70=\"\",\"\",IF(ISERR(FIND(\" \",'Arş. Gör. Ön. Değ.'!D70))=TRUE,LEFT('Arş. Gör. Ön. Değ.'!D70,2)&REPT(\"*\",3),LEFT('Arş. Gör. Ön. Değ.'!D70,2)&REPT(\"*\",3)&\" \"&MID('Arş. Gör. Ön. Değ.'!D70,FIND(\" \",'Arş. Gör. Ön. Değ.'!D70)+1,2)&REPT(\"*\",3)))","v":""},{"$f":"IF('Arş. Gör. Ön. Değ.'!E70=\"\",\"\",'Arş. Gör. Ön. Değ.'!E70)","v":""},{"$f":"IF('Arş. Gör. Ön. Değ.'!F70=\"\",\"\",'Arş. Gör. Ön. Değ.'!F70)","v":""},{"$f":"IF('Arş. Gör. Ön. Değ.'!G70=\"\",\"\",'Arş. Gör. Ön. Değ.'!G70)","v":""},{"$f":"IF('Arş. Gör. Ön. Değ.'!H70=\"\",\"\",'Arş. Gör. Ön. Değ.'!H70)","v":""},{"$f":"IF('Arş. Gör. Ön. Değ.'!I70=\"\",\"\",'Arş. Gör. Ön. Değ.'!I70)","v":""},{"$f":"IF('Arş. Gör. Ön. Değ.'!J70=\"\",\"\",'Arş. Gör. Ön. Değ.'!J70)","v":""},{"$f":"IF('Arş. Gör. Ön. Değ.'!K70=\"\",\"\",'Arş. Gör. Ön. Değ.'!K70)","v":""}]
[{"$f":"IF('Arş. Gör. Ön. Değ.'!A71=\"\",\"\",'Arş. Gör. Ön. Değ.'!A71)","v":""},{"$f":"IF('Arş. Gör. Ön. Değ.'!B71=\"\",\"\",LEFT('Arş. Gör. Ön. Değ.'!B71,3)&REPT(\"*\",4)&RIGHT('Arş. Gör. Ön. Değ.'!B71,2))","v":""},{"$f":"IF('Arş. Gör. Ön. Değ.'!C71=\"\",\"\",IF(ISERR(FIND(\" \",'Arş. Gör. Ön. Değ.'!C71))=TRUE,LEFT('Arş. Gör. Ön. Değ.'!C71,2)&REPT(\"*\",3),LEFT('Arş. Gör. Ön. Değ.'!C71,2)&REPT(\"*\",3)&\" \"&MID('Arş. Gör. Ön. Değ.'!C71,FIND(\" \",'Arş. Gör. Ön. Değ.'!C71)+1,2)&REPT(\"*\",3)))","v":""},{"$f":"IF('Arş. Gör. Ön. Değ.'!D71=\"\",\"\",IF(ISERR(FIND(\" \",'Arş. Gör. Ön. Değ.'!D71))=TRUE,LEFT('Arş. Gör. Ön. Değ.'!D71,2)&REPT(\"*\",3),LEFT('Arş. Gör. Ön. Değ.'!D71,2)&REPT(\"*\",3)&\" \"&MID('Arş. Gör. Ön. Değ.'!D71,FIND(\" \",'Arş. Gör. Ön. Değ.'!D71)+1,2)&REPT(\"*\",3)))","v":""},{"$f":"IF('Arş. Gör. Ön. Değ.'!E71=\"\",\"\",'Arş. Gör. Ön. Değ.'!E71)","v":""},{"$f":"IF('Arş. Gör. Ön. Değ.'!F71=\"\",\"\",'Arş. Gör. Ön. Değ.'!F71)","v":""},{"$f":"IF('Arş. Gör. Ön. Değ.'!G71=\"\",\"\",'Arş. Gör. Ön. Değ.'!G71)","v":""},{"$f":"IF('Arş. Gör. Ön. Değ.'!H71=\"\",\"\",'Arş. Gör. Ön. Değ.'!H71)","v":""},{"$f":"IF('Arş. Gör. Ön. Değ.'!I71=\"\",\"\",'Arş. Gör. Ön. Değ.'!I71)","v":""},{"$f":"IF('Arş. Gör. Ön. Değ.'!J71=\"\",\"\",'Arş. Gör. Ön. Değ.'!J71)","v":""},{"$f":"IF('Arş. Gör. Ön. Değ.'!K71=\"\",\"\",'Arş. Gör. Ön. Değ.'!K71)","v":""}]
[{"$f":"IF('Arş. Gör. Ön. Değ.'!A72=\"\",\"\",'Arş. Gör. Ön. Değ.'!A72)","v":""},{"$f":"IF('Arş. Gör. Ön. Değ.'!B72=\"\",\"\",LEFT('Arş. Gör. Ön. Değ.'!B72,3)&REPT(\"*\",4)&RIGHT('Arş. Gör. Ön. Değ.'!B72,2))","v":""},{"$f":"IF('Arş. Gör. Ön. Değ.'!C72=\"\",\"\",IF(ISERR(FIND(\" \",'Arş. Gör. Ön. Değ.'!C72))=TRUE,LEFT('Arş. Gör. Ön. Değ.'!C72,2)&REPT(\"*\",3),LEFT('Arş. Gör. Ön. Değ.'!C72,2)&REPT(\"*\",3)&\" \"&MID('Arş. Gör. Ön. Değ.'!C72,FIND(\" \",'Arş. Gör. Ön. Değ.'!C72)+1,2)&REPT(\"*\",3)))","v":""},{"$f":"IF('Arş. Gör. Ön. Değ.'!D72=\"\",\"\",IF(ISERR(FIND(\" \",'Arş. Gör. Ön. Değ.'!D72))=TRUE,LEFT('Arş. Gör. Ön. Değ.'!D72,2)&REPT(\"*\",3),LEFT('Arş. Gör. Ön. Değ.'!D72,2)&REPT(\"*\",3)&\" \"&MID('Arş. Gör. Ön. Değ.'!D72,FIND(\" \",'Arş. Gör. Ön. Değ.'!D72)+1,2)&REPT(\"*\",3)))","v":""},{"$f":"IF('Arş. Gör. Ön. Değ.'!E72=\"\",\"\",'Arş. Gör. Ön. Değ.'!E72)","v":""},{"$f":"IF('Arş. Gör. Ön. Değ.'!F72=\"\",\"\",'Arş. Gör. Ön. Değ.'!F72)","v":""},{"$f":"IF('Arş. Gör. Ön. Değ.'!G72=\"\",\"\",'Arş. Gör. Ön. Değ.'!G72)","v":""},{"$f":"IF('Arş. Gör. Ön. Değ.'!H72=\"\",\"\",'Arş. Gör. Ön. Değ.'!H72)","v":""},{"$f":"IF('Arş. Gör. Ön. Değ.'!I72=\"\",\"\",'Arş. Gör. Ön. Değ.'!I72)","v":""},{"$f":"IF('Arş. Gör. Ön. Değ.'!J72=\"\",\"\",'Arş. Gör. Ön. Değ.'!J72)","v":""},{"$f":"IF('Arş. Gör. Ön. Değ.'!K72=\"\",\"\",'Arş. Gör. Ön. Değ.'!K72)","v":""}]
[{"$f":"IF('Arş. Gör. Ön. Değ.'!A73=\"\",\"\",'Arş. Gör. Ön. Değ.'!A73)","v":""},{"$f":"IF('Arş. Gör. Ön. Değ.'!B73=\"\",\"\",LEFT('Arş. Gör. Ön. Değ.'!B73,3)&REPT(\"*\",4)&RIGHT('Arş. Gör. Ön. Değ.'!B73,2))","v":""},{"$f":"IF('Arş. Gör. Ön. Değ.'!C73=\"\",\"\",IF(ISERR(FIND(\" \",'Arş. Gör. Ön. Değ.'!C73))=TRUE,LEFT('Arş. Gör. Ön. Değ.'!C73,2)&REPT(\"*\",3),LEFT('Arş. Gör. Ön. Değ.'!C73,2)&REPT(\"*\",3)&\" \"&MID('Arş. Gör. Ön. Değ.'!C73,FIND(\" \",'Arş. Gör. Ön. Değ.'!C73)+1,2)&REPT(\"*\",3)))","v":""},{"$f":"IF('Arş. Gör. Ön. Değ.'!D73=\"\",\"\",IF(ISERR(FIND(\" \",'Arş. Gör. Ön. Değ.'!D73))=TRUE,LEFT('Arş. Gör. Ön. Değ.'!D73,2)&REPT(\"*\",3),LEFT('Arş. Gör. Ön. Değ.'!D73,2)&REPT(\"*\",3)&\" \"&MID('Arş. Gör. Ön. Değ.'!D73,FIND(\" \",'Arş. Gör. Ön. Değ.'!D73)+1,2)&REPT(\"*\",3)))","v":""},{"$f":"IF('Arş. Gör. Ön. Değ.'!E73=\"\",\"\",'Arş. Gör. Ön. Değ.'!E73)","v":""},{"$f":"IF('Arş. Gör. Ön. Değ.'!F73=\"\",\"\",'Arş. Gör. Ön. Değ.'!F73)","v":""},{"$f":"IF('Arş. Gör. Ön. Değ.'!G73=\"\",\"\",'Arş. Gör. Ön. Değ.'!G73)","v":""},{"$f":"IF('Arş. Gör. Ön. Değ.'!H73=\"\",\"\",'Arş. Gör. Ön. Değ.'!H73)","v":""},{"$f":"IF('Arş. Gör. Ön. Değ.'!I73=\"\",\"\",'Arş. Gör. Ön. Değ.'!I73)","v":""},{"$f":"IF('Arş. Gör. Ön. Değ.'!J73=\"\",\"\",'Arş. Gör. Ön. Değ.'!J73)","v":""},{"$f":"IF('Arş. Gör. Ön. Değ.'!K73=\"\",\"\",'Arş. Gör. Ön. Değ.'!K73)","v":""}]
[{"$f":"IF('Arş. Gör. Ön. Değ.'!A74=\"\",\"\",'Arş. Gör. Ön. Değ.'!A74)","v":""},{"$f":"IF('Arş. Gör. Ön. Değ.'!B74=\"\",\"\",LEFT('Arş. Gör. Ön. Değ.'!B74,3)&REPT(\"*\",4)&RIGHT('Arş. Gör. Ön. Değ.'!B74,2))","v":""},{"$f":"IF('Arş. Gör. Ön. Değ.'!C74=\"\",\"\",IF(ISERR(FIND(\" \",'Arş. Gör. Ön. Değ.'!C74))=TRUE,LEFT('Arş. Gör. Ön. Değ.'!C74,2)&REPT(\"*\",3),LEFT('Arş. Gör. Ön. Değ.'!C74,2)&REPT(\"*\",3)&\" \"&MID('Arş. Gör. Ön. Değ.'!C74,FIND(\" \",'Arş. Gör. Ön. Değ.'!C74)+1,2)&REPT(\"*\",3)))","v":""},{"$f":"IF('Arş. Gör. Ön. Değ.'!D74=\"\",\"\",IF(ISERR(FIND(\" \",'Arş. Gör. Ön. Değ.'!D74))=TRUE,LEFT('Arş. Gör. Ön. Değ.'!D74,2)&REPT(\"*\",3),LEFT('Arş. Gör. Ön. Değ.'!D74,2)&REPT(\"*\",3)&\" \"&MID('Arş. Gör. Ön. Değ.'!D74,FIND(\" \",'Arş. Gör. Ön. Değ.'!D74)+1,2)&REPT(\"*\",3)))","v":""},{"$f":"IF('Arş. Gör. Ön. Değ.'!E74=\"\",\"\",'Arş. Gör. Ön. Değ.'!E74)","v":""},{"$f":"IF('Arş. Gör. Ön. Değ.'!F74=\"\",\"\",'Arş. Gör. Ön. Değ.'!F74)","v":""},{"$f":"IF('Arş. Gör. Ön. Değ.'!G74=\"\",\"\",'Arş. Gör. Ön. Değ.'!G74)","v":""},{"$f":"IF('Arş. Gör. Ön. Değ.'!H74=\"\",\"\",'Arş. Gör. Ön. Değ.'!H74)","v":""},{"$f":"IF('Arş. Gör. Ön. Değ.'!I74=\"\",\"\",'Arş. Gör. Ön. Değ.'!I74)","v":""},{"$f":"IF('Arş. Gör. Ön. Değ.'!J74=\"\",\"\",'Arş. Gör. Ön. Değ.'!J74)","v":""},{"$f":"IF('Arş. Gör. Ön. Değ.'!K74=\"\",\"\",'Arş. Gör. Ön. Değ.'!K74)","v":""}]
[{"$f":"IF('Arş. Gör. Ön. Değ.'!A75=\"\",\"\",'Arş. Gör. Ön. Değ.'!A75)","v":""},{"$f":"IF('Arş. Gör. Ön. Değ.'!B75=\"\",\"\",LEFT('Arş. Gör. Ön. Değ.'!B75,3)&REPT(\"*\",4)&RIGHT('Arş. Gör. Ön. Değ.'!B75,2))","v":""},{"$f":"IF('Arş. Gör. Ön. Değ.'!C75=\"\",\"\",IF(ISERR(FIND(\" \",'Arş. Gör. Ön. Değ.'!C75))=TRUE,LEFT('Arş. Gör. Ön. Değ.'!C75,2)&REPT(\"*\",3),LEFT('Arş. Gör. Ön. Değ.'!C75,2)&REPT(\"*\",3)&\" \"&MID('Arş. Gör. Ön. Değ.'!C75,FIND(\" \",'Arş. Gör. Ön. Değ.'!C75)+1,2)&REPT(\"*\",3)))","v":""},{"$f":"IF('Arş. Gör. Ön. Değ.'!D75=\"\",\"\",IF(ISERR(FIND(\" \",'Arş. Gör. Ön. Değ.'!D75))=TRUE,LEFT('Arş. Gör. Ön. Değ.'!D75,2)&REPT(\"*\",3),LEFT('Arş. Gör. Ön. Değ.'!D75,2)&REPT(\"*\",3)&\" \"&MID('Arş. Gör. Ön. Değ.'!D75,FIND(\" \",'Arş. Gör. Ön. Değ.'!D75)+1,2)&REPT(\"*\",3)))","v":""},{"$f":"IF('Arş. Gör. Ön. Değ.'!E75=\"\",\"\",'Arş. Gör. Ön. Değ.'!E75)","v":""},{"$f":"IF('Arş. Gör. Ön. Değ.'!F75=\"\",\"\",'Arş. Gör. Ön. Değ.'!F75)","v":""},{"$f":"IF('Arş. Gör. Ön. Değ.'!G75=\"\",\"\",'Arş. Gör. Ön. Değ.'!G75)","v":""},{"$f":"IF('Arş. Gör. Ön. Değ.'!H75=\"\",\"\",'Arş. Gör. Ön. Değ.'!H75)","v":""},{"$f":"IF('Arş. Gör. Ön. Değ.'!I75=\"\",\"\",'Arş. Gör. Ön. Değ.'!I75)","v":""},{"$f":"IF('Arş. Gör. Ön. Değ.'!J75=\"\",\"\",'Arş. Gör. Ön. Değ.'!J75)","v":""},{"$f":"IF('Arş. Gör. Ön. Değ.'!K75=\"\",\"\",'Arş. Gör. Ön. Değ.'!K75)","v":""}]

{"sheet":"Arş.Gör. Sonuç","index":2,"n_rows":16,"n_cols":14,"rows_kept":16,"cut":false,"hidden":false,"merged":[[9,12,10,12],[9,13,10,13],[9,0,10,0],[9,1,9,3],[9,4,9,5],[9,6,9,7],[9,8,9,9],[9,10,9,11],[8,0,8,1],[8,2,8,13],[5,0,5,1],[5,2,5,5],[5,6,5,8],[5,9,5,13],[6,0,6,1],[6,2,6,5],[6,6,6,8],[6,9,6,13],[7,0,7,1],[7,2,7,5],[7,6,7,8],[7,9,7,10],[7,11,7,12],[0,0,0,13],[1,0,1,13],[2,0,2,13],[3,0,3,13],[4,0,4,1],[4,2,4,5],[4,6,4,8],[4,9,4,13]]}
["T.C."]
["BAYBURT ÜNİVERSİTESİ"]
["GİRİŞ SINAVI SONUÇ TUTANAĞI"]
[" Üniversitemize bağlı birimlere, 2547 sayılı Kanunun ilgili maddeleri ve 09.11.2018 tarih ve 30590 sayılı Resmi Gazetede yayımlanan \"Öğretim Üyesi Dışındaki Öğretim Elemanı Kadrolarına Naklen veya Açıktan Yapılacak Atamalarda Uygulanacak Merkezi Sınav ile Giriş Sınavlarına İlişkin Usul ve Esaslar Hakkında Yönetmelik” 11. ve 12. maddeleri hükümleri uyarınca yapılan Giriş Sınavında başarılı olan adayların isimleri aşağıda belirtilmiştir."]
["İlan No:",null,null,null,null,null,"Birimi:",null,null,"….. Fakültesi / Yüksekokulu"]
["İlan Tarihi:",null,"…/.../....",null,null,null,"Bölümü:",null,null,"….. Bölümü"]
["Kadro Unvanı:",null,"Araştırma Görevlisi / Öğretim Görevlisi (Ders Verecek / Uygulamalı Birim)",null,null,null,"Anabili Dalı:",null,null,"…… Anabilim Dalı"]
["Kadro Adedi:",null,1,null,null,null,"Sınav Tarihi:",null,null,"…/.../....",null,"Sonuç Tarihi:",null,"…/.../...."]
["İlan Özel Şartı:"]
["Sıra No","Başvuranın",null,null,"ALES Puanı",null,"Yabancı Dil Puanı",null,"Lisans Mezuniyet Notu",null,"Giriş Sınavı",null,"(A+B+C+D) Değerlendirme Notu","Sonuç"]
[null,"T.C. Kimlik No","Adı","Soyadı","Puanı","(A) Puanın %30' u","Puanı","(B) Puanın %10' u","100' lük Sistem ","(C) Notun %30' u","Giriş Sınav Notu","(D) Notunun %30' u"]
[1,11111111111,"Örnek","Örnek",82.513919999999999,{"$f":"E12*0.3","v":24.754175999999998},62.5,{"$f":"G12*0.1","v":6.25},76.66,{"$f":"I12*0.3","v":22.997999999999998},95,{"$f":"K12*0.3","v":28.5},{"$f":"F12+H12+J12+L12","v":82.502175999999992},"BAŞARILI (ASIL)"]
[2,11111111111,"Örnek Örnek","Örnek",85.030479999999997,{"$f":"E13*0.3","v":25.509143999999999},52.5,{"$f":"G13*0.1","v":5.25},76.66,{"$f":"I13*0.3","v":22.997999999999998},63,{"$f":"K13*0.3","v":18.899999999999999},{"$f":"F13+H13+J13+L13","v":72.657143999999988},"BAŞARILI (YEDEK)"]
[3,11111111111,"Örnek","Örnek Örnek",84.431349999999995,25.329404999999998,70,7,83.66,25.097999999999999,45,13.5,{"$f":"F14+H14+J14+L14","v":70.927404999999993},"YÖNETMELİK GEREĞİ ELENDİ*"]
[4,11111111111,"Örnek Örnek","Örnek Örnek",84.431349999999995,25.329404999999998,50,5,76.66,22.997999999999998,35,10.5,{"$f":"F15+H15+J15+L15","v":63.827404999999999},"BAŞARISIZ**"]
[5,11111111111,"Örnek","Örnek",84.431349999999995,25.329404999999998,70,7,83.66,25.097999999999999,"Sınava Girmedi","-","-","SINAVA GİRMEDİ"]

{"sheet":"Sonuç Rapor","index":3,"n_rows":103,"n_cols":14,"rows_kept":103,"cut":false,"hidden":false,"merged":[[9,12,10,12],[9,13,10,13],[9,0,10,0],[9,1,9,3],[9,4,9,5],[9,6,9,7],[9,8,9,9],[9,10,9,11],[8,0,8,1],[8,2,8,13],[5,0,5,1],[5,2,5,5],[5,6,5,8],[5,9,5,13],[6,0,6,1],[6,2,6,5],[6,6,6,8],[6,9,6,13],[7,0,7,1],[7,2,7,5],[7,6,7,8],[7,9,7,10],[7,11,7,12],[0,0,0,13],[1,0,1,13],[2,0,2,13],[3,0,3,13],[4,0,4,1],[4,2,4,5],[4,6,4,8],[4,9,4,13]]}
["T.C."]
["BAYBURT ÜNİVERSİTESİ"]
["GİRİŞ SINAVI SONUÇ TUTANAĞI"]
[" Üniversitemize bağlı birimlere, 2547 sayılı Kanunun ilgili maddeleri ve 09.11.2018 tarih ve 30590 sayılı Resmi Gazetede yayımlanan \"Öğretim Üyesi Dışındaki Öğretim Elemanı Kadrolarına Naklen veya Açıktan Yapılacak Atamalarda Uygulanacak Merkezi Sınav ile Giriş Sınavlarına İlişkin Usul ve Esaslar Hakkında Yönetmelik” 11. ve 12. maddeleri hükümleri uyarınca yapılan Giriş Sınavında başarılı olan adayların isimleri aşağıda belirtilmiştir."]
["İlan No:",null,{"$f":"IF('Arş.Gör. Sonuç'!C5=\"\",\"\",'Arş.Gör. Sonuç'!C5)","v":""},null,null,null,"Birimi:",null,null,{"$f":"IF('Arş.Gör. Sonuç'!J5=\"\",\"\",'Arş.Gör. Sonuç'!J5)","v":"….. Fakültesi / Yüksekokulu"}]
["İlan Tarihi:",null,{"$f":"IF('Arş.Gör. Sonuç'!C6=\"\",\"\",'Arş.Gör. Sonuç'!C6)","v":"…/.../...."},null,null,null,"Bölümü:",null,null,{"$f":"IF('Arş.Gör. Sonuç'!J6=\"\",\"\",'Arş.Gör. Sonuç'!J6)","v":"….. Bölümü"}]
["Kadro Unvanı:",null,{"$f":"IF('Arş.Gör. Sonuç'!C7=\"\",\"\",'Arş.Gör. Sonuç'!C7)","v":"Araştırma Görevlisi / Öğretim Görevlisi (Ders Verecek / Uygulamalı Birim)"},null,null,null,"Anabili Dalı:",null,null,{"$f":"IF('Arş.Gör. Sonuç'!J7=\"\",\"\",'Arş.Gör. Sonuç'!J7)","v":"…… Anabilim Dalı"}]
["Kadro Adedi:",null,{"$f":"IF('Arş.Gör. Sonuç'!C8=\"\",\"\",'Arş.Gör. Sonuç'!C8)","v":1},null,null,null,"Sınav Tarihi:",null,null,{"$f":"IF('Arş.Gör. Sonuç'!J8=\"\",\"\",'Arş.Gör. Sonuç'!J8)","v":"…/.../...."},null,"Sonuç Tarihi:",null,{"$f":"IF('Arş.Gör. Sonuç'!N8=\"\",\"\",'Arş.Gör. Sonuç'!N8)","v":"…/.../...."}]
["İlan Özel Şartı:",null,{"$f":"IF('Arş.Gör. Sonuç'!C9=\"\",\"\",'Arş.Gör. Sonuç'!C9)","v":""}]
["Sıra No","Başvuranın",null,null,"ALES Puanı",null,"Yabancı Dil Puanı",null,"Lisans Mezuniyet Notu",null,"Giriş Sınavı",null,"(A+B+C+D) Değerlendirme Notu","Sonuç"]
[null,"T.C. Kimlik No","Adı","Soyadı","Puanı","(A) Puanın %30' u","Puanı","(B) Puanın %10' u","100' lük Sistem ","(C) Notun %30' u","Giriş Sınav Notu","(D) Notunun %30' u"]
[{"$f":"IF('Arş.Gör. Sonuç'!A12=\"\",\"\",'Arş.Gör. Sonuç'!A12)","v":1},{"$f":"IF('Arş.Gör. Sonuç'!B12=\"\",\"\",LEFT('Arş.Gör. Sonuç'!B12,3)&REPT(\"*\",4)&RIGHT('Arş.Gör. Sonuç'!B12,2))","v":"111****11"},{"$f":"IF('Arş.Gör. Sonuç'!C12=\"\",\"\",IF(ISERR(FIND(\" \",'Arş.Gör. Sonuç'!C12))=TRUE,LEFT('Arş.Gör. Sonuç'!C12,2)&REPT(\"*\",3),LEFT('Arş.Gör. Sonuç'!C12,2)&REPT(\"*\",3)&\" \"&MID('Arş.Gör. Sonuç'!C12,FIND(\" \",'Arş.Gör. Sonuç'!C12)+1,2)&REPT(\"*\",3)))","v":"Ör***"},{"$f":"IF('Arş.Gör. Sonuç'!D12=\"\",\"\",IF(ISERR(FIND(\" \",'Arş.Gör. Sonuç'!D12))=TRUE,LEFT('Arş.Gör. Sonuç'!D12,2)&REPT(\"*\",3),LEFT('Arş.Gör. Sonuç'!D12,2)&REPT(\"*\",3)&\" \"&MID('Arş.Gör. Sonuç'!D12,FIND(\" \",'Arş.Gör. Sonuç'!D12)+1,2)&REPT(\"*\",3)))","v":"Ör***"},{"$f":"IF('Arş.Gör. Sonuç'!E12=\"\",\"\",'Arş.Gör. Sonuç'!E12)","v":82.513919999999999},{"$f":"IF('Arş.Gör. Sonuç'!F12=\"\",\"\",'Arş.Gör. Sonuç'!F12)","v":24.754175999999998},{"$f":"IF('Arş.Gör. Sonuç'!G12=\"\",\"\",'Arş.Gör. Sonuç'!G12)","v":62.5},{"$f":"IF('Arş.Gör. Sonuç'!H12=\"\",\"\",'Arş.Gör. Sonuç'!H12)","v":6.25},{"$f":"IF('Arş.Gör. Sonuç'!I12=\"\",\"\",'Arş.Gör. Sonuç'!I12)","v":76.66},{"$f":"IF('Arş.Gör. Sonuç'!J12=\"\",\"\",'Arş.Gör. Sonuç'!J12)","v":22.997999999999998},{"$f":"IF('Arş.Gör. Sonuç'!K12=\"\",\"\",'Arş.Gör. Sonuç'!K12)","v":95},{"$f":"IF('Arş.Gör. Sonuç'!L12=\"\",\"\",'Arş.Gör. Sonuç'!L12)","v":28.5},{"$f":"IF('Arş.Gör. Sonuç'!M12=\"\",\"\",'Arş.Gör. Sonuç'!M12)","v":82.502175999999992},{"$f":"IF('Arş.Gör. Sonuç'!N12=\"\",\"\",'Arş.Gör. Sonuç'!N12)","v":"BAŞARILI (ASIL)"}]
[{"$f":"IF('Arş.Gör. Sonuç'!A13=\"\",\"\",'Arş.Gör. Sonuç'!A13)","v":2},{"$f":"IF('Arş.Gör. Sonuç'!B13=\"\",\"\",LEFT('Arş.Gör. Sonuç'!B13,3)&REPT(\"*\",4)&RIGHT('Arş.Gör. Sonuç'!B13,2))","v":"111****11"},{"$f":"IF('Arş.Gör. Sonuç'!C13=\"\",\"\",IF(ISERR(FIND(\" \",'Arş.Gör. Sonuç'!C13))=TRUE,LEFT('Arş.Gör. Sonuç'!C13,2)&REPT(\"*\",3),LEFT('Arş.Gör. Sonuç'!C13,2)&REPT(\"*\",3)&\" \"&MID('Arş.Gör. Sonuç'!C13,FIND(\" \",'Arş.Gör. Sonuç'!C13)+1,2)&REPT(\"*\",3)))","v":"Ör*** Ör***"},{"$f":"IF('Arş.Gör. Sonuç'!D13=\"\",\"\",IF(ISERR(FIND(\" \",'Arş.Gör. Sonuç'!D13))=TRUE,LEFT('Arş.Gör. Sonuç'!D13,2)&REPT(\"*\",3),LEFT('Arş.Gör. Sonuç'!D13,2)&REPT(\"*\",3)&\" \"&MID('Arş.Gör. Sonuç'!D13,FIND(\" \",'Arş.Gör. Sonuç'!D13)+1,2)&REPT(\"*\",3)))","v":"Ör***"},{"$f":"IF('Arş.Gör. Sonuç'!E13=\"\",\"\",'Arş.Gör. Sonuç'!E13)","v":85.030479999999997},{"$f":"IF('Arş.Gör. Sonuç'!F13=\"\",\"\",'Arş.Gör. Sonuç'!F13)","v":25.509143999999999},{"$f":"IF('Arş.Gör. Sonuç'!G13=\"\",\"\",'Arş.Gör. Sonuç'!G13)","v":52.5},{"$f":"IF('Arş.Gör. Sonuç'!H13=\"\",\"\",'Arş.Gör. Sonuç'!H13)","v":5.25},{"$f":"IF('Arş.Gör. Sonuç'!I13=\"\",\"\",'Arş.Gör. Sonuç'!I13)","v":76.66},{"$f":"IF('Arş.Gör. Sonuç'!J13=\"\",\"\",'Arş.Gör. Sonuç'!J13)","v":22.997999999999998},{"$f":"IF('Arş.Gör. Sonuç'!K13=\"\",\"\",'Arş.Gör. Sonuç'!K13)","v":63},{"$f":"IF('Arş.Gör. Sonuç'!L13=\"\",\"\",'Arş.Gör. Sonuç'!L13)","v":18.899999999999999},{"$f":"IF('Arş.Gör. Sonuç'!M13=\"\",\"\",'Arş.Gör. Sonuç'!M13)","v":72.657143999999988},{"$f":"IF('Arş.Gör. Sonuç'!N13=\"\",\"\",'Arş.Gör. Sonuç'!N13)","v":"BAŞARILI (YEDEK)"}]
[{"$f":"IF('Arş.Gör. Sonuç'!A14=\"\",\"\",'Arş.Gör. Sonuç'!A14)","v":3},{"$f":"IF('Arş.Gör. Sonuç'!B14=\"\",\"\",LEFT('Arş.Gör. Sonuç'!B14,3)&REPT(\"*\",4)&RIGHT('Arş.Gör. Sonuç'!B14,2))","v":"111****11"},{"$f":"IF('Arş.Gör. Sonuç'!C14=\"\",\"\",IF(ISERR(FIND(\" \",'Arş.Gör. Sonuç'!C14))=TRUE,LEFT('Arş.Gör. Sonuç'!C14,2)&REPT(\"*\",3),LEFT('Arş.Gör. Sonuç'!C14,2)&REPT(\"*\",3)&\" \"&MID('Arş.Gör. Sonuç'!C14,FIND(\" \",'Arş.Gör. Sonuç'!C14)+1,2)&REPT(\"*\",3)))","v":"Ör***"},{"$f":"IF('Arş.Gör. Sonuç'!D14=\"\",\"\",IF(ISERR(FIND(\" \",'Arş.Gör. Sonuç'!D14))=TRUE,LEFT('Arş.Gör. Sonuç'!D14,2)&REPT(\"*\",3),LEFT('Arş.Gör. Sonuç'!D14,2)&REPT(\"*\",3)&\" \"&MID('Arş.Gör. Sonuç'!D14,FIND(\" \",'Arş.Gör. Sonuç'!D14)+1,2)&REPT(\"*\",3)))","v":"Ör*** Ör***"},{"$f":"IF('Arş.Gör. Sonuç'!E14=\"\",\"\",'Arş.Gör. Sonuç'!E14)","v":84.431349999999995},{"$f":"IF('Arş.Gör. Sonuç'!F14=\"\",\"\",'Arş.Gör. Sonuç'!F14)","v":25.329404999999998},{"$f":"IF('Arş.Gör. Sonuç'!G14=\"\",\"\",'Arş.Gör. Sonuç'!G14)","v":70},{"$f":"IF('Arş.Gör. Sonuç'!H14=\"\",\"\",'Arş.Gör. Sonuç'!H14)","v":7},{"$f":"IF('Arş.Gör. Sonuç'!I14=\"\",\"\",'Arş.Gör. Sonuç'!I14)","v":83.66},{"$f":"IF('Arş.Gör. Sonuç'!J14=\"\",\"\",'Arş.Gör. Sonuç'!J14)","v":25.097999999999999},{"$f":"IF('Arş.Gör. Sonuç'!K14=\"\",\"\",'Arş.Gör. Sonuç'!K14)","v":45},{"$f":"IF('Arş.Gör. Sonuç'!L14=\"\",\"\",'Arş.Gör. Sonuç'!L14)","v":13.5},{"$f":"IF('Arş.Gör. Sonuç'!M14=\"\",\"\",'Arş.Gör. Sonuç'!M14)","v":70.927404999999993},{"$f":"IF('Arş.Gör. Sonuç'!N14=\"\",\"\",'Arş.Gör. Sonuç'!N14)","v":"YÖNETMELİK GEREĞİ ELENDİ*"}]
[{"$f":"IF('Arş.Gör. Sonuç'!A15=\"\",\"\",'Arş.Gör. Sonuç'!A15)","v":4},{"$f":"IF('Arş.Gör. Sonuç'!B15=\"\",\"\",LEFT('Arş.Gör. Sonuç'!B15,3)&REPT(\"*\",4)&RIGHT('Arş.Gör. Sonuç'!B15,2))","v":"111****11"},{"$f":"IF('Arş.Gör. Sonuç'!C15=\"\",\"\",IF(ISERR(FIND(\" \",'Arş.Gör. Sonuç'!C15))=TRUE,LEFT('Arş.Gör. Sonuç'!C15,2)&REPT(\"*\",3),LEFT('Arş.Gör. Sonuç'!C15,2)&REPT(\"*\",3)&\" \"&MID('Arş.Gör. Sonuç'!C15,FIND(\" \",'Arş.Gör. Sonuç'!C15)+1,2)&REPT(\"*\",3)))","v":"Ör*** Ör***"},{"$f":"IF('Arş.Gör. Sonuç'!D15=\"\",\"\",IF(ISERR(FIND(\" \",'Arş.Gör. Sonuç'!D15))=TRUE,LEFT('Arş.Gör. Sonuç'!D15,2)&REPT(\"*\",3),LEFT('Arş.Gör. Sonuç'!D15,2)&REPT(\"*\",3)&\" \"&MID('Arş.Gör. Sonuç'!D15,FIND(\" \",'Arş.Gör. Sonuç'!D15)+1,2)&REPT(\"*\",3)))","v":"Ör*** Ör***"},{"$f":"IF('Arş.Gör. Sonuç'!E15=\"\",\"\",'Arş.Gör. Sonuç'!E15)","v":84.431349999999995},{"$f":"IF('Arş.Gör. Sonuç'!F15=\"\",\"\",'Arş.Gör. Sonuç'!F15)","v":25.329404999999998},{"$f":"IF('Arş.Gör. Sonuç'!G15=\"\",\"\",'Arş.Gör. Sonuç'!G15)","v":50},{"$f":"IF('Arş.Gör. Sonuç'!H15=\"\",\"\",'Arş.Gör. Sonuç'!H15)","v":5},{"$f":"IF('Arş.Gör. Sonuç'!I15=\"\",\"\",'Arş.Gör. Sonuç'!I15)","v":76.66},{"$f":"IF('Arş.Gör. Sonuç'!J15=\"\",\"\",'Arş.Gör. Sonuç'!J15)","v":22.997999999999998},{"$f":"IF('Arş.Gör. Sonuç'!K15=\"\",\"\",'Arş.Gör. Sonuç'!K15)","v":35},{"$f":"IF('Arş.Gör. Sonuç'!L15=\"\",\"\",'Arş.Gör. Sonuç'!L15)","v":10.5},{"$f":"IF('Arş.Gör. Sonuç'!M15=\"\",\"\",'Arş.Gör. Sonuç'!M15)","v":63.827404999999999},{"$f":"IF('Arş.Gör. Sonuç'!N15=\"\",\"\",'Arş.Gör. Sonuç'!N15)","v":"BAŞARISIZ**"}]
[{"$f":"IF('Arş.Gör. Sonuç'!A16=\"\",\"\",'Arş.Gör. Sonuç'!A16)","v":5},{"$f":"IF('Arş.Gör. Sonuç'!B16=\"\",\"\",LEFT('Arş.Gör. Sonuç'!B16,3)&REPT(\"*\",4)&RIGHT('Arş.Gör. Sonuç'!B16,2))","v":"111****11"},{"$f":"IF('Arş.Gör. Sonuç'!C16=\"\",\"\",IF(ISERR(FIND(\" \",'Arş.Gör. Sonuç'!C16))=TRUE,LEFT('Arş.Gör. Sonuç'!C16,2)&REPT(\"*\",3),LEFT('Arş.Gör. Sonuç'!C16,2)&REPT(\"*\",3)&\" \"&MID('Arş.Gör. Sonuç'!C16,FIND(\" \",'Arş.Gör. Sonuç'!C16)+1,2)&REPT(\"*\",3)))","v":"Ör***"},{"$f":"IF('Arş.Gör. Sonuç'!D16=\"\",\"\",IF(ISERR(FIND(\" \",'Arş.Gör. Sonuç'!D16))=TRUE,LEFT('Arş.Gör. Sonuç'!D16,2)&REPT(\"*\",3),LEFT('Arş.Gör. Sonuç'!D16,2)&REPT(\"*\",3)&\" \"&MID('Arş.Gör. Sonuç'!D16,FIND(\" \",'Arş.Gör. Sonuç'!D16)+1,2)&REPT(\"*\",3)))","v":"Ör***"},{"$f":"IF('Arş.Gör. Sonuç'!E16=\"\",\"\",'Arş.Gör. Sonuç'!E16)","v":84.431349999999995},{"$f":"IF('Arş.Gör. Sonuç'!F16=\"\",\"\",'Arş.Gör. Sonuç'!F16)","v":25.329404999999998},{"$f":"IF('Arş.Gör. Sonuç'!G16=\"\",\"\",'Arş.Gör. Sonuç'!G16)","v":70},{"$f":"IF('Arş.Gör. Sonuç'!H16=\"\",\"\",'Arş.Gör. Sonuç'!H16)","v":7},{"$f":"IF('Arş.Gör. Sonuç'!I16=\"\",\"\",'Arş.Gör. Sonuç'!I16)","v":83.66},{"$f":"IF('Arş.Gör. Sonuç'!J16=\"\",\"\",'Arş.Gör. Sonuç'!J16)","v":25.097999999999999},{"$f":"IF('Arş.Gör. Sonuç'!K16=\"\",\"\",'Arş.Gör. Sonuç'!K16)","v":"Sınava Girmedi"},{"$f":"IF('Arş.Gör. Sonuç'!L16=\"\",\"\",'Arş.Gör. Sonuç'!L16)","v":"-"},{"$f":"IF('Arş.Gör. Sonuç'!M16=\"\",\"\",'Arş.Gör. Sonuç'!M16)","v":"-"},{"$f":"IF('Arş.Gör. Sonuç'!N16=\"\",\"\",'Arş.Gör. Sonuç'!N16)","v":"SINAVA GİRMEDİ"}]
[{"$f":"IF('Arş.Gör. Sonuç'!A17=\"\",\"\",'Arş.Gör. Sonuç'!A17)","v":""},{"$f":"IF('Arş.Gör. Sonuç'!B17=\"\",\"\",LEFT('Arş.Gör. Sonuç'!B17,3)&REPT(\"*\",4)&RIGHT('Arş.Gör. Sonuç'!B17,2))","v":""},{"$f":"IF('Arş.Gör. Sonuç'!C17=\"\",\"\",IF(ISERR(FIND(\" \",'Arş.Gör. Sonuç'!C17))=TRUE,LEFT('Arş.Gör. Sonuç'!C17,2)&REPT(\"*\",3),LEFT('Arş.Gör. Sonuç'!C17,2)&REPT(\"*\",3)&\" \"&MID('Arş.Gör. Sonuç'!C17,FIND(\" \",'Arş.Gör. Sonuç'!C17)+1,2)&REPT(\"*\",3)))","v":""},{"$f":"IF('Arş.Gör. Sonuç'!D17=\"\",\"\",IF(ISERR(FIND(\" \",'Arş.Gör. Sonuç'!D17))=TRUE,LEFT('Arş.Gör. Sonuç'!D17,2)&REPT(\"*\",3),LEFT('Arş.Gör. Sonuç'!D17,2)&REPT(\"*\",3)&\" \"&MID('Arş.Gör. Sonuç'!D17,FIND(\" \",'Arş.Gör. Sonuç'!D17)+1,2)&REPT(\"*\",3)))","v":""},{"$f":"IF('Arş.Gör. Sonuç'!E17=\"\",\"\",'Arş.Gör. Sonuç'!E17)","v":""},{"$f":"IF('Arş.Gör. Sonuç'!F17=\"\",\"\",'Arş.Gör. Sonuç'!F17)","v":""},{"$f":"IF('Arş.Gör. Sonuç'!G17=\"\",\"\",'Arş.Gör. Sonuç'!G17)","v":""},{"$f":"IF('Arş.Gör. Sonuç'!H17=\"\",\"\",'Arş.Gör. Sonuç'!H17)","v":""},{"$f":"IF('Arş.Gör. Sonuç'!I17=\"\",\"\",'Arş.Gör. Sonuç'!I17)","v":""},{"$f":"IF('Arş.Gör. Sonuç'!J17=\"\",\"\",'Arş.Gör. Sonuç'!J17)","v":""},{"$f":"IF('Arş.Gör. Sonuç'!K17=\"\",\"\",'Arş.Gör. Sonuç'!K17)","v":""},{"$f":"IF('Arş.Gör. Sonuç'!L17=\"\",\"\",'Arş.Gör. Sonuç'!L17)","v":""},{"$f":"IF('Arş.Gör. Sonuç'!M17=\"\",\"\",'Arş.Gör. Sonuç'!M17)","v":""},{"$f":"IF('Arş.Gör. Sonuç'!N17=\"\",\"\",'Arş.Gör. Sonuç'!N17)","v":""}]
[{"$f":"IF('Arş.Gör. Sonuç'!A18=\"\",\"\",'Arş.Gör. Sonuç'!A18)","v":""},{"$f":"IF('Arş.Gör. Sonuç'!B18=\"\",\"\",LEFT('Arş.Gör. Sonuç'!B18,3)&REPT(\"*\",4)&RIGHT('Arş.Gör. Sonuç'!B18,2))","v":""},{"$f":"IF('Arş.Gör. Sonuç'!C18=\"\",\"\",IF(ISERR(FIND(\" \",'Arş.Gör. Sonuç'!C18))=TRUE,LEFT('Arş.Gör. Sonuç'!C18,2)&REPT(\"*\",3),LEFT('Arş.Gör. Sonuç'!C18,2)&REPT(\"*\",3)&\" \"&MID('Arş.Gör. Sonuç'!C18,FIND(\" \",'Arş.Gör. Sonuç'!C18)+1,2)&REPT(\"*\",3)))","v":""},{"$f":"IF('Arş.Gör. Sonuç'!D18=\"\",\"\",IF(ISERR(FIND(\" \",'Arş.Gör. Sonuç'!D18))=TRUE,LEFT('Arş.Gör. Sonuç'!D18,2)&REPT(\"*\",3),LEFT('Arş.Gör. Sonuç'!D18,2)&REPT(\"*\",3)&\" \"&MID('Arş.Gör. Sonuç'!D18,FIND(\" \",'Arş.Gör. Sonuç'!D18)+1,2)&REPT(\"*\",3)))","v":""},{"$f":"IF('Arş.Gör. Sonuç'!E18=\"\",\"\",'Arş.Gör. Sonuç'!E18)","v":""},{"$f":"IF('Arş.Gör. Sonuç'!F18=\"\",\"\",'Arş.Gör. Sonuç'!F18)","v":""},{"$f":"IF('Arş.Gör. Sonuç'!G18=\"\",\"\",'Arş.Gör. Sonuç'!G18)","v":""},{"$f":"IF('Arş.Gör. Sonuç'!H18=\"\",\"\",'Arş.Gör. Sonuç'!H18)","v":""},{"$f":"IF('Arş.Gör. Sonuç'!I18=\"\",\"\",'Arş.Gör. Sonuç'!I18)","v":""},{"$f":"IF('Arş.Gör. Sonuç'!J18=\"\",\"\",'Arş.Gör. Sonuç'!J18)","v":""},{"$f":"IF('Arş.Gör. Sonuç'!K18=\"\",\"\",'Arş.Gör. Sonuç'!K18)","v":""},{"$f":"IF('Arş.Gör. Sonuç'!L18=\"\",\"\",'Arş.Gör. Sonuç'!L18)","v":""},{"$f":"IF('Arş.Gör. Sonuç'!M18=\"\",\"\",'Arş.Gör. Sonuç'!M18)","v":""},{"$f":"IF('Arş.Gör. Sonuç'!N18=\"\",\"\",'Arş.Gör. Sonuç'!N18)","v":""}]
[{"$f":"IF('Arş.Gör. Sonuç'!A19=\"\",\"\",'Arş.Gör. Sonuç'!A19)","v":""},{"$f":"IF('Arş.Gör. Sonuç'!B19=\"\",\"\",LEFT('Arş.Gör. Sonuç'!B19,3)&REPT(\"*\",4)&RIGHT('Arş.Gör. Sonuç'!B19,2))","v":""},{"$f":"IF('Arş.Gör. Sonuç'!C19=\"\",\"\",IF(ISERR(FIND(\" \",'Arş.Gör. Sonuç'!C19))=TRUE,LEFT('Arş.Gör. Sonuç'!C19,2)&REPT(\"*\",3),LEFT('Arş.Gör. Sonuç'!C19,2)&REPT(\"*\",3)&\" \"&MID('Arş.Gör. Sonuç'!C19,FIND(\" \",'Arş.Gör. Sonuç'!C19)+1,2)&REPT(\"*\",3)))","v":""},{"$f":"IF('Arş.Gör. Sonuç'!D19=\"\",\"\",IF(ISERR(FIND(\" \",'Arş.Gör. Sonuç'!D19))=TRUE,LEFT('Arş.Gör. Sonuç'!D19,2)&REPT(\"*\",3),LEFT('Arş.Gör. Sonuç'!D19,2)&REPT(\"*\",3)&\" \"&MID('Arş.Gör. Sonuç'!D19,FIND(\" \",'Arş.Gör. Sonuç'!D19)+1,2)&REPT(\"*\",3)))","v":""},{"$f":"IF('Arş.Gör. Sonuç'!E19=\"\",\"\",'Arş.Gör. Sonuç'!E19)","v":""},{"$f":"IF('Arş.Gör. Sonuç'!F19=\"\",\"\",'Arş.Gör. Sonuç'!F19)","v":""},{"$f":"IF('Arş.Gör. Sonuç'!G19=\"\",\"\",'Arş.Gör. Sonuç'!G19)","v":""},{"$f":"IF('Arş.Gör. Sonuç'!H19=\"\",\"\",'Arş.Gör. Sonuç'!H19)","v":""},{"$f":"IF('Arş.Gör. Sonuç'!I19=\"\",\"\",'Arş.Gör. Sonuç'!I19)","v":""},{"$f":"IF('Arş.Gör. Sonuç'!J19=\"\",\"\",'Arş.Gör. Sonuç'!J19)","v":""},{"$f":"IF('Arş.Gör. Sonuç'!K19=\"\",\"\",'Arş.Gör. Sonuç'!K19)","v":""},{"$f":"IF('Arş.Gör. Sonuç'!L19=\"\",\"\",'Arş.Gör. Sonuç'!L19)","v":""},{"$f":"IF('Arş.Gör. Sonuç'!M19=\"\",\"\",'Arş.Gör. Sonuç'!M19)","v":""},{"$f":"IF('Arş.Gör. Sonuç'!N19=\"\",\"\",'Arş.Gör. Sonuç'!N19)","v":""}]
[{"$f":"IF('Arş.Gör. Sonuç'!A20=\"\",\"\",'Arş.Gör. Sonuç'!A20)","v":""},{"$f":"IF('Arş.Gör. Sonuç'!B20=\"\",\"\",LEFT('Arş.Gör. Sonuç'!B20,3)&REPT(\"*\",4)&RIGHT('Arş.Gör. Sonuç'!B20,2))","v":""},{"$f":"IF('Arş.Gör. Sonuç'!C20=\"\",\"\",IF(ISERR(FIND(\" \",'Arş.Gör. Sonuç'!C20))=TRUE,LEFT('Arş.Gör. Sonuç'!C20,2)&REPT(\"*\",3),LEFT('Arş.Gör. Sonuç'!C20,2)&REPT(\"*\",3)&\" \"&MID('Arş.Gör. Sonuç'!C20,FIND(\" \",'Arş.Gör. Sonuç'!C20)+1,2)&REPT(\"*\",3)))","v":""},{"$f":"IF('Arş.Gör. Sonuç'!D20=\"\",\"\",IF(ISERR(FIND(\" \",'Arş.Gör. Sonuç'!D20))=TRUE,LEFT('Arş.Gör. Sonuç'!D20,2)&REPT(\"*\",3),LEFT('Arş.Gör. Sonuç'!D20,2)&REPT(\"*\",3)&\" \"&MID('Arş.Gör. Sonuç'!D20,FIND(\" \",'Arş.Gör. Sonuç'!D20)+1,2)&REPT(\"*\",3)))","v":""},{"$f":"IF('Arş.Gör. Sonuç'!E20=\"\",\"\",'Arş.Gör. Sonuç'!E20)","v":""},{"$f":"IF('Arş.Gör. Sonuç'!F20=\"\",\"\",'Arş.Gör. Sonuç'!F20)","v":""},{"$f":"IF('Arş.Gör. Sonuç'!G20=\"\",\"\",'Arş.Gör. Sonuç'!G20)","v":""},{"$f":"IF('Arş.Gör. Sonuç'!H20=\"\",\"\",'Arş.Gör. Sonuç'!H20)","v":""},{"$f":"IF('Arş.Gör. Sonuç'!I20=\"\",\"\",'Arş.Gör. Sonuç'!I20)","v":""},{"$f":"IF('Arş.Gör. Sonuç'!J20=\"\",\"\",'Arş.Gör. Sonuç'!J20)","v":""},{"$f":"IF('Arş.Gör. Sonuç'!K20=\"\",\"\",'Arş.Gör. Sonuç'!K20)","v":""},{"$f":"IF('Arş.Gör. Sonuç'!L20=\"\",\"\",'Arş.Gör. Sonuç'!L20)","v":""},{"$f":"IF('Arş.Gör. Sonuç'!M20=\"\",\"\",'Arş.Gör. Sonuç'!M20)","v":""},{"$f":"IF('Arş.Gör. Sonuç'!N20=\"\",\"\",'Arş.Gör. Sonuç'!N20)","v":""}]
[{"$f":"IF('Arş.Gör. Sonuç'!A21=\"\",\"\",'Arş.Gör. Sonuç'!A21)","v":""},{"$f":"IF('Arş.Gör. Sonuç'!B21=\"\",\"\",LEFT('Arş.Gör. Sonuç'!B21,3)&REPT(\"*\",4)&RIGHT('Arş.Gör. Sonuç'!B21,2))","v":""},{"$f":"IF('Arş.Gör. Sonuç'!C21=\"\",\"\",IF(ISERR(FIND(\" \",'Arş.Gör. Sonuç'!C21))=TRUE,LEFT('Arş.Gör. Sonuç'!C21,2)&REPT(\"*\",3),LEFT('Arş.Gör. Sonuç'!C21,2)&REPT(\"*\",3)&\" \"&MID('Arş.Gör. Sonuç'!C21,FIND(\" \",'Arş.Gör. Sonuç'!C21)+1,2)&REPT(\"*\",3)))","v":""},{"$f":"IF('Arş.Gör. Sonuç'!D21=\"\",\"\",IF(ISERR(FIND(\" \",'Arş.Gör. Sonuç'!D21))=TRUE,LEFT('Arş.Gör. Sonuç'!D21,2)&REPT(\"*\",3),LEFT('Arş.Gör. Sonuç'!D21,2)&REPT(\"*\",3)&\" \"&MID('Arş.Gör. Sonuç'!D21,FIND(\" \",'Arş.Gör. Sonuç'!D21)+1,2)&REPT(\"*\",3)))","v":""},{"$f":"IF('Arş.Gör. Sonuç'!E21=\"\",\"\",'Arş.Gör. Sonuç'!E21)","v":""},{"$f":"IF('Arş.Gör. Sonuç'!F21=\"\",\"\",'Arş.Gör. Sonuç'!F21)","v":""},{"$f":"IF('Arş.Gör. Sonuç'!G21=\"\",\"\",'Arş.Gör. Sonuç'!G21)","v":""},{"$f":"IF('Arş.Gör. Sonuç'!H21=\"\",\"\",'Arş.Gör. Sonuç'!H21)","v":""},{"$f":"IF('Arş.Gör. Sonuç'!I21=\"\",\"\",'Arş.Gör. Sonuç'!I21)","v":""},{"$f":"IF('Arş.Gör. Sonuç'!J21=\"\",\"\",'Arş.Gör. Sonuç'!J21)","v":""},{"$f":"IF('Arş.Gör. Sonuç'!K21=\"\",\"\",'Arş.Gör. Sonuç'!K21)","v":""},{"$f":"IF('Arş.Gör. Sonuç'!L21=\"\",\"\",'Arş.Gör. Sonuç'!L21)","v":""},{"$f":"IF('Arş.Gör. Sonuç'!M21=\"\",\"\",'Arş.Gör. Sonuç'!M21)","v":""},{"$f":"IF('Arş.Gör. Sonuç'!N21=\"\",\"\",'Arş.Gör. Sonuç'!N21)","v":""}]
[{"$f":"IF('Arş.Gör. Sonuç'!A22=\"\",\"\",'Arş.Gör. Sonuç'!A22)","v":""},{"$f":"IF('Arş.Gör. Sonuç'!B22=\"\",\"\",LEFT('Arş.Gör. Sonuç'!B22,3)&REPT(\"*\",4)&RIGHT('Arş.Gör. Sonuç'!B22,2))","v":""},{"$f":"IF('Arş.Gör. Sonuç'!C22=\"\",\"\",IF(ISERR(FIND(\" \",'Arş.Gör. Sonuç'!C22))=TRUE,LEFT('Arş.Gör. Sonuç'!C22,2)&REPT(\"*\",3),LEFT('Arş.Gör. Sonuç'!C22,2)&REPT(\"*\",3)&\" \"&MID('Arş.Gör. Sonuç'!C22,FIND(\" \",'Arş.Gör. Sonuç'!C22)+1,2)&REPT(\"*\",3)))","v":""},{"$f":"IF('Arş.Gör. Sonuç'!D22=\"\",\"\",IF(ISERR(FIND(\" \",'Arş.Gör. Sonuç'!D22))=TRUE,LEFT('Arş.Gör. Sonuç'!D22,2)&REPT(\"*\",3),LEFT('Arş.Gör. Sonuç'!D22,2)&REPT(\"*\",3)&\" \"&MID('Arş.Gör. Sonuç'!D22,FIND(\" \",'Arş.Gör. Sonuç'!D22)+1,2)&REPT(\"*\",3)))","v":""},{"$f":"IF('Arş.Gör. Sonuç'!E22=\"\",\"\",'Arş.Gör. Sonuç'!E22)","v":""},{"$f":"IF('Arş.Gör. Sonuç'!F22=\"\",\"\",'Arş.Gör. Sonuç'!F22)","v":""},{"$f":"IF('Arş.Gör. Sonuç'!G22=\"\",\"\",'Arş.Gör. Sonuç'!G22)","v":""},{"$f":"IF('Arş.Gör. Sonuç'!H22=\"\",\"\",'Arş.Gör. Sonuç'!H22)","v":""},{"$f":"IF('Arş.Gör. Sonuç'!I22=\"\",\"\",'Arş.Gör. Sonuç'!I22)","v":""},{"$f":"IF('Arş.Gör. Sonuç'!J22=\"\",\"\",'Arş.Gör. Sonuç'!J22)","v":""},{"$f":"IF('Arş.Gör. Sonuç'!K22=\"\",\"\",'Arş.Gör. Sonuç'!K22)","v":""},{"$f":"IF('Arş.Gör. Sonuç'!L22=\"\",\"\",'Arş.Gör. Sonuç'!L22)","v":""},{"$f":"IF('Arş.Gör. Sonuç'!M22=\"\",\"\",'Arş.Gör. Sonuç'!M22)","v":""},{"$f":"IF('Arş.Gör. Sonuç'!N22=\"\",\"\",'Arş.Gör. Sonuç'!N22)","v":""}]
[{"$f":"IF('Arş.Gör. Sonuç'!A23=\"\",\"\",'Arş.Gör. Sonuç'!A23)","v":""},{"$f":"IF('Arş.Gör. Sonuç'!B23=\"\",\"\",LEFT('Arş.Gör. Sonuç'!B23,3)&REPT(\"*\",4)&RIGHT('Arş.Gör. Sonuç'!B23,2))","v":""},{"$f":"IF('Arş.Gör. Sonuç'!C23=\"\",\"\",IF(ISERR(FIND(\" \",'Arş.Gör. Sonuç'!C23))=TRUE,LEFT('Arş.Gör. Sonuç'!C23,2)&REPT(\"*\",3),LEFT('Arş.Gör. Sonuç'!C23,2)&REPT(\"*\",3)&\" \"&MID('Arş.Gör. Sonuç'!C23,FIND(\" \",'Arş.Gör. Sonuç'!C23)+1,2)&REPT(\"*\",3)))","v":""},{"$f":"IF('Arş.Gör. Sonuç'!D23=\"\",\"\",IF(ISERR(FIND(\" \",'Arş.Gör. Sonuç'!D23))=TRUE,LEFT('Arş.Gör. Sonuç'!D23,2)&REPT(\"*\",3),LEFT('Arş.Gör. Sonuç'!D23,2)&REPT(\"*\",3)&\" \"&MID('Arş.Gör. Sonuç'!D23,FIND(\" \",'Arş.Gör. Sonuç'!D23)+1,2)&REPT(\"*\",3)))","v":""},{"$f":"IF('Arş.Gör. Sonuç'!E23=\"\",\"\",'Arş.Gör. Sonuç'!E23)","v":""},{"$f":"IF('Arş.Gör. Sonuç'!F23=\"\",\"\",'Arş.Gör. Sonuç'!F23)","v":""},{"$f":"IF('Arş.Gör. Sonuç'!G23=\"\",\"\",'Arş.Gör. Sonuç'!G23)","v":""},{"$f":"IF('Arş.Gör. Sonuç'!H23=\"\",\"\",'Arş.Gör. Sonuç'!H23)","v":""},{"$f":"IF('Arş.Gör. Sonuç'!I23=\"\",\"\",'Arş.Gör. Sonuç'!I23)","v":""},{"$f":"IF('Arş.Gör. Sonuç'!J23=\"\",\"\",'Arş.Gör. Sonuç'!J23)","v":""},{"$f":"IF('Arş.Gör. Sonuç'!K23=\"\",\"\",'Arş.Gör. Sonuç'!K23)","v":""},{"$f":"IF('Arş.Gör. Sonuç'!L23=\"\",\"\",'Arş.Gör. Sonuç'!L23)","v":""},{"$f":"IF('Arş.Gör. Sonuç'!M23=\"\",\"\",'Arş.Gör. Sonuç'!M23)","v":""},{"$f":"IF('Arş.Gör. Sonuç'!N23=\"\",\"\",'Arş.Gör. Sonuç'!N23)","v":""}]
[{"$f":"IF('Arş.Gör. Sonuç'!A24=\"\",\"\",'Arş.Gör. Sonuç'!A24)","v":""},{"$f":"IF('Arş.Gör. Sonuç'!B24=\"\",\"\",LEFT('Arş.Gör. Sonuç'!B24,3)&REPT(\"*\",4)&RIGHT('Arş.Gör. Sonuç'!B24,2))","v":""},{"$f":"IF('Arş.Gör. Sonuç'!C24=\"\",\"\",IF(ISERR(FIND(\" \",'Arş.Gör. Sonuç'!C24))=TRUE,LEFT('Arş.Gör. Sonuç'!C24,2)&REPT(\"*\",3),LEFT('Arş.Gör. Sonuç'!C24,2)&REPT(\"*\",3)&\" \"&MID('Arş.Gör. Sonuç'!C24,FIND(\" \",'Arş.Gör. Sonuç'!C24)+1,2)&REPT(\"*\",3)))","v":""},{"$f":"IF('Arş.Gör. Sonuç'!D24=\"\",\"\",IF(ISERR(FIND(\" \",'Arş.Gör. Sonuç'!D24))=TRUE,LEFT('Arş.Gör. Sonuç'!D24,2)&REPT(\"*\",3),LEFT('Arş.Gör. Sonuç'!D24,2)&REPT(\"*\",3)&\" \"&MID('Arş.Gör. Sonuç'!D24,FIND(\" \",'Arş.Gör. Sonuç'!D24)+1,2)&REPT(\"*\",3)))","v":""},{"$f":"IF('Arş.Gör. Sonuç'!E24=\"\",\"\",'Arş.Gör. Sonuç'!E24)","v":""},{"$f":"IF('Arş.Gör. Sonuç'!F24=\"\",\"\",'Arş.Gör. Sonuç'!F24)","v":""},{"$f":"IF('Arş.Gör. Sonuç'!G24=\"\",\"\",'Arş.Gör. Sonuç'!G24)","v":""},{"$f":"IF('Arş.Gör. Sonuç'!H24=\"\",\"\",'Arş.Gör. Sonuç'!H24)","v":""},{"$f":"IF('Arş.Gör. Sonuç'!I24=\"\",\"\",'Arş.Gör. Sonuç'!I24)","v":""},{"$f":"IF('Arş.Gör. Sonuç'!J24=\"\",\"\",'Arş.Gör. Sonuç'!J24)","v":""},{"$f":"IF('Arş.Gör. Sonuç'!K24=\"\",\"\",'Arş.Gör. Sonuç'!K24)","v":""},{"$f":"IF('Arş.Gör. Sonuç'!L24=\"\",\"\",'Arş.Gör. Sonuç'!L24)","v":""},{"$f":"IF('Arş.Gör. Sonuç'!M24=\"\",\"\",'Arş.Gör. Sonuç'!M24)","v":""},{"$f":"IF('Arş.Gör. Sonuç'!N24=\"\",\"\",'Arş.Gör. Sonuç'!N24)","v":""}]
[{"$f":"IF('Arş.Gör. Sonuç'!A25=\"\",\"\",'Arş.Gör. Sonuç'!A25)","v":""},{"$f":"IF('Arş.Gör. Sonuç'!B25=\"\",\"\",LEFT('Arş.Gör. Sonuç'!B25,3)&REPT(\"*\",4)&RIGHT('Arş.Gör. Sonuç'!B25,2))","v":""},{"$f":"IF('Arş.Gör. Sonuç'!C25=\"\",\"\",IF(ISERR(FIND(\" \",'Arş.Gör. Sonuç'!C25))=TRUE,LEFT('Arş.Gör. Sonuç'!C25,2)&REPT(\"*\",3),LEFT('Arş.Gör. Sonuç'!C25,2)&REPT(\"*\",3)&\" \"&MID('Arş.Gör. Sonuç'!C25,FIND(\" \",'Arş.Gör. Sonuç'!C25)+1,2)&REPT(\"*\",3)))","v":""},{"$f":"IF('Arş.Gör. Sonuç'!D25=\"\",\"\",IF(ISERR(FIND(\" \",'Arş.Gör. Sonuç'!D25))=TRUE,LEFT('Arş.Gör. Sonuç'!D25,2)&REPT(\"*\",3),LEFT('Arş.Gör. Sonuç'!D25,2)&REPT(\"*\",3)&\" \"&MID('Arş.Gör. Sonuç'!D25,FIND(\" \",'Arş.Gör. Sonuç'!D25)+1,2)&REPT(\"*\",3)))","v":""},{"$f":"IF('Arş.Gör. Sonuç'!E25=\"\",\"\",'Arş.Gör. Sonuç'!E25)","v":""},{"$f":"IF('Arş.Gör. Sonuç'!F25=\"\",\"\",'Arş.Gör. Sonuç'!F25)","v":""},{"$f":"IF('Arş.Gör. Sonuç'!G25=\"\",\"\",'Arş.Gör. Sonuç'!G25)","v":""},{"$f":"IF('Arş.Gör. Sonuç'!H25=\"\",\"\",'Arş.Gör. Sonuç'!H25)","v":""},{"$f":"IF('Arş.Gör. Sonuç'!I25=\"\",\"\",'Arş.Gör. Sonuç'!I25)","v":""},{"$f":"IF('Arş.Gör. Sonuç'!J25=\"\",\"\",'Arş.Gör. Sonuç'!J25)","v":""},{"$f":"IF('Arş.Gör. Sonuç'!K25=\"\",\"\",'Arş.Gör. Sonuç'!K25)","v":""},{"$f":"IF('Arş.Gör. Sonuç'!L25=\"\",\"\",'Arş.Gör. Sonuç'!L25)","v":""},{"$f":"IF('Arş.Gör. Sonuç'!M25=\"\",\"\",'Arş.Gör. Sonuç'!M25)","v":""},{"$f":"IF('Arş.Gör. Sonuç'!N25=\"\",\"\",'Arş.Gör. Sonuç'!N25)","v":""}]
[{"$f":"IF('Arş.Gör. Sonuç'!A26=\"\",\"\",'Arş.Gör. Sonuç'!A26)","v":""},{"$f":"IF('Arş.Gör. Sonuç'!B26=\"\",\"\",LEFT('Arş.Gör. Sonuç'!B26,3)&REPT(\"*\",4)&RIGHT('Arş.Gör. Sonuç'!B26,2))","v":""},{"$f":"IF('Arş.Gör. Sonuç'!C26=\"\",\"\",IF(ISERR(FIND(\" \",'Arş.Gör. Sonuç'!C26))=TRUE,LEFT('Arş.Gör. Sonuç'!C26,2)&REPT(\"*\",3),LEFT('Arş.Gör. Sonuç'!C26,2)&REPT(\"*\",3)&\" \"&MID('Arş.Gör. Sonuç'!C26,FIND(\" \",'Arş.Gör. Sonuç'!C26)+1,2)&REPT(\"*\",3)))","v":""},{"$f":"IF('Arş.Gör. Sonuç'!D26=\"\",\"\",IF(ISERR(FIND(\" \",'Arş.Gör. Sonuç'!D26))=TRUE,LEFT('Arş.Gör. Sonuç'!D26,2)&REPT(\"*\",3),LEFT('Arş.Gör. Sonuç'!D26,2)&REPT(\"*\",3)&\" \"&MID('Arş.Gör. Sonuç'!D26,FIND(\" \",'Arş.Gör. Sonuç'!D26)+1,2)&REPT(\"*\",3)))","v":""},{"$f":"IF('Arş.Gör. Sonuç'!E26=\"\",\"\",'Arş.Gör. Sonuç'!E26)","v":""},{"$f":"IF('Arş.Gör. Sonuç'!F26=\"\",\"\",'Arş.Gör. Sonuç'!F26)","v":""},{"$f":"IF('Arş.Gör. Sonuç'!G26=\"\",\"\",'Arş.Gör. Sonuç'!G26)","v":""},{"$f":"IF('Arş.Gör. Sonuç'!H26=\"\",\"\",'Arş.Gör. Sonuç'!H26)","v":""},{"$f":"IF('Arş.Gör. Sonuç'!I26=\"\",\"\",'Arş.Gör. Sonuç'!I26)","v":""},{"$f":"IF('Arş.Gör. Sonuç'!J26=\"\",\"\",'Arş.Gör. Sonuç'!J26)","v":""},{"$f":"IF('Arş.Gör. Sonuç'!K26=\"\",\"\",'Arş.Gör. Sonuç'!K26)","v":""},{"$f":"IF('Arş.Gör. Sonuç'!L26=\"\",\"\",'Arş.Gör. Sonuç'!L26)","v":""},{"$f":"IF('Arş.Gör. Sonuç'!M26=\"\",\"\",'Arş.Gör. Sonuç'!M26)","v":""},{"$f":"IF('Arş.Gör. Sonuç'!N26=\"\",\"\",'Arş.Gör. Sonuç'!N26)","v":""}]
[{"$f":"IF('Arş.Gör. Sonuç'!A27=\"\",\"\",'Arş.Gör. Sonuç'!A27)","v":""},{"$f":"IF('Arş.Gör. Sonuç'!B27=\"\",\"\",LEFT('Arş.Gör. Sonuç'!B27,3)&REPT(\"*\",4)&RIGHT('Arş.Gör. Sonuç'!B27,2))","v":""},{"$f":"IF('Arş.Gör. Sonuç'!C27=\"\",\"\",IF(ISERR(FIND(\" \",'Arş.Gör. Sonuç'!C27))=TRUE,LEFT('Arş.Gör. Sonuç'!C27,2)&REPT(\"*\",3),LEFT('Arş.Gör. Sonuç'!C27,2)&REPT(\"*\",3)&\" \"&MID('Arş.Gör. Sonuç'!C27,FIND(\" \",'Arş.Gör. Sonuç'!C27)+1,2)&REPT(\"*\",3)))","v":""},{"$f":"IF('Arş.Gör. Sonuç'!D27=\"\",\"\",IF(ISERR(FIND(\" \",'Arş.Gör. Sonuç'!D27))=TRUE,LEFT('Arş.Gör. Sonuç'!D27,2)&REPT(\"*\",3),LEFT('Arş.Gör. Sonuç'!D27,2)&REPT(\"*\",3)&\" \"&MID('Arş.Gör. Sonuç'!D27,FIND(\" \",'Arş.Gör. Sonuç'!D27)+1,2)&REPT(\"*\",3)))","v":""},{"$f":"IF('Arş.Gör. Sonuç'!E27=\"\",\"\",'Arş.Gör. Sonuç'!E27)","v":""},{"$f":"IF('Arş.Gör. Sonuç'!F27=\"\",\"\",'Arş.Gör. Sonuç'!F27)","v":""},{"$f":"IF('Arş.Gör. Sonuç'!G27=\"\",\"\",'Arş.Gör. Sonuç'!G27)","v":""},{"$f":"IF('Arş.Gör. Sonuç'!H27=\"\",\"\",'Arş.Gör. Sonuç'!H27)","v":""},{"$f":"IF('Arş.Gör. Sonuç'!I27=\"\",\"\",'Arş.Gör. Sonuç'!I27)","v":""},{"$f":"IF('Arş.Gör. Sonuç'!J27=\"\",\"\",'Arş.Gör. Sonuç'!J27)","v":""},{"$f":"IF('Arş.Gör. Sonuç'!K27=\"\",\"\",'Arş.Gör. Sonuç'!K27)","v":""},{"$f":"IF('Arş.Gör. Sonuç'!L27=\"\",\"\",'Arş.Gör. Sonuç'!L27)","v":""},{"$f":"IF('Arş.Gör. Sonuç'!M27=\"\",\"\",'Arş.Gör. Sonuç'!M27)","v":""},{"$f":"IF('Arş.Gör. Sonuç'!N27=\"\",\"\",'Arş.Gör. Sonuç'!N27)","v":""}]
[{"$f":"IF('Arş.Gör. Sonuç'!A28=\"\",\"\",'Arş.Gör. Sonuç'!A28)","v":""},{"$f":"IF('Arş.Gör. Sonuç'!B28=\"\",\"\",LEFT('Arş.Gör. Sonuç'!B28,3)&REPT(\"*\",4)&RIGHT('Arş.Gör. Sonuç'!B28,2))","v":""},{"$f":"IF('Arş.Gör. Sonuç'!C28=\"\",\"\",IF(ISERR(FIND(\" \",'Arş.Gör. Sonuç'!C28))=TRUE,LEFT('Arş.Gör. Sonuç'!C28,2)&REPT(\"*\",3),LEFT('Arş.Gör. Sonuç'!C28,2)&REPT(\"*\",3)&\" \"&MID('Arş.Gör. Sonuç'!C28,FIND(\" \",'Arş.Gör. Sonuç'!C28)+1,2)&REPT(\"*\",3)))","v":""},{"$f":"IF('Arş.Gör. Sonuç'!D28=\"\",\"\",IF(ISERR(FIND(\" \",'Arş.Gör. Sonuç'!D28))=TRUE,LEFT('Arş.Gör. Sonuç'!D28,2)&REPT(\"*\",3),LEFT('Arş.Gör. Sonuç'!D28,2)&REPT(\"*\",3)&\" \"&MID('Arş.Gör. Sonuç'!D28,FIND(\" \",'Arş.Gör. Sonuç'!D28)+1,2)&REPT(\"*\",3)))","v":""},{"$f":"IF('Arş.Gör. Sonuç'!E28=\"\",\"\",'Arş.Gör. Sonuç'!E28)","v":""},{"$f":"IF('Arş.Gör. Sonuç'!F28=\"\",\"\",'Arş.Gör. Sonuç'!F28)","v":""},{"$f":"IF('Arş.Gör. Sonuç'!G28=\"\",\"\",'Arş.Gör. Sonuç'!G28)","v":""},{"$f":"IF('Arş.Gör. Sonuç'!H28=\"\",\"\",'Arş.Gör. Sonuç'!H28)","v":""},{"$f":"IF('Arş.Gör. Sonuç'!I28=\"\",\"\",'Arş.Gör. Sonuç'!I28)","v":""},{"$f":"IF('Arş.Gör. Sonuç'!J28=\"\",\"\",'Arş.Gör. Sonuç'!J28)","v":""},{"$f":"IF('Arş.Gör. Sonuç'!K28=\"\",\"\",'Arş.Gör. Sonuç'!K28)","v":""},{"$f":"IF('Arş.Gör. Sonuç'!L28=\"\",\"\",'Arş.Gör. Sonuç'!L28)","v":""},{"$f":"IF('Arş.Gör. Sonuç'!M28=\"\",\"\",'Arş.Gör. Sonuç'!M28)","v":""},{"$f":"IF('Arş.Gör. Sonuç'!N28=\"\",\"\",'Arş.Gör. Sonuç'!N28)","v":""}]
[{"$f":"IF('Arş.Gör. Sonuç'!A29=\"\",\"\",'Arş.Gör. Sonuç'!A29)","v":""},{"$f":"IF('Arş.Gör. Sonuç'!B29=\"\",\"\",LEFT('Arş.Gör. Sonuç'!B29,3)&REPT(\"*\",4)&RIGHT('Arş.Gör. Sonuç'!B29,2))","v":""},{"$f":"IF('Arş.Gör. Sonuç'!C29=\"\",\"\",IF(ISERR(FIND(\" \",'Arş.Gör. Sonuç'!C29))=TRUE,LEFT('Arş.Gör. Sonuç'!C29,2)&REPT(\"*\",3),LEFT('Arş.Gör. Sonuç'!C29,2)&REPT(\"*\",3)&\" \"&MID('Arş.Gör. Sonuç'!C29,FIND(\" \",'Arş.Gör. Sonuç'!C29)+1,2)&REPT(\"*\",3)))","v":""},{"$f":"IF('Arş.Gör. Sonuç'!D29=\"\",\"\",IF(ISERR(FIND(\" \",'Arş.Gör. Sonuç'!D29))=TRUE,LEFT('Arş.Gör. Sonuç'!D29,2)&REPT(\"*\",3),LEFT('Arş.Gör. Sonuç'!D29,2)&REPT(\"*\",3)&\" \"&MID('Arş.Gör. Sonuç'!D29,FIND(\" \",'Arş.Gör. Sonuç'!D29)+1,2)&REPT(\"*\",3)))","v":""},{"$f":"IF('Arş.Gör. Sonuç'!E29=\"\",\"\",'Arş.Gör. Sonuç'!E29)","v":""},{"$f":"IF('Arş.Gör. Sonuç'!F29=\"\",\"\",'Arş.Gör. Sonuç'!F29)","v":""},{"$f":"IF('Arş.Gör. Sonuç'!G29=\"\",\"\",'Arş.Gör. Sonuç'!G29)","v":""},{"$f":"IF('Arş.Gör. Sonuç'!H29=\"\",\"\",'Arş.Gör. Sonuç'!H29)","v":""},{"$f":"IF('Arş.Gör. Sonuç'!I29=\"\",\"\",'Arş.Gör. Sonuç'!I29)","v":""},{"$f":"IF('Arş.Gör. Sonuç'!J29=\"\",\"\",'Arş.Gör. Sonuç'!J29)","v":""},{"$f":"IF('Arş.Gör. Sonuç'!K29=\"\",\"\",'Arş.Gör. Sonuç'!K29)","v":""},{"$f":"IF('Arş.Gör. Sonuç'!L29=\"\",\"\",'Arş.Gör. Sonuç'!L29)","v":""},{"$f":"IF('Arş.Gör. Sonuç'!M29=\"\",\"\",'Arş.Gör. Sonuç'!M29)","v":""},{"$f":"IF('Arş.Gör. Sonuç'!N29=\"\",\"\",'Arş.Gör. Sonuç'!N29)","v":""}]
[{"$f":"IF('Arş.Gör. Sonuç'!A30=\"\",\"\",'Arş.Gör. Sonuç'!A30)","v":""},{"$f":"IF('Arş.Gör. Sonuç'!B30=\"\",\"\",LEFT('Arş.Gör. Sonuç'!B30,3)&REPT(\"*\",4)&RIGHT('Arş.Gör. Sonuç'!B30,2))","v":""},{"$f":"IF('Arş.Gör. Sonuç'!C30=\"\",\"\",IF(ISERR(FIND(\" \",'Arş.Gör. Sonuç'!C30))=TRUE,LEFT('Arş.Gör. Sonuç'!C30,2)&REPT(\"*\",3),LEFT('Arş.Gör. Sonuç'!C30,2)&REPT(\"*\",3)&\" \"&MID('Arş.Gör. Sonuç'!C30,FIND(\" \",'Arş.Gör. Sonuç'!C30)+1,2)&REPT(\"*\",3)))","v":""},{"$f":"IF('Arş.Gör. Sonuç'!D30=\"\",\"\",IF(ISERR(FIND(\" \",'Arş.Gör. Sonuç'!D30))=TRUE,LEFT('Arş.Gör. Sonuç'!D30,2)&REPT(\"*\",3),LEFT('Arş.Gör. Sonuç'!D30,2)&REPT(\"*\",3)&\" \"&MID('Arş.Gör. Sonuç'!D30,FIND(\" \",'Arş.Gör. Sonuç'!D30)+1,2)&REPT(\"*\",3)))","v":""},{"$f":"IF('Arş.Gör. Sonuç'!E30=\"\",\"\",'Arş.Gör. Sonuç'!E30)","v":""},{"$f":"IF('Arş.Gör. Sonuç'!F30=\"\",\"\",'Arş.Gör. Sonuç'!F30)","v":""},{"$f":"IF('Arş.Gör. Sonuç'!G30=\"\",\"\",'Arş.Gör. Sonuç'!G30)","v":""},{"$f":"IF('Arş.Gör. Sonuç'!H30=\"\",\"\",'Arş.Gör. Sonuç'!H30)","v":""},{"$f":"IF('Arş.Gör. Sonuç'!I30=\"\",\"\",'Arş.Gör. Sonuç'!I30)","v":""},{"$f":"IF('Arş.Gör. Sonuç'!J30=\"\",\"\",'Arş.Gör. Sonuç'!J30)","v":""},{"$f":"IF('Arş.Gör. Sonuç'!K30=\"\",\"\",'Arş.Gör. Sonuç'!K30)","v":""},{"$f":"IF('Arş.Gör. Sonuç'!L30=\"\",\"\",'Arş.Gör. Sonuç'!L30)","v":""},{"$f":"IF('Arş.Gör. Sonuç'!M30=\"\",\"\",'Arş.Gör. Sonuç'!M30)","v":""},{"$f":"IF('Arş.Gör. Sonuç'!N30=\"\",\"\",'Arş.Gör. Sonuç'!N30)","v":""}]
[{"$f":"IF('Arş.Gör. Sonuç'!A31=\"\",\"\",'Arş.Gör. Sonuç'!A31)","v":""},{"$f":"IF('Arş.Gör. Sonuç'!B31=\"\",\"\",LEFT('Arş.Gör. Sonuç'!B31,3)&REPT(\"*\",4)&RIGHT('Arş.Gör. Sonuç'!B31,2))","v":""},{"$f":"IF('Arş.Gör. Sonuç'!C31=\"\",\"\",IF(ISERR(FIND(\" \",'Arş.Gör. Sonuç'!C31))=TRUE,LEFT('Arş.Gör. Sonuç'!C31,2)&REPT(\"*\",3),LEFT('Arş.Gör. Sonuç'!C31,2)&REPT(\"*\",3)&\" \"&MID('Arş.Gör. Sonuç'!C31,FIND(\" \",'Arş.Gör. Sonuç'!C31)+1,2)&REPT(\"*\",3)))","v":""},{"$f":"IF('Arş.Gör. Sonuç'!D31=\"\",\"\",IF(ISERR(FIND(\" \",'Arş.Gör. Sonuç'!D31))=TRUE,LEFT('Arş.Gör. Sonuç'!D31,2)&REPT(\"*\",3),LEFT('Arş.Gör. Sonuç'!D31,2)&REPT(\"*\",3)&\" \"&MID('Arş.Gör. Sonuç'!D31,FIND(\" \",'Arş.Gör. Sonuç'!D31)+1,2)&REPT(\"*\",3)))","v":""},{"$f":"IF('Arş.Gör. Sonuç'!E31=\"\",\"\",'Arş.Gör. Sonuç'!E31)","v":""},{"$f":"IF('Arş.Gör. Sonuç'!F31=\"\",\"\",'Arş.Gör. Sonuç'!F31)","v":""},{"$f":"IF('Arş.Gör. Sonuç'!G31=\"\",\"\",'Arş.Gör. Sonuç'!G31)","v":""},{"$f":"IF('Arş.Gör. Sonuç'!H31=\"\",\"\",'Arş.Gör. Sonuç'!H31)","v":""},{"$f":"IF('Arş.Gör. Sonuç'!I31=\"\",\"\",'Arş.Gör. Sonuç'!I31)","v":""},{"$f":"IF('Arş.Gör. Sonuç'!J31=\"\",\"\",'Arş.Gör. Sonuç'!J31)","v":""},{"$f":"IF('Arş.Gör. Sonuç'!K31=\"\",\"\",'Arş.Gör. Sonuç'!K31)","v":""},{"$f":"IF('Arş.Gör. Sonuç'!L31=\"\",\"\",'Arş.Gör. Sonuç'!L31)","v":""},{"$f":"IF('Arş.Gör. Sonuç'!M31=\"\",\"\",'Arş.Gör. Sonuç'!M31)","v":""},{"$f":"IF('Arş.Gör. Sonuç'!N31=\"\",\"\",'Arş.Gör. Sonuç'!N31)","v":""}]
[{"$f":"IF('Arş.Gör. Sonuç'!A32=\"\",\"\",'Arş.Gör. Sonuç'!A32)","v":""},{"$f":"IF('Arş.Gör. Sonuç'!B32=\"\",\"\",LEFT('Arş.Gör. Sonuç'!B32,3)&REPT(\"*\",4)&RIGHT('Arş.Gör. Sonuç'!B32,2))","v":""},{"$f":"IF('Arş.Gör. Sonuç'!C32=\"\",\"\",IF(ISERR(FIND(\" \",'Arş.Gör. Sonuç'!C32))=TRUE,LEFT('Arş.Gör. Sonuç'!C32,2)&REPT(\"*\",3),LEFT('Arş.Gör. Sonuç'!C32,2)&REPT(\"*\",3)&\" \"&MID('Arş.Gör. Sonuç'!C32,FIND(\" \",'Arş.Gör. Sonuç'!C32)+1,2)&REPT(\"*\",3)))","v":""},{"$f":"IF('Arş.Gör. Sonuç'!D32=\"\",\"\",IF(ISERR(FIND(\" \",'Arş.Gör. Sonuç'!D32))=TRUE,LEFT('Arş.Gör. Sonuç'!D32,2)&REPT(\"*\",3),LEFT('Arş.Gör. Sonuç'!D32,2)&REPT(\"*\",3)&\" \"&MID('Arş.Gör. Sonuç'!D32,FIND(\" \",'Arş.Gör. Sonuç'!D32)+1,2)&REPT(\"*\",3)))","v":""},{"$f":"IF('Arş.Gör. Sonuç'!E32=\"\",\"\",'Arş.Gör. Sonuç'!E32)","v":""},{"$f":"IF('Arş.Gör. Sonuç'!F32=\"\",\"\",'Arş.Gör. Sonuç'!F32)","v":""},{"$f":"IF('Arş.Gör. Sonuç'!G32=\"\",\"\",'Arş.Gör. Sonuç'!G32)","v":""},{"$f":"IF('Arş.Gör. Sonuç'!H32=\"\",\"\",'Arş.Gör. Sonuç'!H32)","v":""},{"$f":"IF('Arş.Gör. Sonuç'!I32=\"\",\"\",'Arş.Gör. Sonuç'!I32)","v":""},{"$f":"IF('Arş.Gör. Sonuç'!J32=\"\",\"\",'Arş.Gör. Sonuç'!J32)","v":""},{"$f":"IF('Arş.Gör. Sonuç'!K32=\"\",\"\",'Arş.Gör. Sonuç'!K32)","v":""},{"$f":"IF('Arş.Gör. Sonuç'!L32=\"\",\"\",'Arş.Gör. Sonuç'!L32)","v":""},{"$f":"IF('Arş.Gör. Sonuç'!M32=\"\",\"\",'Arş.Gör. Sonuç'!M32)","v":""},{"$f":"IF('Arş.Gör. Sonuç'!N32=\"\",\"\",'Arş.Gör. Sonuç'!N32)","v":""}]
[{"$f":"IF('Arş.Gör. Sonuç'!A33=\"\",\"\",'Arş.Gör. Sonuç'!A33)","v":""},{"$f":"IF('Arş.Gör. Sonuç'!B33=\"\",\"\",LEFT('Arş.Gör. Sonuç'!B33,3)&REPT(\"*\",4)&RIGHT('Arş.Gör. Sonuç'!B33,2))","v":""},{"$f":"IF('Arş.Gör. Sonuç'!C33=\"\",\"\",IF(ISERR(FIND(\" \",'Arş.Gör. Sonuç'!C33))=TRUE,LEFT('Arş.Gör. Sonuç'!C33,2)&REPT(\"*\",3),LEFT('Arş.Gör. Sonuç'!C33,2)&REPT(\"*\",3)&\" \"&MID('Arş.Gör. Sonuç'!C33,FIND(\" \",'Arş.Gör. Sonuç'!C33)+1,2)&REPT(\"*\",3)))","v":""},{"$f":"IF('Arş.Gör. Sonuç'!D33=\"\",\"\",IF(ISERR(FIND(\" \",'Arş.Gör. Sonuç'!D33))=TRUE,LEFT('Arş.Gör. Sonuç'!D33,2)&REPT(\"*\",3),LEFT('Arş.Gör. Sonuç'!D33,2)&REPT(\"*\",3)&\" \"&MID('Arş.Gör. Sonuç'!D33,FIND(\" \",'Arş.Gör. Sonuç'!D33)+1,2)&REPT(\"*\",3)))","v":""},{"$f":"IF('Arş.Gör. Sonuç'!E33=\"\",\"\",'Arş.Gör. Sonuç'!E33)","v":""},{"$f":"IF('Arş.Gör. Sonuç'!F33=\"\",\"\",'Arş.Gör. Sonuç'!F33)","v":""},{"$f":"IF('Arş.Gör. Sonuç'!G33=\"\",\"\",'Arş.Gör. Sonuç'!G33)","v":""},{"$f":"IF('Arş.Gör. Sonuç'!H33=\"\",\"\",'Arş.Gör. Sonuç'!H33)","v":""},{"$f":"IF('Arş.Gör. Sonuç'!I33=\"\",\"\",'Arş.Gör. Sonuç'!I33)","v":""},{"$f":"IF('Arş.Gör. Sonuç'!J33=\"\",\"\",'Arş.Gör. Sonuç'!J33)","v":""},{"$f":"IF('Arş.Gör. Sonuç'!K33=\"\",\"\",'Arş.Gör. Sonuç'!K33)","v":""},{"$f":"IF('Arş.Gör. Sonuç'!L33=\"\",\"\",'Arş.Gör. Sonuç'!L33)","v":""},{"$f":"IF('Arş.Gör. Sonuç'!M33=\"\",\"\",'Arş.Gör. Sonuç'!M33)","v":""},{"$f":"IF('Arş.Gör. Sonuç'!N33=\"\",\"\",'Arş.Gör. Sonuç'!N33)","v":""}]
[{"$f":"IF('Arş.Gör. Sonuç'!A34=\"\",\"\",'Arş.Gör. Sonuç'!A34)","v":""},{"$f":"IF('Arş.Gör. Sonuç'!B34=\"\",\"\",LEFT('Arş.Gör. Sonuç'!B34,3)&REPT(\"*\",4)&RIGHT('Arş.Gör. Sonuç'!B34,2))","v":""},{"$f":"IF('Arş.Gör. Sonuç'!C34=\"\",\"\",IF(ISERR(FIND(\" \",'Arş.Gör. Sonuç'!C34))=TRUE,LEFT('Arş.Gör. Sonuç'!C34,2)&REPT(\"*\",3),LEFT('Arş.Gör. Sonuç'!C34,2)&REPT(\"*\",3)&\" \"&MID('Arş.Gör. Sonuç'!C34,FIND(\" \",'Arş.Gör. Sonuç'!C34)+1,2)&REPT(\"*\",3)))","v":""},{"$f":"IF('Arş.Gör. Sonuç'!D34=\"\",\"\",IF(ISERR(FIND(\" \",'Arş.Gör. Sonuç'!D34))=TRUE,LEFT('Arş.Gör. Sonuç'!D34,2)&REPT(\"*\",3),LEFT('Arş.Gör. Sonuç'!D34,2)&REPT(\"*\",3)&\" \"&MID('Arş.Gör. Sonuç'!D34,FIND(\" \",'Arş.Gör. Sonuç'!D34)+1,2)&REPT(\"*\",3)))","v":""},{"$f":"IF('Arş.Gör. Sonuç'!E34=\"\",\"\",'Arş.Gör. Sonuç'!E34)","v":""},{"$f":"IF('Arş.Gör. Sonuç'!F34=\"\",\"\",'Arş.Gör. Sonuç'!F34)","v":""},{"$f":"IF('Arş.Gör. Sonuç'!G34=\"\",\"\",'Arş.Gör. Sonuç'!G34)","v":""},{"$f":"IF('Arş.Gör. Sonuç'!H34=\"\",\"\",'Arş.Gör. Sonuç'!H34)","v":""},{"$f":"IF('Arş.Gör. Sonuç'!I34=\"\",\"\",'Arş.Gör. Sonuç'!I34)","v":""},{"$f":"IF('Arş.Gör. Sonuç'!J34=\"\",\"\",'Arş.Gör. Sonuç'!J34)","v":""},{"$f":"IF('Arş.Gör. Sonuç'!K34=\"\",\"\",'Arş.Gör. Sonuç'!K34)","v":""},{"$f":"IF('Arş.Gör. Sonuç'!L34=\"\",\"\",'Arş.Gör. Sonuç'!L34)","v":""},{"$f":"IF('Arş.Gör. Sonuç'!M34=\"\",\"\",'Arş.Gör. Sonuç'!M34)","v":""},{"$f":"IF('Arş.Gör. Sonuç'!N34=\"\",\"\",'Arş.Gör. Sonuç'!N34)","v":""}]
[{"$f":"IF('Arş.Gör. Sonuç'!A35=\"\",\"\",'Arş.Gör. Sonuç'!A35)","v":""},{"$f":"IF('Arş.Gör. Sonuç'!B35=\"\",\"\",LEFT('Arş.Gör. Sonuç'!B35,3)&REPT(\"*\",4)&RIGHT('Arş.Gör. Sonuç'!B35,2))","v":""},{"$f":"IF('Arş.Gör. Sonuç'!C35=\"\",\"\",IF(ISERR(FIND(\" \",'Arş.Gör. Sonuç'!C35))=TRUE,LEFT('Arş.Gör. Sonuç'!C35,2)&REPT(\"*\",3),LEFT('Arş.Gör. Sonuç'!C35,2)&REPT(\"*\",3)&\" \"&MID('Arş.Gör. Sonuç'!C35,FIND(\" \",'Arş.Gör. Sonuç'!C35)+1,2)&REPT(\"*\",3)))","v":""},{"$f":"IF('Arş.Gör. Sonuç'!D35=\"\",\"\",IF(ISERR(FIND(\" \",'Arş.Gör. Sonuç'!D35))=TRUE,LEFT('Arş.Gör. Sonuç'!D35,2)&REPT(\"*\",3),LEFT('Arş.Gör. Sonuç'!D35,2)&REPT(\"*\",3)&\" \"&MID('Arş.Gör. Sonuç'!D35,FIND(\" \",'Arş.Gör. Sonuç'!D35)+1,2)&REPT(\"*\",3)))","v":""},{"$f":"IF('Arş.Gör. Sonuç'!E35=\"\",\"\",'Arş.Gör. Sonuç'!E35)","v":""},{"$f":"IF('Arş.Gör. Sonuç'!F35=\"\",\"\",'Arş.Gör. Sonuç'!F35)","v":""},{"$f":"IF('Arş.Gör. Sonuç'!G35=\"\",\"\",'Arş.Gör. Sonuç'!G35)","v":""},{"$f":"IF('Arş.Gör. Sonuç'!H35=\"\",\"\",'Arş.Gör. Sonuç'!H35)","v":""},{"$f":"IF('Arş.Gör. Sonuç'!I35=\"\",\"\",'Arş.Gör. Sonuç'!I35)","v":""},{"$f":"IF('Arş.Gör. Sonuç'!J35=\"\",\"\",'Arş.Gör. Sonuç'!J35)","v":""},{"$f":"IF('Arş.Gör. Sonuç'!K35=\"\",\"\",'Arş.Gör. Sonuç'!K35)","v":""},{"$f":"IF('Arş.Gör. Sonuç'!L35=\"\",\"\",'Arş.Gör. Sonuç'!L35)","v":""},{"$f":"IF('Arş.Gör. Sonuç'!M35=\"\",\"\",'Arş.Gör. Sonuç'!M35)","v":""},{"$f":"IF('Arş.Gör. Sonuç'!N35=\"\",\"\",'Arş.Gör. Sonuç'!N35)","v":""}]
[{"$f":"IF('Arş.Gör. Sonuç'!A36=\"\",\"\",'Arş.Gör. Sonuç'!A36)","v":""},{"$f":"IF('Arş.Gör. Sonuç'!B36=\"\",\"\",LEFT('Arş.Gör. Sonuç'!B36,3)&REPT(\"*\",4)&RIGHT('Arş.Gör. Sonuç'!B36,2))","v":""},{"$f":"IF('Arş.Gör. Sonuç'!C36=\"\",\"\",IF(ISERR(FIND(\" \",'Arş.Gör. Sonuç'!C36))=TRUE,LEFT('Arş.Gör. Sonuç'!C36,2)&REPT(\"*\",3),LEFT('Arş.Gör. Sonuç'!C36,2)&REPT(\"*\",3)&\" \"&MID('Arş.Gör. Sonuç'!C36,FIND(\" \",'Arş.Gör. Sonuç'!C36)+1,2)&REPT(\"*\",3)))","v":""},{"$f":"IF('Arş.Gör. Sonuç'!D36=\"\",\"\",IF(ISERR(FIND(\" \",'Arş.Gör. Sonuç'!D36))=TRUE,LEFT('Arş.Gör. Sonuç'!D36,2)&REPT(\"*\",3),LEFT('Arş.Gör. Sonuç'!D36,2)&REPT(\"*\",3)&\" \"&MID('Arş.Gör. Sonuç'!D36,FIND(\" \",'Arş.Gör. Sonuç'!D36)+1,2)&REPT(\"*\",3)))","v":""},{"$f":"IF('Arş.Gör. Sonuç'!E36=\"\",\"\",'Arş.Gör. Sonuç'!E36)","v":""},{"$f":"IF('Arş.Gör. Sonuç'!F36=\"\",\"\",'Arş.Gör. Sonuç'!F36)","v":""},{"$f":"IF('Arş.Gör. Sonuç'!G36=\"\",\"\",'Arş.Gör. Sonuç'!G36)","v":""},{"$f":"IF('Arş.Gör. Sonuç'!H36=\"\",\"\",'Arş.Gör. Sonuç'!H36)","v":""},{"$f":"IF('Arş.Gör. Sonuç'!I36=\"\",\"\",'Arş.Gör. Sonuç'!I36)","v":""},{"$f":"IF('Arş.Gör. Sonuç'!J36=\"\",\"\",'Arş.Gör. Sonuç'!J36)","v":""},{"$f":"IF('Arş.Gör. Sonuç'!K36=\"\",\"\",'Arş.Gör. Sonuç'!K36)","v":""},{"$f":"IF('Arş.Gör. Sonuç'!L36=\"\",\"\",'Arş.Gör. Sonuç'!L36)","v":""},{"$f":"IF('Arş.Gör. Sonuç'!M36=\"\",\"\",'Arş.Gör. Sonuç'!M36)","v":""},{"$f":"IF('Arş.Gör. Sonuç'!N36=\"\",\"\",'Arş.Gör. Sonuç'!N36)","v":""}]
[{"$f":"IF('Arş.Gör. Sonuç'!A37=\"\",\"\",'Arş.Gör. Sonuç'!A37)","v":""},{"$f":"IF('Arş.Gör. Sonuç'!B37=\"\",\"\",LEFT('Arş.Gör. Sonuç'!B37,3)&REPT(\"*\",4)&RIGHT('Arş.Gör. Sonuç'!B37,2))","v":""},{"$f":"IF('Arş.Gör. Sonuç'!C37=\"\",\"\",IF(ISERR(FIND(\" \",'Arş.Gör. Sonuç'!C37))=TRUE,LEFT('Arş.Gör. Sonuç'!C37,2)&REPT(\"*\",3),LEFT('Arş.Gör. Sonuç'!C37,2)&REPT(\"*\",3)&\" \"&MID('Arş.Gör. Sonuç'!C37,FIND(\" \",'Arş.Gör. Sonuç'!C37)+1,2)&REPT(\"*\",3)))","v":""},{"$f":"IF('Arş.Gör. Sonuç'!D37=\"\",\"\",IF(ISERR(FIND(\" \",'Arş.Gör. Sonuç'!D37))=TRUE,LEFT('Arş.Gör. Sonuç'!D37,2)&REPT(\"*\",3),LEFT('Arş.Gör. Sonuç'!D37,2)&REPT(\"*\",3)&\" \"&MID('Arş.Gör. Sonuç'!D37,FIND(\" \",'Arş.Gör. Sonuç'!D37)+1,2)&REPT(\"*\",3)))","v":""},{"$f":"IF('Arş.Gör. Sonuç'!E37=\"\",\"\",'Arş.Gör. Sonuç'!E37)","v":""},{"$f":"IF('Arş.Gör. Sonuç'!F37=\"\",\"\",'Arş.Gör. Sonuç'!F37)","v":""},{"$f":"IF('Arş.Gör. Sonuç'!G37=\"\",\"\",'Arş.Gör. Sonuç'!G37)","v":""},{"$f":"IF('Arş.Gör. Sonuç'!H37=\"\",\"\",'Arş.Gör. Sonuç'!H37)","v":""},{"$f":"IF('Arş.Gör. Sonuç'!I37=\"\",\"\",'Arş.Gör. Sonuç'!I37)","v":""},{"$f":"IF('Arş.Gör. Sonuç'!J37=\"\",\"\",'Arş.Gör. Sonuç'!J37)","v":""},{"$f":"IF('Arş.Gör. Sonuç'!K37=\"\",\"\",'Arş.Gör. Sonuç'!K37)","v":""},{"$f":"IF('Arş.Gör. Sonuç'!L37=\"\",\"\",'Arş.Gör. Sonuç'!L37)","v":""},{"$f":"IF('Arş.Gör. Sonuç'!M37=\"\",\"\",'Arş.Gör. Sonuç'!M37)","v":""},{"$f":"IF('Arş.Gör. Sonuç'!N37=\"\",\"\",'Arş.Gör. Sonuç'!N37)","v":""}]
[{"$f":"IF('Arş.Gör. Sonuç'!A38=\"\",\"\",'Arş.Gör. Sonuç'!A38)","v":""},{"$f":"IF('Arş.Gör. Sonuç'!B38=\"\",\"\",LEFT('Arş.Gör. Sonuç'!B38,3)&REPT(\"*\",4)&RIGHT('Arş.Gör. Sonuç'!B38,2))","v":""},{"$f":"IF('Arş.Gör. Sonuç'!C38=\"\",\"\",IF(ISERR(FIND(\" \",'Arş.Gör. Sonuç'!C38))=TRUE,LEFT('Arş.Gör. Sonuç'!C38,2)&REPT(\"*\",3),LEFT('Arş.Gör. Sonuç'!C38,2)&REPT(\"*\",3)&\" \"&MID('Arş.Gör. Sonuç'!C38,FIND(\" \",'Arş.Gör. Sonuç'!C38)+1,2)&REPT(\"*\",3)))","v":""},{"$f":"IF('Arş.Gör. Sonuç'!D38=\"\",\"\",IF(ISERR(FIND(\" \",'Arş.Gör. Sonuç'!D38))=TRUE,LEFT('Arş.Gör. Sonuç'!D38,2)&REPT(\"*\",3),LEFT('Arş.Gör. Sonuç'!D38,2)&REPT(\"*\",3)&\" \"&MID('Arş.Gör. Sonuç'!D38,FIND(\" \",'Arş.Gör. Sonuç'!D38)+1,2)&REPT(\"*\",3)))","v":""},{"$f":"IF('Arş.Gör. Sonuç'!E38=\"\",\"\",'Arş.Gör. Sonuç'!E38)","v":""},{"$f":"IF('Arş.Gör. Sonuç'!F38=\"\",\"\",'Arş.Gör. Sonuç'!F38)","v":""},{"$f":"IF('Arş.Gör. Sonuç'!G38=\"\",\"\",'Arş.Gör. Sonuç'!G38)","v":""},{"$f":"IF('Arş.Gör. Sonuç'!H38=\"\",\"\",'Arş.Gör. Sonuç'!H38)","v":""},{"$f":"IF('Arş.Gör. Sonuç'!I38=\"\",\"\",'Arş.Gör. Sonuç'!I38)","v":""},{"$f":"IF('Arş.Gör. Sonuç'!J38=\"\",\"\",'Arş.Gör. Sonuç'!J38)","v":""},{"$f":"IF('Arş.Gör. Sonuç'!K38=\"\",\"\",'Arş.Gör. Sonuç'!K38)","v":""},{"$f":"IF('Arş.Gör. Sonuç'!L38=\"\",\"\",'Arş.Gör. Sonuç'!L38)","v":""},{"$f":"IF('Arş.Gör. Sonuç'!M38=\"\",\"\",'Arş.Gör. Sonuç'!M38)","v":""},{"$f":"IF('Arş.Gör. Sonuç'!N38=\"\",\"\",'Arş.Gör. Sonuç'!N38)","v":""}]
[{"$f":"IF('Arş.Gör. Sonuç'!A39=\"\",\"\",'Arş.Gör. Sonuç'!A39)","v":""},{"$f":"IF('Arş.Gör. Sonuç'!B39=\"\",\"\",LEFT('Arş.Gör. Sonuç'!B39,3)&REPT(\"*\",4)&RIGHT('Arş.Gör. Sonuç'!B39,2))","v":""},{"$f":"IF('Arş.Gör. Sonuç'!C39=\"\",\"\",IF(ISERR(FIND(\" \",'Arş.Gör. Sonuç'!C39))=TRUE,LEFT('Arş.Gör. Sonuç'!C39,2)&REPT(\"*\",3),LEFT('Arş.Gör. Sonuç'!C39,2)&REPT(\"*\",3)&\" \"&MID('Arş.Gör. Sonuç'!C39,FIND(\" \",'Arş.Gör. Sonuç'!C39)+1,2)&REPT(\"*\",3)))","v":""},{"$f":"IF('Arş.Gör. Sonuç'!D39=\"\",\"\",IF(ISERR(FIND(\" \",'Arş.Gör. Sonuç'!D39))=TRUE,LEFT('Arş.Gör. Sonuç'!D39,2)&REPT(\"*\",3),LEFT('Arş.Gör. Sonuç'!D39,2)&REPT(\"*\",3)&\" \"&MID('Arş.Gör. Sonuç'!D39,FIND(\" \",'Arş.Gör. Sonuç'!D39)+1,2)&REPT(\"*\",3)))","v":""},{"$f":"IF('Arş.Gör. Sonuç'!E39=\"\",\"\",'Arş.Gör. Sonuç'!E39)","v":""},{"$f":"IF('Arş.Gör. Sonuç'!F39=\"\",\"\",'Arş.Gör. Sonuç'!F39)","v":""},{"$f":"IF('Arş.Gör. Sonuç'!G39=\"\",\"\",'Arş.Gör. Sonuç'!G39)","v":""},{"$f":"IF('Arş.Gör. Sonuç'!H39=\"\",\"\",'Arş.Gör. Sonuç'!H39)","v":""},{"$f":"IF('Arş.Gör. Sonuç'!I39=\"\",\"\",'Arş.Gör. Sonuç'!I39)","v":""},{"$f":"IF('Arş.Gör. Sonuç'!J39=\"\",\"\",'Arş.Gör. Sonuç'!J39)","v":""},{"$f":"IF('Arş.Gör. Sonuç'!K39=\"\",\"\",'Arş.Gör. Sonuç'!K39)","v":""},{"$f":"IF('Arş.Gör. Sonuç'!L39=\"\",\"\",'Arş.Gör. Sonuç'!L39)","v":""},{"$f":"IF('Arş.Gör. Sonuç'!M39=\"\",\"\",'Arş.Gör. Sonuç'!M39)","v":""},{"$f":"IF('Arş.Gör. Sonuç'!N39=\"\",\"\",'Arş.Gör. Sonuç'!N39)","v":""}]
[{"$f":"IF('Arş.Gör. Sonuç'!A40=\"\",\"\",'Arş.Gör. Sonuç'!A40)","v":""},{"$f":"IF('Arş.Gör. Sonuç'!B40=\"\",\"\",LEFT('Arş.Gör. Sonuç'!B40,3)&REPT(\"*\",4)&RIGHT('Arş.Gör. Sonuç'!B40,2))","v":""},{"$f":"IF('Arş.Gör. Sonuç'!C40=\"\",\"\",IF(ISERR(FIND(\" \",'Arş.Gör. Sonuç'!C40))=TRUE,LEFT('Arş.Gör. Sonuç'!C40,2)&REPT(\"*\",3),LEFT('Arş.Gör. Sonuç'!C40,2)&REPT(\"*\",3)&\" \"&MID('Arş.Gör. Sonuç'!C40,FIND(\" \",'Arş.Gör. Sonuç'!C40)+1,2)&REPT(\"*\",3)))","v":""},{"$f":"IF('Arş.Gör. Sonuç'!D40=\"\",\"\",IF(ISERR(FIND(\" \",'Arş.Gör. Sonuç'!D40))=TRUE,LEFT('Arş.Gör. Sonuç'!D40,2)&REPT(\"*\",3),LEFT('Arş.Gör. Sonuç'!D40,2)&REPT(\"*\",3)&\" \"&MID('Arş.Gör. Sonuç'!D40,FIND(\" \",'Arş.Gör. Sonuç'!D40)+1,2)&REPT(\"*\",3)))","v":""},{"$f":"IF('Arş.Gör. Sonuç'!E40=\"\",\"\",'Arş.Gör. Sonuç'!E40)","v":""},{"$f":"IF('Arş.Gör. Sonuç'!F40=\"\",\"\",'Arş.Gör. Sonuç'!F40)","v":""},{"$f":"IF('Arş.Gör. Sonuç'!G40=\"\",\"\",'Arş.Gör. Sonuç'!G40)","v":""},{"$f":"IF('Arş.Gör. Sonuç'!H40=\"\",\"\",'Arş.Gör. Sonuç'!H40)","v":""},{"$f":"IF('Arş.Gör. Sonuç'!I40=\"\",\"\",'Arş.Gör. Sonuç'!I40)","v":""},{"$f":"IF('Arş.Gör. Sonuç'!J40=\"\",\"\",'Arş.Gör. Sonuç'!J40)","v":""},{"$f":"IF('Arş.Gör. Sonuç'!K40=\"\",\"\",'Arş.Gör. Sonuç'!K40)","v":""},{"$f":"IF('Arş.Gör. Sonuç'!L40=\"\",\"\",'Arş.Gör. Sonuç'!L40)","v":""},{"$f":"IF('Arş.Gör. Sonuç'!M40=\"\",\"\",'Arş.Gör. Sonuç'!M40)","v":""},{"$f":"IF('Arş.Gör. Sonuç'!N40=\"\",\"\",'Arş.Gör. Sonuç'!N40)","v":""}]
[{"$f":"IF('Arş.Gör. Sonuç'!A41=\"\",\"\",'Arş.Gör. Sonuç'!A41)","v":""},{"$f":"IF('Arş.Gör. Sonuç'!B41=\"\",\"\",LEFT('Arş.Gör. Sonuç'!B41,3)&REPT(\"*\",4)&RIGHT('Arş.Gör. Sonuç'!B41,2))","v":""},{"$f":"IF('Arş.Gör. Sonuç'!C41=\"\",\"\",IF(ISERR(FIND(\" \",'Arş.Gör. Sonuç'!C41))=TRUE,LEFT('Arş.Gör. Sonuç'!C41,2)&REPT(\"*\",3),LEFT('Arş.Gör. Sonuç'!C41,2)&REPT(\"*\",3)&\" \"&MID('Arş.Gör. Sonuç'!C41,FIND(\" \",'Arş.Gör. Sonuç'!C41)+1,2)&REPT(\"*\",3)))","v":""},{"$f":"IF('Arş.Gör. Sonuç'!D41=\"\",\"\",IF(ISERR(FIND(\" \",'Arş.Gör. Sonuç'!D41))=TRUE,LEFT('Arş.Gör. Sonuç'!D41,2)&REPT(\"*\",3),LEFT('Arş.Gör. Sonuç'!D41,2)&REPT(\"*\",3)&\" \"&MID('Arş.Gör. Sonuç'!D41,FIND(\" \",'Arş.Gör. Sonuç'!D41)+1,2)&REPT(\"*\",3)))","v":""},{"$f":"IF('Arş.Gör. Sonuç'!E41=\"\",\"\",'Arş.Gör. Sonuç'!E41)","v":""},{"$f":"IF('Arş.Gör. Sonuç'!F41=\"\",\"\",'Arş.Gör. Sonuç'!F41)","v":""},{"$f":"IF('Arş.Gör. Sonuç'!G41=\"\",\"\",'Arş.Gör. Sonuç'!G41)","v":""},{"$f":"IF('Arş.Gör. Sonuç'!H41=\"\",\"\",'Arş.Gör. Sonuç'!H41)","v":""},{"$f":"IF('Arş.Gör. Sonuç'!I41=\"\",\"\",'Arş.Gör. Sonuç'!I41)","v":""},{"$f":"IF('Arş.Gör. Sonuç'!J41=\"\",\"\",'Arş.Gör. Sonuç'!J41)","v":""},{"$f":"IF('Arş.Gör. Sonuç'!K41=\"\",\"\",'Arş.Gör. Sonuç'!K41)","v":""},{"$f":"IF('Arş.Gör. Sonuç'!L41=\"\",\"\",'Arş.Gör. Sonuç'!L41)","v":""},{"$f":"IF('Arş.Gör. Sonuç'!M41=\"\",\"\",'Arş.Gör. Sonuç'!M41)","v":""},{"$f":"IF('Arş.Gör. Sonuç'!N41=\"\",\"\",'Arş.Gör. Sonuç'!N41)","v":""}]
[{"$f":"IF('Arş.Gör. Sonuç'!A42=\"\",\"\",'Arş.Gör. Sonuç'!A42)","v":""},{"$f":"IF('Arş.Gör. Sonuç'!B42=\"\",\"\",LEFT('Arş.Gör. Sonuç'!B42,3)&REPT(\"*\",4)&RIGHT('Arş.Gör. Sonuç'!B42,2))","v":""},{"$f":"IF('Arş.Gör. Sonuç'!C42=\"\",\"\",IF(ISERR(FIND(\" \",'Arş.Gör. Sonuç'!C42))=TRUE,LEFT('Arş.Gör. Sonuç'!C42,2)&REPT(\"*\",3),LEFT('Arş.Gör. Sonuç'!C42,2)&REPT(\"*\",3)&\" \"&MID('Arş.Gör. Sonuç'!C42,FIND(\" \",'Arş.Gör. Sonuç'!C42)+1,2)&REPT(\"*\",3)))","v":""},{"$f":"IF('Arş.Gör. Sonuç'!D42=\"\",\"\",IF(ISERR(FIND(\" \",'Arş.Gör. Sonuç'!D42))=TRUE,LEFT('Arş.Gör. Sonuç'!D42,2)&REPT(\"*\",3),LEFT('Arş.Gör. Sonuç'!D42,2)&REPT(\"*\",3)&\" \"&MID('Arş.Gör. Sonuç'!D42,FIND(\" \",'Arş.Gör. Sonuç'!D42)+1,2)&REPT(\"*\",3)))","v":""},{"$f":"IF('Arş.Gör. Sonuç'!E42=\"\",\"\",'Arş.Gör. Sonuç'!E42)","v":""},{"$f":"IF('Arş.Gör. Sonuç'!F42=\"\",\"\",'Arş.Gör. Sonuç'!F42)","v":""},{"$f":"IF('Arş.Gör. Sonuç'!G42=\"\",\"\",'Arş.Gör. Sonuç'!G42)","v":""},{"$f":"IF('Arş.Gör. Sonuç'!H42=\"\",\"\",'Arş.Gör. Sonuç'!H42)","v":""},{"$f":"IF('Arş.Gör. Sonuç'!I42=\"\",\"\",'Arş.Gör. Sonuç'!I42)","v":""},{"$f":"IF('Arş.Gör. Sonuç'!J42=\"\",\"\",'Arş.Gör. Sonuç'!J42)","v":""},{"$f":"IF('Arş.Gör. Sonuç'!K42=\"\",\"\",'Arş.Gör. Sonuç'!K42)","v":""},{"$f":"IF('Arş.Gör. Sonuç'!L42=\"\",\"\",'Arş.Gör. Sonuç'!L42)","v":""},{"$f":"IF('Arş.Gör. Sonuç'!M42=\"\",\"\",'Arş.Gör. Sonuç'!M42)","v":""},{"$f":"IF('Arş.Gör. Sonuç'!N42=\"\",\"\",'Arş.Gör. Sonuç'!N42)","v":""}]
[{"$f":"IF('Arş.Gör. Sonuç'!A43=\"\",\"\",'Arş.Gör. Sonuç'!A43)","v":""},{"$f":"IF('Arş.Gör. Sonuç'!B43=\"\",\"\",LEFT('Arş.Gör. Sonuç'!B43,3)&REPT(\"*\",4)&RIGHT('Arş.Gör. Sonuç'!B43,2))","v":""},{"$f":"IF('Arş.Gör. Sonuç'!C43=\"\",\"\",IF(ISERR(FIND(\" \",'Arş.Gör. Sonuç'!C43))=TRUE,LEFT('Arş.Gör. Sonuç'!C43,2)&REPT(\"*\",3),LEFT('Arş.Gör. Sonuç'!C43,2)&REPT(\"*\",3)&\" \"&MID('Arş.Gör. Sonuç'!C43,FIND(\" \",'Arş.Gör. Sonuç'!C43)+1,2)&REPT(\"*\",3)))","v":""},{"$f":"IF('Arş.Gör. Sonuç'!D43=\"\",\"\",IF(ISERR(FIND(\" \",'Arş.Gör. Sonuç'!D43))=TRUE,LEFT('Arş.Gör. Sonuç'!D43,2)&REPT(\"*\",3),LEFT('Arş.Gör. Sonuç'!D43,2)&REPT(\"*\",3)&\" \"&MID('Arş.Gör. Sonuç'!D43,FIND(\" \",'Arş.Gör. Sonuç'!D43)+1,2)&REPT(\"*\",3)))","v":""},{"$f":"IF('Arş.Gör. Sonuç'!E43=\"\",\"\",'Arş.Gör. Sonuç'!E43)","v":""},{"$f":"IF('Arş.Gör. Sonuç'!F43=\"\",\"\",'Arş.Gör. Sonuç'!F43)","v":""},{"$f":"IF('Arş.Gör. Sonuç'!G43=\"\",\"\",'Arş.Gör. Sonuç'!G43)","v":""},{"$f":"IF('Arş.Gör. Sonuç'!H43=\"\",\"\",'Arş.Gör. Sonuç'!H43)","v":""},{"$f":"IF('Arş.Gör. Sonuç'!I43=\"\",\"\",'Arş.Gör. Sonuç'!I43)","v":""},{"$f":"IF('Arş.Gör. Sonuç'!J43=\"\",\"\",'Arş.Gör. Sonuç'!J43)","v":""},{"$f":"IF('Arş.Gör. Sonuç'!K43=\"\",\"\",'Arş.Gör. Sonuç'!K43)","v":""},{"$f":"IF('Arş.Gör. Sonuç'!L43=\"\",\"\",'Arş.Gör. Sonuç'!L43)","v":""},{"$f":"IF('Arş.Gör. Sonuç'!M43=\"\",\"\",'Arş.Gör. Sonuç'!M43)","v":""},{"$f":"IF('Arş.Gör. Sonuç'!N43=\"\",\"\",'Arş.Gör. Sonuç'!N43)","v":""}]
[{"$f":"IF('Arş.Gör. Sonuç'!A44=\"\",\"\",'Arş.Gör. Sonuç'!A44)","v":""},{"$f":"IF('Arş.Gör. Sonuç'!B44=\"\",\"\",LEFT('Arş.Gör. Sonuç'!B44,3)&REPT(\"*\",4)&RIGHT('Arş.Gör. Sonuç'!B44,2))","v":""},{"$f":"IF('Arş.Gör. Sonuç'!C44=\"\",\"\",IF(ISERR(FIND(\" \",'Arş.Gör. Sonuç'!C44))=TRUE,LEFT('Arş.Gör. Sonuç'!C44,2)&REPT(\"*\",3),LEFT('Arş.Gör. Sonuç'!C44,2)&REPT(\"*\",3)&\" \"&MID('Arş.Gör. Sonuç'!C44,FIND(\" \",'Arş.Gör. Sonuç'!C44)+1,2)&REPT(\"*\",3)))","v":""},{"$f":"IF('Arş.Gör. Sonuç'!D44=\"\",\"\",IF(ISERR(FIND(\" \",'Arş.Gör. Sonuç'!D44))=TRUE,LEFT('Arş.Gör. Sonuç'!D44,2)&REPT(\"*\",3),LEFT('Arş.Gör. Sonuç'!D44,2)&REPT(\"*\",3)&\" \"&MID('Arş.Gör. Sonuç'!D44,FIND(\" \",'Arş.Gör. Sonuç'!D44)+1,2)&REPT(\"*\",3)))","v":""},{"$f":"IF('Arş.Gör. Sonuç'!E44=\"\",\"\",'Arş.Gör. Sonuç'!E44)","v":""},{"$f":"IF('Arş.Gör. Sonuç'!F44=\"\",\"\",'Arş.Gör. Sonuç'!F44)","v":""},{"$f":"IF('Arş.Gör. Sonuç'!G44=\"\",\"\",'Arş.Gör. Sonuç'!G44)","v":""},{"$f":"IF('Arş.Gör. Sonuç'!H44=\"\",\"\",'Arş.Gör. Sonuç'!H44)","v":""},{"$f":"IF('Arş.Gör. Sonuç'!I44=\"\",\"\",'Arş.Gör. Sonuç'!I44)","v":""},{"$f":"IF('Arş.Gör. Sonuç'!J44=\"\",\"\",'Arş.Gör. Sonuç'!J44)","v":""},{"$f":"IF('Arş.Gör. Sonuç'!K44=\"\",\"\",'Arş.Gör. Sonuç'!K44)","v":""},{"$f":"IF('Arş.Gör. Sonuç'!L44=\"\",\"\",'Arş.Gör. Sonuç'!L44)","v":""},{"$f":"IF('Arş.Gör. Sonuç'!M44=\"\",\"\",'Arş.Gör. Sonuç'!M44)","v":""},{"$f":"IF('Arş.Gör. Sonuç'!N44=\"\",\"\",'Arş.Gör. Sonuç'!N44)","v":""}]
[{"$f":"IF('Arş.Gör. Sonuç'!A45=\"\",\"\",'Arş.Gör. Sonuç'!A45)","v":""},{"$f":"IF('Arş.Gör. Sonuç'!B45=\"\",\"\",LEFT('Arş.Gör. Sonuç'!B45,3)&REPT(\"*\",4)&RIGHT('Arş.Gör. Sonuç'!B45,2))","v":""},{"$f":"IF('Arş.Gör. Sonuç'!C45=\"\",\"\",IF(ISERR(FIND(\" \",'Arş.Gör. Sonuç'!C45))=TRUE,LEFT('Arş.Gör. Sonuç'!C45,2)&REPT(\"*\",3),LEFT('Arş.Gör. Sonuç'!C45,2)&REPT(\"*\",3)&\" \"&MID('Arş.Gör. Sonuç'!C45,FIND(\" \",'Arş.Gör. Sonuç'!C45)+1,2)&REPT(\"*\",3)))","v":""},{"$f":"IF('Arş.Gör. Sonuç'!D45=\"\",\"\",IF(ISERR(FIND(\" \",'Arş.Gör. Sonuç'!D45))=TRUE,LEFT('Arş.Gör. Sonuç'!D45,2)&REPT(\"*\",3),LEFT('Arş.Gör. Sonuç'!D45,2)&REPT(\"*\",3)&\" \"&MID('Arş.Gör. Sonuç'!D45,FIND(\" \",'Arş.Gör. Sonuç'!D45)+1,2)&REPT(\"*\",3)))","v":""},{"$f":"IF('Arş.Gör. Sonuç'!E45=\"\",\"\",'Arş.Gör. Sonuç'!E45)","v":""},{"$f":"IF('Arş.Gör. Sonuç'!F45=\"\",\"\",'Arş.Gör. Sonuç'!F45)","v":""},{"$f":"IF('Arş.Gör. Sonuç'!G45=\"\",\"\",'Arş.Gör. Sonuç'!G45)","v":""},{"$f":"IF('Arş.Gör. Sonuç'!H45=\"\",\"\",'Arş.Gör. Sonuç'!H45)","v":""},{"$f":"IF('Arş.Gör. Sonuç'!I45=\"\",\"\",'Arş.Gör. Sonuç'!I45)","v":""},{"$f":"IF('Arş.Gör. Sonuç'!J45=\"\",\"\",'Arş.Gör. Sonuç'!J45)","v":""},{"$f":"IF('Arş.Gör. Sonuç'!K45=\"\",\"\",'Arş.Gör. Sonuç'!K45)","v":""},{"$f":"IF('Arş.Gör. Sonuç'!L45=\"\",\"\",'Arş.Gör. Sonuç'!L45)","v":""},{"$f":"IF('Arş.Gör. Sonuç'!M45=\"\",\"\",'Arş.Gör. Sonuç'!M45)","v":""},{"$f":"IF('Arş.Gör. Sonuç'!N45=\"\",\"\",'Arş.Gör. Sonuç'!N45)","v":""}]
[{"$f":"IF('Arş.Gör. Sonuç'!A46=\"\",\"\",'Arş.Gör. Sonuç'!A46)","v":""},{"$f":"IF('Arş.Gör. Sonuç'!B46=\"\",\"\",LEFT('Arş.Gör. Sonuç'!B46,3)&REPT(\"*\",4)&RIGHT('Arş.Gör. Sonuç'!B46,2))","v":""},{"$f":"IF('Arş.Gör. Sonuç'!C46=\"\",\"\",IF(ISERR(FIND(\" \",'Arş.Gör. Sonuç'!C46))=TRUE,LEFT('Arş.Gör. Sonuç'!C46,2)&REPT(\"*\",3),LEFT('Arş.Gör. Sonuç'!C46,2)&REPT(\"*\",3)&\" \"&MID('Arş.Gör. Sonuç'!C46,FIND(\" \",'Arş.Gör. Sonuç'!C46)+1,2)&REPT(\"*\",3)))","v":""},{"$f":"IF('Arş.Gör. Sonuç'!D46=\"\",\"\",IF(ISERR(FIND(\" \",'Arş.Gör. Sonuç'!D46))=TRUE,LEFT('Arş.Gör. Sonuç'!D46,2)&REPT(\"*\",3),LEFT('Arş.Gör. Sonuç'!D46,2)&REPT(\"*\",3)&\" \"&MID('Arş.Gör. Sonuç'!D46,FIND(\" \",'Arş.Gör. Sonuç'!D46)+1,2)&REPT(\"*\",3)))","v":""},{"$f":"IF('Arş.Gör. Sonuç'!E46=\"\",\"\",'Arş.Gör. Sonuç'!E46)","v":""},{"$f":"IF('Arş.Gör. Sonuç'!F46=\"\",\"\",'Arş.Gör. Sonuç'!F46)","v":""},{"$f":"IF('Arş.Gör. Sonuç'!G46=\"\",\"\",'Arş.Gör. Sonuç'!G46)","v":""},{"$f":"IF('Arş.Gör. Sonuç'!H46=\"\",\"\",'Arş.Gör. Sonuç'!H46)","v":""},{"$f":"IF('Arş.Gör. Sonuç'!I46=\"\",\"\",'Arş.Gör. Sonuç'!I46)","v":""},{"$f":"IF('Arş.Gör. Sonuç'!J46=\"\",\"\",'Arş.Gör. Sonuç'!J46)","v":""},{"$f":"IF('Arş.Gör. Sonuç'!K46=\"\",\"\",'Arş.Gör. Sonuç'!K46)","v":""},{"$f":"IF('Arş.Gör. Sonuç'!L46=\"\",\"\",'Arş.Gör. Sonuç'!L46)","v":""},{"$f":"IF('Arş.Gör. Sonuç'!M46=\"\",\"\",'Arş.Gör. Sonuç'!M46)","v":""},{"$f":"IF('Arş.Gör. Sonuç'!N46=\"\",\"\",'Arş.Gör. Sonuç'!N46)","v":""}]
[{"$f":"IF('Arş.Gör. Sonuç'!A47=\"\",\"\",'Arş.Gör. Sonuç'!A47)","v":""},{"$f":"IF('Arş.Gör. Sonuç'!B47=\"\",\"\",LEFT('Arş.Gör. Sonuç'!B47,3)&REPT(\"*\",4)&RIGHT('Arş.Gör. Sonuç'!B47,2))","v":""},{"$f":"IF('Arş.Gör. Sonuç'!C47=\"\",\"\",IF(ISERR(FIND(\" \",'Arş.Gör. Sonuç'!C47))=TRUE,LEFT('Arş.Gör. Sonuç'!C47,2)&REPT(\"*\",3),LEFT('Arş.Gör. Sonuç'!C47,2)&REPT(\"*\",3)&\" \"&MID('Arş.Gör. Sonuç'!C47,FIND(\" \",'Arş.Gör. Sonuç'!C47)+1,2)&REPT(\"*\",3)))","v":""},{"$f":"IF('Arş.Gör. Sonuç'!D47=\"\",\"\",IF(ISERR(FIND(\" \",'Arş.Gör. Sonuç'!D47))=TRUE,LEFT('Arş.Gör. Sonuç'!D47,2)&REPT(\"*\",3),LEFT('Arş.Gör. Sonuç'!D47,2)&REPT(\"*\",3)&\" \"&MID('Arş.Gör. Sonuç'!D47,FIND(\" \",'Arş.Gör. Sonuç'!D47)+1,2)&REPT(\"*\",3)))","v":""},{"$f":"IF('Arş.Gör. Sonuç'!E47=\"\",\"\",'Arş.Gör. Sonuç'!E47)","v":""},{"$f":"IF('Arş.Gör. Sonuç'!F47=\"\",\"\",'Arş.Gör. Sonuç'!F47)","v":""},{"$f":"IF('Arş.Gör. Sonuç'!G47=\"\",\"\",'Arş.Gör. Sonuç'!G47)","v":""},{"$f":"IF('Arş.Gör. Sonuç'!H47=\"\",\"\",'Arş.Gör. Sonuç'!H47)","v":""},{"$f":"IF('Arş.Gör. Sonuç'!I47=\"\",\"\",'Arş.Gör. Sonuç'!I47)","v":""},{"$f":"IF('Arş.Gör. Sonuç'!J47=\"\",\"\",'Arş.Gör. Sonuç'!J47)","v":""},{"$f":"IF('Arş.Gör. Sonuç'!K47=\"\",\"\",'Arş.Gör. Sonuç'!K47)","v":""},{"$f":"IF('Arş.Gör. Sonuç'!L47=\"\",\"\",'Arş.Gör. Sonuç'!L47)","v":""},{"$f":"IF('Arş.Gör. Sonuç'!M47=\"\",\"\",'Arş.Gör. Sonuç'!M47)","v":""},{"$f":"IF('Arş.Gör. Sonuç'!N47=\"\",\"\",'Arş.Gör. Sonuç'!N47)","v":""}]
[{"$f":"IF('Arş.Gör. Sonuç'!A48=\"\",\"\",'Arş.Gör. Sonuç'!A48)","v":""},{"$f":"IF('Arş.Gör. Sonuç'!B48=\"\",\"\",LEFT('Arş.Gör. Sonuç'!B48,3)&REPT(\"*\",4)&RIGHT('Arş.Gör. Sonuç'!B48,2))","v":""},{"$f":"IF('Arş.Gör. Sonuç'!C48=\"\",\"\",IF(ISERR(FIND(\" \",'Arş.Gör. Sonuç'!C48))=TRUE,LEFT('Arş.Gör. Sonuç'!C48,2)&REPT(\"*\",3),LEFT('Arş.Gör. Sonuç'!C48,2)&REPT(\"*\",3)&\" \"&MID('Arş.Gör. Sonuç'!C48,FIND(\" \",'Arş.Gör. Sonuç'!C48)+1,2)&REPT(\"*\",3)))","v":""},{"$f":"IF('Arş.Gör. Sonuç'!D48=\"\",\"\",IF(ISERR(FIND(\" \",'Arş.Gör. Sonuç'!D48))=TRUE,LEFT('Arş.Gör. Sonuç'!D48,2)&REPT(\"*\",3),LEFT('Arş.Gör. Sonuç'!D48,2)&REPT(\"*\",3)&\" \"&MID('Arş.Gör. Sonuç'!D48,FIND(\" \",'Arş.Gör. Sonuç'!D48)+1,2)&REPT(\"*\",3)))","v":""},{"$f":"IF('Arş.Gör. Sonuç'!E48=\"\",\"\",'Arş.Gör. Sonuç'!E48)","v":""},{"$f":"IF('Arş.Gör. Sonuç'!F48=\"\",\"\",'Arş.Gör. Sonuç'!F48)","v":""},{"$f":"IF('Arş.Gör. Sonuç'!G48=\"\",\"\",'Arş.Gör. Sonuç'!G48)","v":""},{"$f":"IF('Arş.Gör. Sonuç'!H48=\"\",\"\",'Arş.Gör. Sonuç'!H48)","v":""},{"$f":"IF('Arş.Gör. Sonuç'!I48=\"\",\"\",'Arş.Gör. Sonuç'!I48)","v":""},{"$f":"IF('Arş.Gör. Sonuç'!J48=\"\",\"\",'Arş.Gör. Sonuç'!J48)","v":""},{"$f":"IF('Arş.Gör. Sonuç'!K48=\"\",\"\",'Arş.Gör. Sonuç'!K48)","v":""},{"$f":"IF('Arş.Gör. Sonuç'!L48=\"\",\"\",'Arş.Gör. Sonuç'!L48)","v":""},{"$f":"IF('Arş.Gör. Sonuç'!M48=\"\",\"\",'Arş.Gör. Sonuç'!M48)","v":""},{"$f":"IF('Arş.Gör. Sonuç'!N48=\"\",\"\",'Arş.Gör. Sonuç'!N48)","v":""}]
[{"$f":"IF('Arş.Gör. Sonuç'!A49=\"\",\"\",'Arş.Gör. Sonuç'!A49)","v":""},{"$f":"IF('Arş.Gör. Sonuç'!B49=\"\",\"\",LEFT('Arş.Gör. Sonuç'!B49,3)&REPT(\"*\",4)&RIGHT('Arş.Gör. Sonuç'!B49,2))","v":""},{"$f":"IF('Arş.Gör. Sonuç'!C49=\"\",\"\",IF(ISERR(FIND(\" \",'Arş.Gör. Sonuç'!C49))=TRUE,LEFT('Arş.Gör. Sonuç'!C49,2)&REPT(\"*\",3),LEFT('Arş.Gör. Sonuç'!C49,2)&REPT(\"*\",3)&\" \"&MID('Arş.Gör. Sonuç'!C49,FIND(\" \",'Arş.Gör. Sonuç'!C49)+1,2)&REPT(\"*\",3)))","v":""},{"$f":"IF('Arş.Gör. Sonuç'!D49=\"\",\"\",IF(ISERR(FIND(\" \",'Arş.Gör. Sonuç'!D49))=TRUE,LEFT('Arş.Gör. Sonuç'!D49,2)&REPT(\"*\",3),LEFT('Arş.Gör. Sonuç'!D49,2)&REPT(\"*\",3)&\" \"&MID('Arş.Gör. Sonuç'!D49,FIND(\" \",'Arş.Gör. Sonuç'!D49)+1,2)&REPT(\"*\",3)))","v":""},{"$f":"IF('Arş.Gör. Sonuç'!E49=\"\",\"\",'Arş.Gör. Sonuç'!E49)","v":""},{"$f":"IF('Arş.Gör. Sonuç'!F49=\"\",\"\",'Arş.Gör. Sonuç'!F49)","v":""},{"$f":"IF('Arş.Gör. Sonuç'!G49=\"\",\"\",'Arş.Gör. Sonuç'!G49)","v":""},{"$f":"IF('Arş.Gör. Sonuç'!H49=\"\",\"\",'Arş.Gör. Sonuç'!H49)","v":""},{"$f":"IF('Arş.Gör. Sonuç'!I49=\"\",\"\",'Arş.Gör. Sonuç'!I49)","v":""},{"$f":"IF('Arş.Gör. Sonuç'!J49=\"\",\"\",'Arş.Gör. Sonuç'!J49)","v":""},{"$f":"IF('Arş.Gör. Sonuç'!K49=\"\",\"\",'Arş.Gör. Sonuç'!K49)","v":""},{"$f":"IF('Arş.Gör. Sonuç'!L49=\"\",\"\",'Arş.Gör. Sonuç'!L49)","v":""},{"$f":"IF('Arş.Gör. Sonuç'!M49=\"\",\"\",'Arş.Gör. Sonuç'!M49)","v":""},{"$f":"IF('Arş.Gör. Sonuç'!N49=\"\",\"\",'Arş.Gör. Sonuç'!N49)","v":""}]
[{"$f":"IF('Arş.Gör. Sonuç'!A50=\"\",\"\",'Arş.Gör. Sonuç'!A50)","v":""},{"$f":"IF('Arş.Gör. Sonuç'!B50=\"\",\"\",LEFT('Arş.Gör. Sonuç'!B50,3)&REPT(\"*\",4)&RIGHT('Arş.Gör. Sonuç'!B50,2))","v":""},{"$f":"IF('Arş.Gör. Sonuç'!C50=\"\",\"\",IF(ISERR(FIND(\" \",'Arş.Gör. Sonuç'!C50))=TRUE,LEFT('Arş.Gör. Sonuç'!C50,2)&REPT(\"*\",3),LEFT('Arş.Gör. Sonuç'!C50,2)&REPT(\"*\",3)&\" \"&MID('Arş.Gör. Sonuç'!C50,FIND(\" \",'Arş.Gör. Sonuç'!C50)+1,2)&REPT(\"*\",3)))","v":""},{"$f":"IF('Arş.Gör. Sonuç'!D50=\"\",\"\",IF(ISERR(FIND(\" \",'Arş.Gör. Sonuç'!D50))=TRUE,LEFT('Arş.Gör. Sonuç'!D50,2)&REPT(\"*\",3),LEFT('Arş.Gör. Sonuç'!D50,2)&REPT(\"*\",3)&\" \"&MID('Arş.Gör. Sonuç'!D50,FIND(\" \",'Arş.Gör. Sonuç'!D50)+1,2)&REPT(\"*\",3)))","v":""},{"$f":"IF('Arş.Gör. Sonuç'!E50=\"\",\"\",'Arş.Gör. Sonuç'!E50)","v":""},{"$f":"IF('Arş.Gör. Sonuç'!F50=\"\",\"\",'Arş.Gör. Sonuç'!F50)","v":""},{"$f":"IF('Arş.Gör. Sonuç'!G50=\"\",\"\",'Arş.Gör. Sonuç'!G50)","v":""},{"$f":"IF('Arş.Gör. Sonuç'!H50=\"\",\"\",'Arş.Gör. Sonuç'!H50)","v":""},{"$f":"IF('Arş.Gör. Sonuç'!I50=\"\",\"\",'Arş.Gör. Sonuç'!I50)","v":""},{"$f":"IF('Arş.Gör. Sonuç'!J50=\"\",\"\",'Arş.Gör. Sonuç'!J50)","v":""},{"$f":"IF('Arş.Gör. Sonuç'!K50=\"\",\"\",'Arş.Gör. Sonuç'!K50)","v":""},{"$f":"IF('Arş.Gör. Sonuç'!L50=\"\",\"\",'Arş.Gör. Sonuç'!L50)","v":""},{"$f":"IF('Arş.Gör. Sonuç'!M50=\"\",\"\",'Arş.Gör. Sonuç'!M50)","v":""},{"$f":"IF('Arş.Gör. Sonuç'!N50=\"\",\"\",'Arş.Gör. Sonuç'!N50)","v":""}]
[{"$f":"IF('Arş.Gör. Sonuç'!A51=\"\",\"\",'Arş.Gör. Sonuç'!A51)","v":""},{"$f":"IF('Arş.Gör. Sonuç'!B51=\"\",\"\",LEFT('Arş.Gör. Sonuç'!B51,3)&REPT(\"*\",4)&RIGHT('Arş.Gör. Sonuç'!B51,2))","v":""},{"$f":"IF('Arş.Gör. Sonuç'!C51=\"\",\"\",IF(ISERR(FIND(\" \",'Arş.Gör. Sonuç'!C51))=TRUE,LEFT('Arş.Gör. Sonuç'!C51,2)&REPT(\"*\",3),LEFT('Arş.Gör. Sonuç'!C51,2)&REPT(\"*\",3)&\" \"&MID('Arş.Gör. Sonuç'!C51,FIND(\" \",'Arş.Gör. Sonuç'!C51)+1,2)&REPT(\"*\",3)))","v":""},{"$f":"IF('Arş.Gör. Sonuç'!D51=\"\",\"\",IF(ISERR(FIND(\" \",'Arş.Gör. Sonuç'!D51))=TRUE,LEFT('Arş.Gör. Sonuç'!D51,2)&REPT(\"*\",3),LEFT('Arş.Gör. Sonuç'!D51,2)&REPT(\"*\",3)&\" \"&MID('Arş.Gör. Sonuç'!D51,FIND(\" \",'Arş.Gör. Sonuç'!D51)+1,2)&REPT(\"*\",3)))","v":""},{"$f":"IF('Arş.Gör. Sonuç'!E51=\"\",\"\",'Arş.Gör. Sonuç'!E51)","v":""},{"$f":"IF('Arş.Gör. Sonuç'!F51=\"\",\"\",'Arş.Gör. Sonuç'!F51)","v":""},{"$f":"IF('Arş.Gör. Sonuç'!G51=\"\",\"\",'Arş.Gör. Sonuç'!G51)","v":""},{"$f":"IF('Arş.Gör. Sonuç'!H51=\"\",\"\",'Arş.Gör. Sonuç'!H51)","v":""},{"$f":"IF('Arş.Gör. Sonuç'!I51=\"\",\"\",'Arş.Gör. Sonuç'!I51)","v":""},{"$f":"IF('Arş.Gör. Sonuç'!J51=\"\",\"\",'Arş.Gör. Sonuç'!J51)","v":""},{"$f":"IF('Arş.Gör. Sonuç'!K51=\"\",\"\",'Arş.Gör. Sonuç'!K51)","v":""},{"$f":"IF('Arş.Gör. Sonuç'!L51=\"\",\"\",'Arş.Gör. Sonuç'!L51)","v":""},{"$f":"IF('Arş.Gör. Sonuç'!M51=\"\",\"\",'Arş.Gör. Sonuç'!M51)","v":""},{"$f":"IF('Arş.Gör. Sonuç'!N51=\"\",\"\",'Arş.Gör. Sonuç'!N51)","v":""}]
[{"$f":"IF('Arş.Gör. Sonuç'!A52=\"\",\"\",'Arş.Gör. Sonuç'!A52)","v":""},{"$f":"IF('Arş.Gör. Sonuç'!B52=\"\",\"\",LEFT('Arş.Gör. Sonuç'!B52,3)&REPT(\"*\",4)&RIGHT('Arş.Gör. Sonuç'!B52,2))","v":""},{"$f":"IF('Arş.Gör. Sonuç'!C52=\"\",\"\",IF(ISERR(FIND(\" \",'Arş.Gör. Sonuç'!C52))=TRUE,LEFT('Arş.Gör. Sonuç'!C52,2)&REPT(\"*\",3),LEFT('Arş.Gör. Sonuç'!C52,2)&REPT(\"*\",3)&\" \"&MID('Arş.Gör. Sonuç'!C52,FIND(\" \",'Arş.Gör. Sonuç'!C52)+1,2)&REPT(\"*\",3)))","v":""},{"$f":"IF('Arş.Gör. Sonuç'!D52=\"\",\"\",IF(ISERR(FIND(\" \",'Arş.Gör. Sonuç'!D52))=TRUE,LEFT('Arş.Gör. Sonuç'!D52,2)&REPT(\"*\",3),LEFT('Arş.Gör. Sonuç'!D52,2)&REPT(\"*\",3)&\" \"&MID('Arş.Gör. Sonuç'!D52,FIND(\" \",'Arş.Gör. Sonuç'!D52)+1,2)&REPT(\"*\",3)))","v":""},{"$f":"IF('Arş.Gör. Sonuç'!E52=\"\",\"\",'Arş.Gör. Sonuç'!E52)","v":""},{"$f":"IF('Arş.Gör. Sonuç'!F52=\"\",\"\",'Arş.Gör. Sonuç'!F52)","v":""},{"$f":"IF('Arş.Gör. Sonuç'!G52=\"\",\"\",'Arş.Gör. Sonuç'!G52)","v":""},{"$f":"IF('Arş.Gör. Sonuç'!H52=\"\",\"\",'Arş.Gör. Sonuç'!H52)","v":""},{"$f":"IF('Arş.Gör. Sonuç'!I52=\"\",\"\",'Arş.Gör. Sonuç'!I52)","v":""},{"$f":"IF('Arş.Gör. Sonuç'!J52=\"\",\"\",'Arş.Gör. Sonuç'!J52)","v":""},{"$f":"IF('Arş.Gör. Sonuç'!K52=\"\",\"\",'Arş.Gör. Sonuç'!K52)","v":""},{"$f":"IF('Arş.Gör. Sonuç'!L52=\"\",\"\",'Arş.Gör. Sonuç'!L52)","v":""},{"$f":"IF('Arş.Gör. Sonuç'!M52=\"\",\"\",'Arş.Gör. Sonuç'!M52)","v":""},{"$f":"IF('Arş.Gör. Sonuç'!N52=\"\",\"\",'Arş.Gör. Sonuç'!N52)","v":""}]
[{"$f":"IF('Arş.Gör. Sonuç'!A53=\"\",\"\",'Arş.Gör. Sonuç'!A53)","v":""},{"$f":"IF('Arş.Gör. Sonuç'!B53=\"\",\"\",LEFT('Arş.Gör. Sonuç'!B53,3)&REPT(\"*\",4)&RIGHT('Arş.Gör. Sonuç'!B53,2))","v":""},{"$f":"IF('Arş.Gör. Sonuç'!C53=\"\",\"\",IF(ISERR(FIND(\" \",'Arş.Gör. Sonuç'!C53))=TRUE,LEFT('Arş.Gör. Sonuç'!C53,2)&REPT(\"*\",3),LEFT('Arş.Gör. Sonuç'!C53,2)&REPT(\"*\",3)&\" \"&MID('Arş.Gör. Sonuç'!C53,FIND(\" \",'Arş.Gör. Sonuç'!C53)+1,2)&REPT(\"*\",3)))","v":""},{"$f":"IF('Arş.Gör. Sonuç'!D53=\"\",\"\",IF(ISERR(FIND(\" \",'Arş.Gör. Sonuç'!D53))=TRUE,LEFT('Arş.Gör. Sonuç'!D53,2)&REPT(\"*\",3),LEFT('Arş.Gör. Sonuç'!D53,2)&REPT(\"*\",3)&\" \"&MID('Arş.Gör. Sonuç'!D53,FIND(\" \",'Arş.Gör. Sonuç'!D53)+1,2)&REPT(\"*\",3)))","v":""},{"$f":"IF('Arş.Gör. Sonuç'!E53=\"\",\"\",'Arş.Gör. Sonuç'!E53)","v":""},{"$f":"IF('Arş.Gör. Sonuç'!F53=\"\",\"\",'Arş.Gör. Sonuç'!F53)","v":""},{"$f":"IF('Arş.Gör. Sonuç'!G53=\"\",\"\",'Arş.Gör. Sonuç'!G53)","v":""},{"$f":"IF('Arş.Gör. Sonuç'!H53=\"\",\"\",'Arş.Gör. Sonuç'!H53)","v":""},{"$f":"IF('Arş.Gör. Sonuç'!I53=\"\",\"\",'Arş.Gör. Sonuç'!I53)","v":""},{"$f":"IF('Arş.Gör. Sonuç'!J53=\"\",\"\",'Arş.Gör. Sonuç'!J53)","v":""},{"$f":"IF('Arş.Gör. Sonuç'!K53=\"\",\"\",'Arş.Gör. Sonuç'!K53)","v":""},{"$f":"IF('Arş.Gör. Sonuç'!L53=\"\",\"\",'Arş.Gör. Sonuç'!L53)","v":""},{"$f":"IF('Arş.Gör. Sonuç'!M53=\"\",\"\",'Arş.Gör. Sonuç'!M53)","v":""},{"$f":"IF('Arş.Gör. Sonuç'!N53=\"\",\"\",'Arş.Gör. Sonuç'!N53)","v":""}]
[{"$f":"IF('Arş.Gör. Sonuç'!A54=\"\",\"\",'Arş.Gör. Sonuç'!A54)","v":""},{"$f":"IF('Arş.Gör. Sonuç'!B54=\"\",\"\",LEFT('Arş.Gör. Sonuç'!B54,3)&REPT(\"*\",4)&RIGHT('Arş.Gör. Sonuç'!B54,2))","v":""},{"$f":"IF('Arş.Gör. Sonuç'!C54=\"\",\"\",IF(ISERR(FIND(\" \",'Arş.Gör. Sonuç'!C54))=TRUE,LEFT('Arş.Gör. Sonuç'!C54,2)&REPT(\"*\",3),LEFT('Arş.Gör. Sonuç'!C54,2)&REPT(\"*\",3)&\" \"&MID('Arş.Gör. Sonuç'!C54,FIND(\" \",'Arş.Gör. Sonuç'!C54)+1,2)&REPT(\"*\",3)))","v":""},{"$f":"IF('Arş.Gör. Sonuç'!D54=\"\",\"\",IF(ISERR(FIND(\" \",'Arş.Gör. Sonuç'!D54))=TRUE,LEFT('Arş.Gör. Sonuç'!D54,2)&REPT(\"*\",3),LEFT('Arş.Gör. Sonuç'!D54,2)&REPT(\"*\",3)&\" \"&MID('Arş.Gör. Sonuç'!D54,FIND(\" \",'Arş.Gör. Sonuç'!D54)+1,2)&REPT(\"*\",3)))","v":""},{"$f":"IF('Arş.Gör. Sonuç'!E54=\"\",\"\",'Arş.Gör. Sonuç'!E54)","v":""},{"$f":"IF('Arş.Gör. Sonuç'!F54=\"\",\"\",'Arş.Gör. Sonuç'!F54)","v":""},{"$f":"IF('Arş.Gör. Sonuç'!G54=\"\",\"\",'Arş.Gör. Sonuç'!G54)","v":""},{"$f":"IF('Arş.Gör. Sonuç'!H54=\"\",\"\",'Arş.Gör. Sonuç'!H54)","v":""},{"$f":"IF('Arş.Gör. Sonuç'!I54=\"\",\"\",'Arş.Gör. Sonuç'!I54)","v":""},{"$f":"IF('Arş.Gör. Sonuç'!J54=\"\",\"\",'Arş.Gör. Sonuç'!J54)","v":""},{"$f":"IF('Arş.Gör. Sonuç'!K54=\"\",\"\",'Arş.Gör. Sonuç'!K54)","v":""},{"$f":"IF('Arş.Gör. Sonuç'!L54=\"\",\"\",'Arş.Gör. Sonuç'!L54)","v":""},{"$f":"IF('Arş.Gör. Sonuç'!M54=\"\",\"\",'Arş.Gör. Sonuç'!M54)","v":""},{"$f":"IF('Arş.Gör. Sonuç'!N54=\"\",\"\",'Arş.Gör. Sonuç'!N54)","v":""}]
[{"$f":"IF('Arş.Gör. Sonuç'!A55=\"\",\"\",'Arş.Gör. Sonuç'!A55)","v":""},{"$f":"IF('Arş.Gör. Sonuç'!B55=\"\",\"\",LEFT('Arş.Gör. Sonuç'!B55,3)&REPT(\"*\",4)&RIGHT('Arş.Gör. Sonuç'!B55,2))","v":""},{"$f":"IF('Arş.Gör. Sonuç'!C55=\"\",\"\",IF(ISERR(FIND(\" \",'Arş.Gör. Sonuç'!C55))=TRUE,LEFT('Arş.Gör. Sonuç'!C55,2)&REPT(\"*\",3),LEFT('Arş.Gör. Sonuç'!C55,2)&REPT(\"*\",3)&\" \"&MID('Arş.Gör. Sonuç'!C55,FIND(\" \",'Arş.Gör. Sonuç'!C55)+1,2)&REPT(\"*\",3)))","v":""},{"$f":"IF('Arş.Gör. Sonuç'!D55=\"\",\"\",IF(ISERR(FIND(\" \",'Arş.Gör. Sonuç'!D55))=TRUE,LEFT('Arş.Gör. Sonuç'!D55,2)&REPT(\"*\",3),LEFT('Arş.Gör. Sonuç'!D55,2)&REPT(\"*\",3)&\" \"&MID('Arş.Gör. Sonuç'!D55,FIND(\" \",'Arş.Gör. Sonuç'!D55)+1,2)&REPT(\"*\",3)))","v":""},{"$f":"IF('Arş.Gör. Sonuç'!E55=\"\",\"\",'Arş.Gör. Sonuç'!E55)","v":""},{"$f":"IF('Arş.Gör. Sonuç'!F55=\"\",\"\",'Arş.Gör. Sonuç'!F55)","v":""},{"$f":"IF('Arş.Gör. Sonuç'!G55=\"\",\"\",'Arş.Gör. Sonuç'!G55)","v":""},{"$f":"IF('Arş.Gör. Sonuç'!H55=\"\",\"\",'Arş.Gör. Sonuç'!H55)","v":""},{"$f":"IF('Arş.Gör. Sonuç'!I55=\"\",\"\",'Arş.Gör. Sonuç'!I55)","v":""},{"$f":"IF('Arş.Gör. Sonuç'!J55=\"\",\"\",'Arş.Gör. Sonuç'!J55)","v":""},{"$f":"IF('Arş.Gör. Sonuç'!K55=\"\",\"\",'Arş.Gör. Sonuç'!K55)","v":""},{"$f":"IF('Arş.Gör. Sonuç'!L55=\"\",\"\",'Arş.Gör. Sonuç'!L55)","v":""},{"$f":"IF('Arş.Gör. Sonuç'!M55=\"\",\"\",'Arş.Gör. Sonuç'!M55)","v":""},{"$f":"IF('Arş.Gör. Sonuç'!N55=\"\",\"\",'Arş.Gör. Sonuç'!N55)","v":""}]
[{"$f":"IF('Arş.Gör. Sonuç'!A56=\"\",\"\",'Arş.Gör. Sonuç'!A56)","v":""},{"$f":"IF('Arş.Gör. Sonuç'!B56=\"\",\"\",LEFT('Arş.Gör. Sonuç'!B56,3)&REPT(\"*\",4)&RIGHT('Arş.Gör. Sonuç'!B56,2))","v":""},{"$f":"IF('Arş.Gör. Sonuç'!C56=\"\",\"\",IF(ISERR(FIND(\" \",'Arş.Gör. Sonuç'!C56))=TRUE,LEFT('Arş.Gör. Sonuç'!C56,2)&REPT(\"*\",3),LEFT('Arş.Gör. Sonuç'!C56,2)&REPT(\"*\",3)&\" \"&MID('Arş.Gör. Sonuç'!C56,FIND(\" \",'Arş.Gör. Sonuç'!C56)+1,2)&REPT(\"*\",3)))","v":""},{"$f":"IF('Arş.Gör. Sonuç'!D56=\"\",\"\",IF(ISERR(FIND(\" \",'Arş.Gör. Sonuç'!D56))=TRUE,LEFT('Arş.Gör. Sonuç'!D56,2)&REPT(\"*\",3),LEFT('Arş.Gör. Sonuç'!D56,2)&REPT(\"*\",3)&\" \"&MID('Arş.Gör. Sonuç'!D56,FIND(\" \",'Arş.Gör. Sonuç'!D56)+1,2)&REPT(\"*\",3)))","v":""},{"$f":"IF('Arş.Gör. Sonuç'!E56=\"\",\"\",'Arş.Gör. Sonuç'!E56)","v":""},{"$f":"IF('Arş.Gör. Sonuç'!F56=\"\",\"\",'Arş.Gör. Sonuç'!F56)","v":""},{"$f":"IF('Arş.Gör. Sonuç'!G56=\"\",\"\",'Arş.Gör. Sonuç'!G56)","v":""},{"$f":"IF('Arş.Gör. Sonuç'!H56=\"\",\"\",'Arş.Gör. Sonuç'!H56)","v":""},{"$f":"IF('Arş.Gör. Sonuç'!I56=\"\",\"\",'Arş.Gör. Sonuç'!I56)","v":""},{"$f":"IF('Arş.Gör. Sonuç'!J56=\"\",\"\",'Arş.Gör. Sonuç'!J56)","v":""},{"$f":"IF('Arş.Gör. Sonuç'!K56=\"\",\"\",'Arş.Gör. Sonuç'!K56)","v":""},{"$f":"IF('Arş.Gör. Sonuç'!L56=\"\",\"\",'Arş.Gör. Sonuç'!L56)","v":""},{"$f":"IF('Arş.Gör. Sonuç'!M56=\"\",\"\",'Arş.Gör. Sonuç'!M56)","v":""},{"$f":"IF('Arş.Gör. Sonuç'!N56=\"\",\"\",'Arş.Gör. Sonuç'!N56)","v":""}]
[{"$f":"IF('Arş.Gör. Sonuç'!A57=\"\",\"\",'Arş.Gör. Sonuç'!A57)","v":""},{"$f":"IF('Arş.Gör. Sonuç'!B57=\"\",\"\",LEFT('Arş.Gör. Sonuç'!B57,3)&REPT(\"*\",4)&RIGHT('Arş.Gör. Sonuç'!B57,2))","v":""},{"$f":"IF('Arş.Gör. Sonuç'!C57=\"\",\"\",IF(ISERR(FIND(\" \",'Arş.Gör. Sonuç'!C57))=TRUE,LEFT('Arş.Gör. Sonuç'!C57,2)&REPT(\"*\",3),LEFT('Arş.Gör. Sonuç'!C57,2)&REPT(\"*\",3)&\" \"&MID('Arş.Gör. Sonuç'!C57,FIND(\" \",'Arş.Gör. Sonuç'!C57)+1,2)&REPT(\"*\",3)))","v":""},{"$f":"IF('Arş.Gör. Sonuç'!D57=\"\",\"\",IF(ISERR(FIND(\" \",'Arş.Gör. Sonuç'!D57))=TRUE,LEFT('Arş.Gör. Sonuç'!D57,2)&REPT(\"*\",3),LEFT('Arş.Gör. Sonuç'!D57,2)&REPT(\"*\",3)&\" \"&MID('Arş.Gör. Sonuç'!D57,FIND(\" \",'Arş.Gör. Sonuç'!D57)+1,2)&REPT(\"*\",3)))","v":""},{"$f":"IF('Arş.Gör. Sonuç'!E57=\"\",\"\",'Arş.Gör. Sonuç'!E57)","v":""},{"$f":"IF('Arş.Gör. Sonuç'!F57=\"\",\"\",'Arş.Gör. Sonuç'!F57)","v":""},{"$f":"IF('Arş.Gör. Sonuç'!G57=\"\",\"\",'Arş.Gör. Sonuç'!G57)","v":""},{"$f":"IF('Arş.Gör. Sonuç'!H57=\"\",\"\",'Arş.Gör. Sonuç'!H57)","v":""},{"$f":"IF('Arş.Gör. Sonuç'!I57=\"\",\"\",'Arş.Gör. Sonuç'!I57)","v":""},{"$f":"IF('Arş.Gör. Sonuç'!J57=\"\",\"\",'Arş.Gör. Sonuç'!J57)","v":""},{"$f":"IF('Arş.Gör. Sonuç'!K57=\"\",\"\",'Arş.Gör. Sonuç'!K57)","v":""},{"$f":"IF('Arş.Gör. Sonuç'!L57=\"\",\"\",'Arş.Gör. Sonuç'!L57)","v":""},{"$f":"IF('Arş.Gör. Sonuç'!M57=\"\",\"\",'Arş.Gör. Sonuç'!M57)","v":""},{"$f":"IF('Arş.Gör. Sonuç'!N57=\"\",\"\",'Arş.Gör. Sonuç'!N57)","v":""}]
[{"$f":"IF('Arş.Gör. Sonuç'!A58=\"\",\"\",'Arş.Gör. Sonuç'!A58)","v":""},{"$f":"IF('Arş.Gör. Sonuç'!B58=\"\",\"\",LEFT('Arş.Gör. Sonuç'!B58,3)&REPT(\"*\",4)&RIGHT('Arş.Gör. Sonuç'!B58,2))","v":""},{"$f":"IF('Arş.Gör. Sonuç'!C58=\"\",\"\",IF(ISERR(FIND(\" \",'Arş.Gör. Sonuç'!C58))=TRUE,LEFT('Arş.Gör. Sonuç'!C58,2)&REPT(\"*\",3),LEFT('Arş.Gör. Sonuç'!C58,2)&REPT(\"*\",3)&\" \"&MID('Arş.Gör. Sonuç'!C58,FIND(\" \",'Arş.Gör. Sonuç'!C58)+1,2)&REPT(\"*\",3)))","v":""},{"$f":"IF('Arş.Gör. Sonuç'!D58=\"\",\"\",IF(ISERR(FIND(\" \",'Arş.Gör. Sonuç'!D58))=TRUE,LEFT('Arş.Gör. Sonuç'!D58,2)&REPT(\"*\",3),LEFT('Arş.Gör. Sonuç'!D58,2)&REPT(\"*\",3)&\" \"&MID('Arş.Gör. Sonuç'!D58,FIND(\" \",'Arş.Gör. Sonuç'!D58)+1,2)&REPT(\"*\",3)))","v":""},{"$f":"IF('Arş.Gör. Sonuç'!E58=\"\",\"\",'Arş.Gör. Sonuç'!E58)","v":""},{"$f":"IF('Arş.Gör. Sonuç'!F58=\"\",\"\",'Arş.Gör. Sonuç'!F58)","v":""},{"$f":"IF('Arş.Gör. Sonuç'!G58=\"\",\"\",'Arş.Gör. Sonuç'!G58)","v":""},{"$f":"IF('Arş.Gör. Sonuç'!H58=\"\",\"\",'Arş.Gör. Sonuç'!H58)","v":""},{"$f":"IF('Arş.Gör. Sonuç'!I58=\"\",\"\",'Arş.Gör. Sonuç'!I58)","v":""},{"$f":"IF('Arş.Gör. Sonuç'!J58=\"\",\"\",'Arş.Gör. Sonuç'!J58)","v":""},{"$f":"IF('Arş.Gör. Sonuç'!K58=\"\",\"\",'Arş.Gör. Sonuç'!K58)","v":""},{"$f":"IF('Arş.Gör. Sonuç'!L58=\"\",\"\",'Arş.Gör. Sonuç'!L58)","v":""},{"$f":"IF('Arş.Gör. Sonuç'!M58=\"\",\"\",'Arş.Gör. Sonuç'!M58)","v":""},{"$f":"IF('Arş.Gör. Sonuç'!N58=\"\",\"\",'Arş.Gör. Sonuç'!N58)","v":""}]
[{"$f":"IF('Arş.Gör. Sonuç'!A59=\"\",\"\",'Arş.Gör. Sonuç'!A59)","v":""},{"$f":"IF('Arş.Gör. Sonuç'!B59=\"\",\"\",LEFT('Arş.Gör. Sonuç'!B59,3)&REPT(\"*\",4)&RIGHT('Arş.Gör. Sonuç'!B59,2))","v":""},{"$f":"IF('Arş.Gör. Sonuç'!C59=\"\",\"\",IF(ISERR(FIND(\" \",'Arş.Gör. Sonuç'!C59))=TRUE,LEFT('Arş.Gör. Sonuç'!C59,2)&REPT(\"*\",3),LEFT('Arş.Gör. Sonuç'!C59,2)&REPT(\"*\",3)&\" \"&MID('Arş.Gör. Sonuç'!C59,FIND(\" \",'Arş.Gör. Sonuç'!C59)+1,2)&REPT(\"*\",3)))","v":""},{"$f":"IF('Arş.Gör. Sonuç'!D59=\"\",\"\",IF(ISERR(FIND(\" \",'Arş.Gör. Sonuç'!D59))=TRUE,LEFT('Arş.Gör. Sonuç'!D59,2)&REPT(\"*\",3),LEFT('Arş.Gör. Sonuç'!D59,2)&REPT(\"*\",3)&\" \"&MID('Arş.Gör. Sonuç'!D59,FIND(\" \",'Arş.Gör. Sonuç'!D59)+1,2)&REPT(\"*\",3)))","v":""},{"$f":"IF('Arş.Gör. Sonuç'!E59=\"\",\"\",'Arş.Gör. Sonuç'!E59)","v":""},{"$f":"IF('Arş.Gör. Sonuç'!F59=\"\",\"\",'Arş.Gör. Sonuç'!F59)","v":""},{"$f":"IF('Arş.Gör. Sonuç'!G59=\"\",\"\",'Arş.Gör. Sonuç'!G59)","v":""},{"$f":"IF('Arş.Gör. Sonuç'!H59=\"\",\"\",'Arş.Gör. Sonuç'!H59)","v":""},{"$f":"IF('Arş.Gör. Sonuç'!I59=\"\",\"\",'Arş.Gör. Sonuç'!I59)","v":""},{"$f":"IF('Arş.Gör. Sonuç'!J59=\"\",\"\",'Arş.Gör. Sonuç'!J59)","v":""},{"$f":"IF('Arş.Gör. Sonuç'!K59=\"\",\"\",'Arş.Gör. Sonuç'!K59)","v":""},{"$f":"IF('Arş.Gör. Sonuç'!L59=\"\",\"\",'Arş.Gör. Sonuç'!L59)","v":""},{"$f":"IF('Arş.Gör. Sonuç'!M59=\"\",\"\",'Arş.Gör. Sonuç'!M59)","v":""},{"$f":"IF('Arş.Gör. Sonuç'!N59=\"\",\"\",'Arş.Gör. Sonuç'!N59)","v":""}]
[{"$f":"IF('Arş.Gör. Sonuç'!A60=\"\",\"\",'Arş.Gör. Sonuç'!A60)","v":""},{"$f":"IF('Arş.Gör. Sonuç'!B60=\"\",\"\",LEFT('Arş.Gör. Sonuç'!B60,3)&REPT(\"*\",4)&RIGHT('Arş.Gör. Sonuç'!B60,2))","v":""},{"$f":"IF('Arş.Gör. Sonuç'!C60=\"\",\"\",IF(ISERR(FIND(\" \",'Arş.Gör. Sonuç'!C60))=TRUE,LEFT('Arş.Gör. Sonuç'!C60,2)&REPT(\"*\",3),LEFT('Arş.Gör. Sonuç'!C60,2)&REPT(\"*\",3)&\" \"&MID('Arş.Gör. Sonuç'!C60,FIND(\" \",'Arş.Gör. Sonuç'!C60)+1,2)&REPT(\"*\",3)))","v":""},{"$f":"IF('Arş.Gör. Sonuç'!D60=\"\",\"\",IF(ISERR(FIND(\" \",'Arş.Gör. Sonuç'!D60))=TRUE,LEFT('Arş.Gör. Sonuç'!D60,2)&REPT(\"*\",3),LEFT('Arş.Gör. Sonuç'!D60,2)&REPT(\"*\",3)&\" \"&MID('Arş.Gör. Sonuç'!D60,FIND(\" \",'Arş.Gör. Sonuç'!D60)+1,2)&REPT(\"*\",3)))","v":""},{"$f":"IF('Arş.Gör. Sonuç'!E60=\"\",\"\",'Arş.Gör. Sonuç'!E60)","v":""},{"$f":"IF('Arş.Gör. Sonuç'!F60=\"\",\"\",'Arş.Gör. Sonuç'!F60)","v":""},{"$f":"IF('Arş.Gör. Sonuç'!G60=\"\",\"\",'Arş.Gör. Sonuç'!G60)","v":""},{"$f":"IF('Arş.Gör. Sonuç'!H60=\"\",\"\",'Arş.Gör. Sonuç'!H60)","v":""},{"$f":"IF('Arş.Gör. Sonuç'!I60=\"\",\"\",'Arş.Gör. Sonuç'!I60)","v":""},{"$f":"IF('Arş.Gör. Sonuç'!J60=\"\",\"\",'Arş.Gör. Sonuç'!J60)","v":""},{"$f":"IF('Arş.Gör. Sonuç'!K60=\"\",\"\",'Arş.Gör. Sonuç'!K60)","v":""},{"$f":"IF('Arş.Gör. Sonuç'!L60=\"\",\"\",'Arş.Gör. Sonuç'!L60)","v":""},{"$f":"IF('Arş.Gör. Sonuç'!M60=\"\",\"\",'Arş.Gör. Sonuç'!M60)","v":""},{"$f":"IF('Arş.Gör. Sonuç'!N60=\"\",\"\",'Arş.Gör. Sonuç'!N60)","v":""}]
[{"$f":"IF('Arş.Gör. Sonuç'!A61=\"\",\"\",'Arş.Gör. Sonuç'!A61)","v":""},{"$f":"IF('Arş.Gör. Sonuç'!B61=\"\",\"\",LEFT('Arş.Gör. Sonuç'!B61,3)&REPT(\"*\",4)&RIGHT('Arş.Gör. Sonuç'!B61,2))","v":""},{"$f":"IF('Arş.Gör. Sonuç'!C61=\"\",\"\",IF(ISERR(FIND(\" \",'Arş.Gör. Sonuç'!C61))=TRUE,LEFT('Arş.Gör. Sonuç'!C61,2)&REPT(\"*\",3),LEFT('Arş.Gör. Sonuç'!C61,2)&REPT(\"*\",3)&\" \"&MID('Arş.Gör. Sonuç'!C61,FIND(\" \",'Arş.Gör. Sonuç'!C61)+1,2)&REPT(\"*\",3)))","v":""},{"$f":"IF('Arş.Gör. Sonuç'!D61=\"\",\"\",IF(ISERR(FIND(\" \",'Arş.Gör. Sonuç'!D61))=TRUE,LEFT('Arş.Gör. Sonuç'!D61,2)&REPT(\"*\",3),LEFT('Arş.Gör. Sonuç'!D61,2)&REPT(\"*\",3)&\" \"&MID('Arş.Gör. Sonuç'!D61,FIND(\" \",'Arş.Gör. Sonuç'!D61)+1,2)&REPT(\"*\",3)))","v":""},{"$f":"IF('Arş.Gör. Sonuç'!E61=\"\",\"\",'Arş.Gör. Sonuç'!E61)","v":""},{"$f":"IF('Arş.Gör. Sonuç'!F61=\"\",\"\",'Arş.Gör. Sonuç'!F61)","v":""},{"$f":"IF('Arş.Gör. Sonuç'!G61=\"\",\"\",'Arş.Gör. Sonuç'!G61)","v":""},{"$f":"IF('Arş.Gör. Sonuç'!H61=\"\",\"\",'Arş.Gör. Sonuç'!H61)","v":""},{"$f":"IF('Arş.Gör. Sonuç'!I61=\"\",\"\",'Arş.Gör. Sonuç'!I61)","v":""},{"$f":"IF('Arş.Gör. Sonuç'!J61=\"\",\"\",'Arş.Gör. Sonuç'!J61)","v":""},{"$f":"IF('Arş.Gör. Sonuç'!K61=\"\",\"\",'Arş.Gör. Sonuç'!K61)","v":""},{"$f":"IF('Arş.Gör. Sonuç'!L61=\"\",\"\",'Arş.Gör. Sonuç'!L61)","v":""},{"$f":"IF('Arş.Gör. Sonuç'!M61=\"\",\"\",'Arş.Gör. Sonuç'!M61)","v":""},{"$f":"IF('Arş.Gör. Sonuç'!N61=\"\",\"\",'Arş.Gör. Sonuç'!N61)","v":""}]
[{"$f":"IF('Arş.Gör. Sonuç'!A62=\"\",\"\",'Arş.Gör. Sonuç'!A62)","v":""},{"$f":"IF('Arş.Gör. Sonuç'!B62=\"\",\"\",LEFT('Arş.Gör. Sonuç'!B62,3)&REPT(\"*\",4)&RIGHT('Arş.Gör. Sonuç'!B62,2))","v":""},{"$f":"IF('Arş.Gör. Sonuç'!C62=\"\",\"\",IF(ISERR(FIND(\" \",'Arş.Gör. Sonuç'!C62))=TRUE,LEFT('Arş.Gör. Sonuç'!C62,2)&REPT(\"*\",3),LEFT('Arş.Gör. Sonuç'!C62,2)&REPT(\"*\",3)&\" \"&MID('Arş.Gör. Sonuç'!C62,FIND(\" \",'Arş.Gör. Sonuç'!C62)+1,2)&REPT(\"*\",3)))","v":""},{"$f":"IF('Arş.Gör. Sonuç'!D62=\"\",\"\",IF(ISERR(FIND(\" \",'Arş.Gör. Sonuç'!D62))=TRUE,LEFT('Arş.Gör. Sonuç'!D62,2)&REPT(\"*\",3),LEFT('Arş.Gör. Sonuç'!D62,2)&REPT(\"*\",3)&\" \"&MID('Arş.Gör. Sonuç'!D62,FIND(\" \",'Arş.Gör. Sonuç'!D62)+1,2)&REPT(\"*\",3)))","v":""},{"$f":"IF('Arş.Gör. Sonuç'!E62=\"\",\"\",'Arş.Gör. Sonuç'!E62)","v":""},{"$f":"IF('Arş.Gör. Sonuç'!F62=\"\",\"\",'Arş.Gör. Sonuç'!F62)","v":""},{"$f":"IF('Arş.Gör. Sonuç'!G62=\"\",\"\",'Arş.Gör. Sonuç'!G62)","v":""},{"$f":"IF('Arş.Gör. Sonuç'!H62=\"\",\"\",'Arş.Gör. Sonuç'!H62)","v":""},{"$f":"IF('Arş.Gör. Sonuç'!I62=\"\",\"\",'Arş.Gör. Sonuç'!I62)","v":""},{"$f":"IF('Arş.Gör. Sonuç'!J62=\"\",\"\",'Arş.Gör. Sonuç'!J62)","v":""},{"$f":"IF('Arş.Gör. Sonuç'!K62=\"\",\"\",'Arş.Gör. Sonuç'!K62)","v":""},{"$f":"IF('Arş.Gör. Sonuç'!L62=\"\",\"\",'Arş.Gör. Sonuç'!L62)","v":""},{"$f":"IF('Arş.Gör. Sonuç'!M62=\"\",\"\",'Arş.Gör. Sonuç'!M62)","v":""},{"$f":"IF('Arş.Gör. Sonuç'!N62=\"\",\"\",'Arş.Gör. Sonuç'!N62)","v":""}]
[{"$f":"IF('Arş.Gör. Sonuç'!A63=\"\",\"\",'Arş.Gör. Sonuç'!A63)","v":""},{"$f":"IF('Arş.Gör. Sonuç'!B63=\"\",\"\",LEFT('Arş.Gör. Sonuç'!B63,3)&REPT(\"*\",4)&RIGHT('Arş.Gör. Sonuç'!B63,2))","v":""},{"$f":"IF('Arş.Gör. Sonuç'!C63=\"\",\"\",IF(ISERR(FIND(\" \",'Arş.Gör. Sonuç'!C63))=TRUE,LEFT('Arş.Gör. Sonuç'!C63,2)&REPT(\"*\",3),LEFT('Arş.Gör. Sonuç'!C63,2)&REPT(\"*\",3)&\" \"&MID('Arş.Gör. Sonuç'!C63,FIND(\" \",'Arş.Gör. Sonuç'!C63)+1,2)&REPT(\"*\",3)))","v":""},{"$f":"IF('Arş.Gör. Sonuç'!D63=\"\",\"\",IF(ISERR(FIND(\" \",'Arş.Gör. Sonuç'!D63))=TRUE,LEFT('Arş.Gör. Sonuç'!D63,2)&REPT(\"*\",3),LEFT('Arş.Gör. Sonuç'!D63,2)&REPT(\"*\",3)&\" \"&MID('Arş.Gör. Sonuç'!D63,FIND(\" \",'Arş.Gör. Sonuç'!D63)+1,2)&REPT(\"*\",3)))","v":""},{"$f":"IF('Arş.Gör. Sonuç'!E63=\"\",\"\",'Arş.Gör. Sonuç'!E63)","v":""},{"$f":"IF('Arş.Gör. Sonuç'!F63=\"\",\"\",'Arş.Gör. Sonuç'!F63)","v":""},{"$f":"IF('Arş.Gör. Sonuç'!G63=\"\",\"\",'Arş.Gör. Sonuç'!G63)","v":""},{"$f":"IF('Arş.Gör. Sonuç'!H63=\"\",\"\",'Arş.Gör. Sonuç'!H63)","v":""},{"$f":"IF('Arş.Gör. Sonuç'!I63=\"\",\"\",'Arş.Gör. Sonuç'!I63)","v":""},{"$f":"IF('Arş.Gör. Sonuç'!J63=\"\",\"\",'Arş.Gör. Sonuç'!J63)","v":""},{"$f":"IF('Arş.Gör. Sonuç'!K63=\"\",\"\",'Arş.Gör. Sonuç'!K63)","v":""},{"$f":"IF('Arş.Gör. Sonuç'!L63=\"\",\"\",'Arş.Gör. Sonuç'!L63)","v":""},{"$f":"IF('Arş.Gör. Sonuç'!M63=\"\",\"\",'Arş.Gör. Sonuç'!M63)","v":""},{"$f":"IF('Arş.Gör. Sonuç'!N63=\"\",\"\",'Arş.Gör. Sonuç'!N63)","v":""}]
[{"$f":"IF('Arş.Gör. Sonuç'!A64=\"\",\"\",'Arş.Gör. Sonuç'!A64)","v":""},{"$f":"IF('Arş.Gör. Sonuç'!B64=\"\",\"\",LEFT('Arş.Gör. Sonuç'!B64,3)&REPT(\"*\",4)&RIGHT('Arş.Gör. Sonuç'!B64,2))","v":""},{"$f":"IF('Arş.Gör. Sonuç'!C64=\"\",\"\",IF(ISERR(FIND(\" \",'Arş.Gör. Sonuç'!C64))=TRUE,LEFT('Arş.Gör. Sonuç'!C64,2)&REPT(\"*\",3),LEFT('Arş.Gör. Sonuç'!C64,2)&REPT(\"*\",3)&\" \"&MID('Arş.Gör. Sonuç'!C64,FIND(\" \",'Arş.Gör. Sonuç'!C64)+1,2)&REPT(\"*\",3)))","v":""},{"$f":"IF('Arş.Gör. Sonuç'!D64=\"\",\"\",IF(ISERR(FIND(\" \",'Arş.Gör. Sonuç'!D64))=TRUE,LEFT('Arş.Gör. Sonuç'!D64,2)&REPT(\"*\",3),LEFT('Arş.Gör. Sonuç'!D64,2)&REPT(\"*\",3)&\" \"&MID('Arş.Gör. Sonuç'!D64,FIND(\" \",'Arş.Gör. Sonuç'!D64)+1,2)&REPT(\"*\",3)))","v":""},{"$f":"IF('Arş.Gör. Sonuç'!E64=\"\",\"\",'Arş.Gör. Sonuç'!E64)","v":""},{"$f":"IF('Arş.Gör. Sonuç'!F64=\"\",\"\",'Arş.Gör. Sonuç'!F64)","v":""},{"$f":"IF('Arş.Gör. Sonuç'!G64=\"\",\"\",'Arş.Gör. Sonuç'!G64)","v":""},{"$f":"IF('Arş.Gör. Sonuç'!H64=\"\",\"\",'Arş.Gör. Sonuç'!H64)","v":""},{"$f":"IF('Arş.Gör. Sonuç'!I64=\"\",\"\",'Arş.Gör. Sonuç'!I64)","v":""},{"$f":"IF('Arş.Gör. Sonuç'!J64=\"\",\"\",'Arş.Gör. Sonuç'!J64)","v":""},{"$f":"IF('Arş.Gör. Sonuç'!K64=\"\",\"\",'Arş.Gör. Sonuç'!K64)","v":""},{"$f":"IF('Arş.Gör. Sonuç'!L64=\"\",\"\",'Arş.Gör. Sonuç'!L64)","v":""},{"$f":"IF('Arş.Gör. Sonuç'!M64=\"\",\"\",'Arş.Gör. Sonuç'!M64)","v":""},{"$f":"IF('Arş.Gör. Sonuç'!N64=\"\",\"\",'Arş.Gör. Sonuç'!N64)","v":""}]
[{"$f":"IF('Arş.Gör. Sonuç'!A65=\"\",\"\",'Arş.Gör. Sonuç'!A65)","v":""},{"$f":"IF('Arş.Gör. Sonuç'!B65=\"\",\"\",LEFT('Arş.Gör. Sonuç'!B65,3)&REPT(\"*\",4)&RIGHT('Arş.Gör. Sonuç'!B65,2))","v":""},{"$f":"IF('Arş.Gör. Sonuç'!C65=\"\",\"\",IF(ISERR(FIND(\" \",'Arş.Gör. Sonuç'!C65))=TRUE,LEFT('Arş.Gör. Sonuç'!C65,2)&REPT(\"*\",3),LEFT('Arş.Gör. Sonuç'!C65,2)&REPT(\"*\",3)&\" \"&MID('Arş.Gör. Sonuç'!C65,FIND(\" \",'Arş.Gör. Sonuç'!C65)+1,2)&REPT(\"*\",3)))","v":""},{"$f":"IF('Arş.Gör. Sonuç'!D65=\"\",\"\",IF(ISERR(FIND(\" \",'Arş.Gör. Sonuç'!D65))=TRUE,LEFT('Arş.Gör. Sonuç'!D65,2)&REPT(\"*\",3),LEFT('Arş.Gör. Sonuç'!D65,2)&REPT(\"*\",3)&\" \"&MID('Arş.Gör. Sonuç'!D65,FIND(\" \",'Arş.Gör. Sonuç'!D65)+1,2)&REPT(\"*\",3)))","v":""},{"$f":"IF('Arş.Gör. Sonuç'!E65=\"\",\"\",'Arş.Gör. Sonuç'!E65)","v":""},{"$f":"IF('Arş.Gör. Sonuç'!F65=\"\",\"\",'Arş.Gör. Sonuç'!F65)","v":""},{"$f":"IF('Arş.Gör. Sonuç'!G65=\"\",\"\",'Arş.Gör. Sonuç'!G65)","v":""},{"$f":"IF('Arş.Gör. Sonuç'!H65=\"\",\"\",'Arş.Gör. Sonuç'!H65)","v":""},{"$f":"IF('Arş.Gör. Sonuç'!I65=\"\",\"\",'Arş.Gör. Sonuç'!I65)","v":""},{"$f":"IF('Arş.Gör. Sonuç'!J65=\"\",\"\",'Arş.Gör. Sonuç'!J65)","v":""},{"$f":"IF('Arş.Gör. Sonuç'!K65=\"\",\"\",'Arş.Gör. Sonuç'!K65)","v":""},{"$f":"IF('Arş.Gör. Sonuç'!L65=\"\",\"\",'Arş.Gör. Sonuç'!L65)","v":""},{"$f":"IF('Arş.Gör. Sonuç'!M65=\"\",\"\",'Arş.Gör. Sonuç'!M65)","v":""},{"$f":"IF('Arş.Gör. Sonuç'!N65=\"\",\"\",'Arş.Gör. Sonuç'!N65)","v":""}]
[{"$f":"IF('Arş.Gör. Sonuç'!A66=\"\",\"\",'Arş.Gör. Sonuç'!A66)","v":""},{"$f":"IF('Arş.Gör. Sonuç'!B66=\"\",\"\",LEFT('Arş.Gör. Sonuç'!B66,3)&REPT(\"*\",4)&RIGHT('Arş.Gör. Sonuç'!B66,2))","v":""},{"$f":"IF('Arş.Gör. Sonuç'!C66=\"\",\"\",IF(ISERR(FIND(\" \",'Arş.Gör. Sonuç'!C66))=TRUE,LEFT('Arş.Gör. Sonuç'!C66,2)&REPT(\"*\",3),LEFT('Arş.Gör. Sonuç'!C66,2)&REPT(\"*\",3)&\" \"&MID('Arş.Gör. Sonuç'!C66,FIND(\" \",'Arş.Gör. Sonuç'!C66)+1,2)&REPT(\"*\",3)))","v":""},{"$f":"IF('Arş.Gör. Sonuç'!D66=\"\",\"\",IF(ISERR(FIND(\" \",'Arş.Gör. Sonuç'!D66))=TRUE,LEFT('Arş.Gör. Sonuç'!D66,2)&REPT(\"*\",3),LEFT('Arş.Gör. Sonuç'!D66,2)&REPT(\"*\",3)&\" \"&MID('Arş.Gör. Sonuç'!D66,FIND(\" \",'Arş.Gör. Sonuç'!D66)+1,2)&REPT(\"*\",3)))","v":""},{"$f":"IF('Arş.Gör. Sonuç'!E66=\"\",\"\",'Arş.Gör. Sonuç'!E66)","v":""},{"$f":"IF('Arş.Gör. Sonuç'!F66=\"\",\"\",'Arş.Gör. Sonuç'!F66)","v":""},{"$f":"IF('Arş.Gör. Sonuç'!G66=\"\",\"\",'Arş.Gör. Sonuç'!G66)","v":""},{"$f":"IF('Arş.Gör. Sonuç'!H66=\"\",\"\",'Arş.Gör. Sonuç'!H66)","v":""},{"$f":"IF('Arş.Gör. Sonuç'!I66=\"\",\"\",'Arş.Gör. Sonuç'!I66)","v":""},{"$f":"IF('Arş.Gör. Sonuç'!J66=\"\",\"\",'Arş.Gör. Sonuç'!J66)","v":""},{"$f":"IF('Arş.Gör. Sonuç'!K66=\"\",\"\",'Arş.Gör. Sonuç'!K66)","v":""},{"$f":"IF('Arş.Gör. Sonuç'!L66=\"\",\"\",'Arş.Gör. Sonuç'!L66)","v":""},{"$f":"IF('Arş.Gör. Sonuç'!M66=\"\",\"\",'Arş.Gör. Sonuç'!M66)","v":""},{"$f":"IF('Arş.Gör. Sonuç'!N66=\"\",\"\",'Arş.Gör. Sonuç'!N66)","v":""}]
[{"$f":"IF('Arş.Gör. Sonuç'!A67=\"\",\"\",'Arş.Gör. Sonuç'!A67)","v":""},{"$f":"IF('Arş.Gör. Sonuç'!B67=\"\",\"\",LEFT('Arş.Gör. Sonuç'!B67,3)&REPT(\"*\",4)&RIGHT('Arş.Gör. Sonuç'!B67,2))","v":""},{"$f":"IF('Arş.Gör. Sonuç'!C67=\"\",\"\",IF(ISERR(FIND(\" \",'Arş.Gör. Sonuç'!C67))=TRUE,LEFT('Arş.Gör. Sonuç'!C67,2)&REPT(\"*\",3),LEFT('Arş.Gör. Sonuç'!C67,2)&REPT(\"*\",3)&\" \"&MID('Arş.Gör. Sonuç'!C67,FIND(\" \",'Arş.Gör. Sonuç'!C67)+1,2)&REPT(\"*\",3)))","v":""},{"$f":"IF('Arş.Gör. Sonuç'!D67=\"\",\"\",IF(ISERR(FIND(\" \",'Arş.Gör. Sonuç'!D67))=TRUE,LEFT('Arş.Gör. Sonuç'!D67,2)&REPT(\"*\",3),LEFT('Arş.Gör. Sonuç'!D67,2)&REPT(\"*\",3)&\" \"&MID('Arş.Gör. Sonuç'!D67,FIND(\" \",'Arş.Gör. Sonuç'!D67)+1,2)&REPT(\"*\",3)))","v":""},{"$f":"IF('Arş.Gör. Sonuç'!E67=\"\",\"\",'Arş.Gör. Sonuç'!E67)","v":""},{"$f":"IF('Arş.Gör. Sonuç'!F67=\"\",\"\",'Arş.Gör. Sonuç'!F67)","v":""},{"$f":"IF('Arş.Gör. Sonuç'!G67=\"\",\"\",'Arş.Gör. Sonuç'!G67)","v":""},{"$f":"IF('Arş.Gör. Sonuç'!H67=\"\",\"\",'Arş.Gör. Sonuç'!H67)","v":""},{"$f":"IF('Arş.Gör. Sonuç'!I67=\"\",\"\",'Arş.Gör. Sonuç'!I67)","v":""},{"$f":"IF('Arş.Gör. Sonuç'!J67=\"\",\"\",'Arş.Gör. Sonuç'!J67)","v":""},{"$f":"IF('Arş.Gör. Sonuç'!K67=\"\",\"\",'Arş.Gör. Sonuç'!K67)","v":""},{"$f":"IF('Arş.Gör. Sonuç'!L67=\"\",\"\",'Arş.Gör. Sonuç'!L67)","v":""},{"$f":"IF('Arş.Gör. Sonuç'!M67=\"\",\"\",'Arş.Gör. Sonuç'!M67)","v":""},{"$f":"IF('Arş.Gör. Sonuç'!N67=\"\",\"\",'Arş.Gör. Sonuç'!N67)","v":""}]
[{"$f":"IF('Arş.Gör. Sonuç'!A68=\"\",\"\",'Arş.Gör. Sonuç'!A68)","v":""},{"$f":"IF('Arş.Gör. Sonuç'!B68=\"\",\"\",LEFT('Arş.Gör. Sonuç'!B68,3)&REPT(\"*\",4)&RIGHT('Arş.Gör. Sonuç'!B68,2))","v":""},{"$f":"IF('Arş.Gör. Sonuç'!C68=\"\",\"\",IF(ISERR(FIND(\" \",'Arş.Gör. Sonuç'!C68))=TRUE,LEFT('Arş.Gör. Sonuç'!C68,2)&REPT(\"*\",3),LEFT('Arş.Gör. Sonuç'!C68,2)&REPT(\"*\",3)&\" \"&MID('Arş.Gör. Sonuç'!C68,FIND(\" \",'Arş.Gör. Sonuç'!C68)+1,2)&REPT(\"*\",3)))","v":""},{"$f":"IF('Arş.Gör. Sonuç'!D68=\"\",\"\",IF(ISERR(FIND(\" \",'Arş.Gör. Sonuç'!D68))=TRUE,LEFT('Arş.Gör. Sonuç'!D68,2)&REPT(\"*\",3),LEFT('Arş.Gör. Sonuç'!D68,2)&REPT(\"*\",3)&\" \"&MID('Arş.Gör. Sonuç'!D68,FIND(\" \",'Arş.Gör. Sonuç'!D68)+1,2)&REPT(\"*\",3)))","v":""},{"$f":"IF('Arş.Gör. Sonuç'!E68=\"\",\"\",'Arş.Gör. Sonuç'!E68)","v":""},{"$f":"IF('Arş.Gör. Sonuç'!F68=\"\",\"\",'Arş.Gör. Sonuç'!F68)","v":""},{"$f":"IF('Arş.Gör. Sonuç'!G68=\"\",\"\",'Arş.Gör. Sonuç'!G68)","v":""},{"$f":"IF('Arş.Gör. Sonuç'!H68=\"\",\"\",'Arş.Gör. Sonuç'!H68)","v":""},{"$f":"IF('Arş.Gör. Sonuç'!I68=\"\",\"\",'Arş.Gör. Sonuç'!I68)","v":""},{"$f":"IF('Arş.Gör. Sonuç'!J68=\"\",\"\",'Arş.Gör. Sonuç'!J68)","v":""},{"$f":"IF('Arş.Gör. Sonuç'!K68=\"\",\"\",'Arş.Gör. Sonuç'!K68)","v":""},{"$f":"IF('Arş.Gör. Sonuç'!L68=\"\",\"\",'Arş.Gör. Sonuç'!L68)","v":""},{"$f":"IF('Arş.Gör. Sonuç'!M68=\"\",\"\",'Arş.Gör. Sonuç'!M68)","v":""},{"$f":"IF('Arş.Gör. Sonuç'!N68=\"\",\"\",'Arş.Gör. Sonuç'!N68)","v":""}]
[{"$f":"IF('Arş.Gör. Sonuç'!A69=\"\",\"\",'Arş.Gör. Sonuç'!A69)","v":""},{"$f":"IF('Arş.Gör. Sonuç'!B69=\"\",\"\",LEFT('Arş.Gör. Sonuç'!B69,3)&REPT(\"*\",4)&RIGHT('Arş.Gör. Sonuç'!B69,2))","v":""},{"$f":"IF('Arş.Gör. Sonuç'!C69=\"\",\"\",IF(ISERR(FIND(\" \",'Arş.Gör. Sonuç'!C69))=TRUE,LEFT('Arş.Gör. Sonuç'!C69,2)&REPT(\"*\",3),LEFT('Arş.Gör. Sonuç'!C69,2)&REPT(\"*\",3)&\" \"&MID('Arş.Gör. Sonuç'!C69,FIND(\" \",'Arş.Gör. Sonuç'!C69)+1,2)&REPT(\"*\",3)))","v":""},{"$f":"IF('Arş.Gör. Sonuç'!D69=\"\",\"\",IF(ISERR(FIND(\" \",'Arş.Gör. Sonuç'!D69))=TRUE,LEFT('Arş.Gör. Sonuç'!D69,2)&REPT(\"*\",3),LEFT('Arş.Gör. Sonuç'!D69,2)&REPT(\"*\",3)&\" \"&MID('Arş.Gör. Sonuç'!D69,FIND(\" \",'Arş.Gör. Sonuç'!D69)+1,2)&REPT(\"*\",3)))","v":""},{"$f":"IF('Arş.Gör. Sonuç'!E69=\"\",\"\",'Arş.Gör. Sonuç'!E69)","v":""},{"$f":"IF('Arş.Gör. Sonuç'!F69=\"\",\"\",'Arş.Gör. Sonuç'!F69)","v":""},{"$f":"IF('Arş.Gör. Sonuç'!G69=\"\",\"\",'Arş.Gör. Sonuç'!G69)","v":""},{"$f":"IF('Arş.Gör. Sonuç'!H69=\"\",\"\",'Arş.Gör. Sonuç'!H69)","v":""},{"$f":"IF('Arş.Gör. Sonuç'!I69=\"\",\"\",'Arş.Gör. Sonuç'!I69)","v":""},{"$f":"IF('Arş.Gör. Sonuç'!J69=\"\",\"\",'Arş.Gör. Sonuç'!J69)","v":""},{"$f":"IF('Arş.Gör. Sonuç'!K69=\"\",\"\",'Arş.Gör. Sonuç'!K69)","v":""},{"$f":"IF('Arş.Gör. Sonuç'!L69=\"\",\"\",'Arş.Gör. Sonuç'!L69)","v":""},{"$f":"IF('Arş.Gör. Sonuç'!M69=\"\",\"\",'Arş.Gör. Sonuç'!M69)","v":""},{"$f":"IF('Arş.Gör. Sonuç'!N69=\"\",\"\",'Arş.Gör. Sonuç'!N69)","v":""}]
[{"$f":"IF('Arş.Gör. Sonuç'!A70=\"\",\"\",'Arş.Gör. Sonuç'!A70)","v":""},{"$f":"IF('Arş.Gör. Sonuç'!B70=\"\",\"\",LEFT('Arş.Gör. Sonuç'!B70,3)&REPT(\"*\",4)&RIGHT('Arş.Gör. Sonuç'!B70,2))","v":""},{"$f":"IF('Arş.Gör. Sonuç'!C70=\"\",\"\",IF(ISERR(FIND(\" \",'Arş.Gör. Sonuç'!C70))=TRUE,LEFT('Arş.Gör. Sonuç'!C70,2)&REPT(\"*\",3),LEFT('Arş.Gör. Sonuç'!C70,2)&REPT(\"*\",3)&\" \"&MID('Arş.Gör. Sonuç'!C70,FIND(\" \",'Arş.Gör. Sonuç'!C70)+1,2)&REPT(\"*\",3)))","v":""},{"$f":"IF('Arş.Gör. Sonuç'!D70=\"\",\"\",IF(ISERR(FIND(\" \",'Arş.Gör. Sonuç'!D70))=TRUE,LEFT('Arş.Gör. Sonuç'!D70,2)&REPT(\"*\",3),LEFT('Arş.Gör. Sonuç'!D70,2)&REPT(\"*\",3)&\" \"&MID('Arş.Gör. Sonuç'!D70,FIND(\" \",'Arş.Gör. Sonuç'!D70)+1,2)&REPT(\"*\",3)))","v":""},{"$f":"IF('Arş.Gör. Sonuç'!E70=\"\",\"\",'Arş.Gör. Sonuç'!E70)","v":""},{"$f":"IF('Arş.Gör. Sonuç'!F70=\"\",\"\",'Arş.Gör. Sonuç'!F70)","v":""},{"$f":"IF('Arş.Gör. Sonuç'!G70=\"\",\"\",'Arş.Gör. Sonuç'!G70)","v":""},{"$f":"IF('Arş.Gör. Sonuç'!H70=\"\",\"\",'Arş.Gör. Sonuç'!H70)","v":""},{"$f":"IF('Arş.Gör. Sonuç'!I70=\"\",\"\",'Arş.Gör. Sonuç'!I70)","v":""},{"$f":"IF('Arş.Gör. Sonuç'!J70=\"\",\"\",'Arş.Gör. Sonuç'!J70)","v":""},{"$f":"IF('Arş.Gör. Sonuç'!K70=\"\",\"\",'Arş.Gör. Sonuç'!K70)","v":""},{"$f":"IF('Arş.Gör. Sonuç'!L70=\"\",\"\",'Arş.Gör. Sonuç'!L70)","v":""},{"$f":"IF('Arş.Gör. Sonuç'!M70=\"\",\"\",'Arş.Gör. Sonuç'!M70)","v":""},{"$f":"IF('Arş.Gör. Sonuç'!N70=\"\",\"\",'Arş.Gör. Sonuç'!N70)","v":""}]
[{"$f":"IF('Arş.Gör. Sonuç'!A71=\"\",\"\",'Arş.Gör. Sonuç'!A71)","v":""},{"$f":"IF('Arş.Gör. Sonuç'!B71=\"\",\"\",LEFT('Arş.Gör. Sonuç'!B71,3)&REPT(\"*\",4)&RIGHT('Arş.Gör. Sonuç'!B71,2))","v":""},{"$f":"IF('Arş.Gör. Sonuç'!C71=\"\",\"\",IF(ISERR(FIND(\" \",'Arş.Gör. Sonuç'!C71))=TRUE,LEFT('Arş.Gör. Sonuç'!C71,2)&REPT(\"*\",3),LEFT('Arş.Gör. Sonuç'!C71,2)&REPT(\"*\",3)&\" \"&MID('Arş.Gör. Sonuç'!C71,FIND(\" \",'Arş.Gör. Sonuç'!C71)+1,2)&REPT(\"*\",3)))","v":""},{"$f":"IF('Arş.Gör. Sonuç'!D71=\"\",\"\",IF(ISERR(FIND(\" \",'Arş.Gör. Sonuç'!D71))=TRUE,LEFT('Arş.Gör. Sonuç'!D71,2)&REPT(\"*\",3),LEFT('Arş.Gör. Sonuç'!D71,2)&REPT(\"*\",3)&\" \"&MID('Arş.Gör. Sonuç'!D71,FIND(\" \",'Arş.Gör. Sonuç'!D71)+1,2)&REPT(\"*\",3)))","v":""},{"$f":"IF('Arş.Gör. Sonuç'!E71=\"\",\"\",'Arş.Gör. Sonuç'!E71)","v":""},{"$f":"IF('Arş.Gör. Sonuç'!F71=\"\",\"\",'Arş.Gör. Sonuç'!F71)","v":""},{"$f":"IF('Arş.Gör. Sonuç'!G71=\"\",\"\",'Arş.Gör. Sonuç'!G71)","v":""},{"$f":"IF('Arş.Gör. Sonuç'!H71=\"\",\"\",'Arş.Gör. Sonuç'!H71)","v":""},{"$f":"IF('Arş.Gör. Sonuç'!I71=\"\",\"\",'Arş.Gör. Sonuç'!I71)","v":""},{"$f":"IF('Arş.Gör. Sonuç'!J71=\"\",\"\",'Arş.Gör. Sonuç'!J71)","v":""},{"$f":"IF('Arş.Gör. Sonuç'!K71=\"\",\"\",'Arş.Gör. Sonuç'!K71)","v":""},{"$f":"IF('Arş.Gör. Sonuç'!L71=\"\",\"\",'Arş.Gör. Sonuç'!L71)","v":""},{"$f":"IF('Arş.Gör. Sonuç'!M71=\"\",\"\",'Arş.Gör. Sonuç'!M71)","v":""},{"$f":"IF('Arş.Gör. Sonuç'!N71=\"\",\"\",'Arş.Gör. Sonuç'!N71)","v":""}]
[{"$f":"IF('Arş.Gör. Sonuç'!A72=\"\",\"\",'Arş.Gör. Sonuç'!A72)","v":""},{"$f":"IF('Arş.Gör. Sonuç'!B72=\"\",\"\",LEFT('Arş.Gör. Sonuç'!B72,3)&REPT(\"*\",4)&RIGHT('Arş.Gör. Sonuç'!B72,2))","v":""},{"$f":"IF('Arş.Gör. Sonuç'!C72=\"\",\"\",IF(ISERR(FIND(\" \",'Arş.Gör. Sonuç'!C72))=TRUE,LEFT('Arş.Gör. Sonuç'!C72,2)&REPT(\"*\",3),LEFT('Arş.Gör. Sonuç'!C72,2)&REPT(\"*\",3)&\" \"&MID('Arş.Gör. Sonuç'!C72,FIND(\" \",'Arş.Gör. Sonuç'!C72)+1,2)&REPT(\"*\",3)))","v":""},{"$f":"IF('Arş.Gör. Sonuç'!D72=\"\",\"\",IF(ISERR(FIND(\" \",'Arş.Gör. Sonuç'!D72))=TRUE,LEFT('Arş.Gör. Sonuç'!D72,2)&REPT(\"*\",3),LEFT('Arş.Gör. Sonuç'!D72,2)&REPT(\"*\",3)&\" \"&MID('Arş.Gör. Sonuç'!D72,FIND(\" \",'Arş.Gör. Sonuç'!D72)+1,2)&REPT(\"*\",3)))","v":""},{"$f":"IF('Arş.Gör. Sonuç'!E72=\"\",\"\",'Arş.Gör. Sonuç'!E72)","v":""},{"$f":"IF('Arş.Gör. Sonuç'!F72=\"\",\"\",'Arş.Gör. Sonuç'!F72)","v":""},{"$f":"IF('Arş.Gör. Sonuç'!G72=\"\",\"\",'Arş.Gör. Sonuç'!G72)","v":""},{"$f":"IF('Arş.Gör. Sonuç'!H72=\"\",\"\",'Arş.Gör. Sonuç'!H72)","v":""},{"$f":"IF('Arş.Gör. Sonuç'!I72=\"\",\"\",'Arş.Gör. Sonuç'!I72)","v":""},{"$f":"IF('Arş.Gör. Sonuç'!J72=\"\",\"\",'Arş.Gör. Sonuç'!J72)","v":""},{"$f":"IF('Arş.Gör. Sonuç'!K72=\"\",\"\",'Arş.Gör. Sonuç'!K72)","v":""},{"$f":"IF('Arş.Gör. Sonuç'!L72=\"\",\"\",'Arş.Gör. Sonuç'!L72)","v":""},{"$f":"IF('Arş.Gör. Sonuç'!M72=\"\",\"\",'Arş.Gör. Sonuç'!M72)","v":""},{"$f":"IF('Arş.Gör. Sonuç'!N72=\"\",\"\",'Arş.Gör. Sonuç'!N72)","v":""}]
[{"$f":"IF('Arş.Gör. Sonuç'!A73=\"\",\"\",'Arş.Gör. Sonuç'!A73)","v":""},{"$f":"IF('Arş.Gör. Sonuç'!B73=\"\",\"\",LEFT('Arş.Gör. Sonuç'!B73,3)&REPT(\"*\",4)&RIGHT('Arş.Gör. Sonuç'!B73,2))","v":""},{"$f":"IF('Arş.Gör. Sonuç'!C73=\"\",\"\",IF(ISERR(FIND(\" \",'Arş.Gör. Sonuç'!C73))=TRUE,LEFT('Arş.Gör. Sonuç'!C73,2)&REPT(\"*\",3),LEFT('Arş.Gör. Sonuç'!C73,2)&REPT(\"*\",3)&\" \"&MID('Arş.Gör. Sonuç'!C73,FIND(\" \",'Arş.Gör. Sonuç'!C73)+1,2)&REPT(\"*\",3)))","v":""},{"$f":"IF('Arş.Gör. Sonuç'!D73=\"\",\"\",IF(ISERR(FIND(\" \",'Arş.Gör. Sonuç'!D73))=TRUE,LEFT('Arş.Gör. Sonuç'!D73,2)&REPT(\"*\",3),LEFT('Arş.Gör. Sonuç'!D73,2)&REPT(\"*\",3)&\" \"&MID('Arş.Gör. Sonuç'!D73,FIND(\" \",'Arş.Gör. Sonuç'!D73)+1,2)&REPT(\"*\",3)))","v":""},{"$f":"IF('Arş.Gör. Sonuç'!E73=\"\",\"\",'Arş.Gör. Sonuç'!E73)","v":""},{"$f":"IF('Arş.Gör. Sonuç'!F73=\"\",\"\",'Arş.Gör. Sonuç'!F73)","v":""},{"$f":"IF('Arş.Gör. Sonuç'!G73=\"\",\"\",'Arş.Gör. Sonuç'!G73)","v":""},{"$f":"IF('Arş.Gör. Sonuç'!H73=\"\",\"\",'Arş.Gör. Sonuç'!H73)","v":""},{"$f":"IF('Arş.Gör. Sonuç'!I73=\"\",\"\",'Arş.Gör. Sonuç'!I73)","v":""},{"$f":"IF('Arş.Gör. Sonuç'!J73=\"\",\"\",'Arş.Gör. Sonuç'!J73)","v":""},{"$f":"IF('Arş.Gör. Sonuç'!K73=\"\",\"\",'Arş.Gör. Sonuç'!K73)","v":""},{"$f":"IF('Arş.Gör. Sonuç'!L73=\"\",\"\",'Arş.Gör. Sonuç'!L73)","v":""},{"$f":"IF('Arş.Gör. Sonuç'!M73=\"\",\"\",'Arş.Gör. Sonuç'!M73)","v":""},{"$f":"IF('Arş.Gör. Sonuç'!N73=\"\",\"\",'Arş.Gör. Sonuç'!N73)","v":""}]
[{"$f":"IF('Arş.Gör. Sonuç'!A74=\"\",\"\",'Arş.Gör. Sonuç'!A74)","v":""},{"$f":"IF('Arş.Gör. Sonuç'!B74=\"\",\"\",LEFT('Arş.Gör. Sonuç'!B74,3)&REPT(\"*\",4)&RIGHT('Arş.Gör. Sonuç'!B74,2))","v":""},{"$f":"IF('Arş.Gör. Sonuç'!C74=\"\",\"\",IF(ISERR(FIND(\" \",'Arş.Gör. Sonuç'!C74))=TRUE,LEFT('Arş.Gör. Sonuç'!C74,2)&REPT(\"*\",3),LEFT('Arş.Gör. Sonuç'!C74,2)&REPT(\"*\",3)&\" \"&MID('Arş.Gör. Sonuç'!C74,FIND(\" \",'Arş.Gör. Sonuç'!C74)+1,2)&REPT(\"*\",3)))","v":""},{"$f":"IF('Arş.Gör. Sonuç'!D74=\"\",\"\",IF(ISERR(FIND(\" \",'Arş.Gör. Sonuç'!D74))=TRUE,LEFT('Arş.Gör. Sonuç'!D74,2)&REPT(\"*\",3),LEFT('Arş.Gör. Sonuç'!D74,2)&REPT(\"*\",3)&\" \"&MID('Arş.Gör. Sonuç'!D74,FIND(\" \",'Arş.Gör. Sonuç'!D74)+1,2)&REPT(\"*\",3)))","v":""},{"$f":"IF('Arş.Gör. Sonuç'!E74=\"\",\"\",'Arş.Gör. Sonuç'!E74)","v":""},{"$f":"IF('Arş.Gör. Sonuç'!F74=\"\",\"\",'Arş.Gör. Sonuç'!F74)","v":""},{"$f":"IF('Arş.Gör. Sonuç'!G74=\"\",\"\",'Arş.Gör. Sonuç'!G74)","v":""},{"$f":"IF('Arş.Gör. Sonuç'!H74=\"\",\"\",'Arş.Gör. Sonuç'!H74)","v":""},{"$f":"IF('Arş.Gör. Sonuç'!I74=\"\",\"\",'Arş.Gör. Sonuç'!I74)","v":""},{"$f":"IF('Arş.Gör. Sonuç'!J74=\"\",\"\",'Arş.Gör. Sonuç'!J74)","v":""},{"$f":"IF('Arş.Gör. Sonuç'!K74=\"\",\"\",'Arş.Gör. Sonuç'!K74)","v":""},{"$f":"IF('Arş.Gör. Sonuç'!L74=\"\",\"\",'Arş.Gör. Sonuç'!L74)","v":""},{"$f":"IF('Arş.Gör. Sonuç'!M74=\"\",\"\",'Arş.Gör. Sonuç'!M74)","v":""},{"$f":"IF('Arş.Gör. Sonuç'!N74=\"\",\"\",'Arş.Gör. Sonuç'!N74)","v":""}]
[{"$f":"IF('Arş.Gör. Sonuç'!A75=\"\",\"\",'Arş.Gör. Sonuç'!A75)","v":""},{"$f":"IF('Arş.Gör. Sonuç'!B75=\"\",\"\",LEFT('Arş.Gör. Sonuç'!B75,3)&REPT(\"*\",4)&RIGHT('Arş.Gör. Sonuç'!B75,2))","v":""},{"$f":"IF('Arş.Gör. Sonuç'!C75=\"\",\"\",IF(ISERR(FIND(\" \",'Arş.Gör. Sonuç'!C75))=TRUE,LEFT('Arş.Gör. Sonuç'!C75,2)&REPT(\"*\",3),LEFT('Arş.Gör. Sonuç'!C75,2)&REPT(\"*\",3)&\" \"&MID('Arş.Gör. Sonuç'!C75,FIND(\" \",'Arş.Gör. Sonuç'!C75)+1,2)&REPT(\"*\",3)))","v":""},{"$f":"IF('Arş.Gör. Sonuç'!D75=\"\",\"\",IF(ISERR(FIND(\" \",'Arş.Gör. Sonuç'!D75))=TRUE,LEFT('Arş.Gör. Sonuç'!D75,2)&REPT(\"*\",3),LEFT('Arş.Gör. Sonuç'!D75,2)&REPT(\"*\",3)&\" \"&MID('Arş.Gör. Sonuç'!D75,FIND(\" \",'Arş.Gör. Sonuç'!D75)+1,2)&REPT(\"*\",3)))","v":""},{"$f":"IF('Arş.Gör. Sonuç'!E75=\"\",\"\",'Arş.Gör. Sonuç'!E75)","v":""},{"$f":"IF('Arş.Gör. Sonuç'!F75=\"\",\"\",'Arş.Gör. Sonuç'!F75)","v":""},{"$f":"IF('Arş.Gör. Sonuç'!G75=\"\",\"\",'Arş.Gör. Sonuç'!G75)","v":""},{"$f":"IF('Arş.Gör. Sonuç'!H75=\"\",\"\",'Arş.Gör. Sonuç'!H75)","v":""},{"$f":"IF('Arş.Gör. Sonuç'!I75=\"\",\"\",'Arş.Gör. Sonuç'!I75)","v":""},{"$f":"IF('Arş.Gör. Sonuç'!J75=\"\",\"\",'Arş.Gör. Sonuç'!J75)","v":""},{"$f":"IF('Arş.Gör. Sonuç'!K75=\"\",\"\",'Arş.Gör. Sonuç'!K75)","v":""},{"$f":"IF('Arş.Gör. Sonuç'!L75=\"\",\"\",'Arş.Gör. Sonuç'!L75)","v":""},{"$f":"IF('Arş.Gör. Sonuç'!M75=\"\",\"\",'Arş.Gör. Sonuç'!M75)","v":""},{"$f":"IF('Arş.Gör. Sonuç'!N75=\"\",\"\",'Arş.Gör. Sonuç'!N75)","v":""}]
[{"$f":"IF('Arş.Gör. Sonuç'!A76=\"\",\"\",'Arş.Gör. Sonuç'!A76)","v":""},{"$f":"IF('Arş.Gör. Sonuç'!B76=\"\",\"\",LEFT('Arş.Gör. Sonuç'!B76,3)&REPT(\"*\",4)&RIGHT('Arş.Gör. Sonuç'!B76,2))","v":""},{"$f":"IF('Arş.Gör. Sonuç'!C76=\"\",\"\",IF(ISERR(FIND(\" \",'Arş.Gör. Sonuç'!C76))=TRUE,LEFT('Arş.Gör. Sonuç'!C76,2)&REPT(\"*\",3),LEFT('Arş.Gör. Sonuç'!C76,2)&REPT(\"*\",3)&\" \"&MID('Arş.Gör. Sonuç'!C76,FIND(\" \",'Arş.Gör. Sonuç'!C76)+1,2)&REPT(\"*\",3)))","v":""},{"$f":"IF('Arş.Gör. Sonuç'!D76=\"\",\"\",IF(ISERR(FIND(\" \",'Arş.Gör. Sonuç'!D76))=TRUE,LEFT('Arş.Gör. Sonuç'!D76,2)&REPT(\"*\",3),LEFT('Arş.Gör. Sonuç'!D76,2)&REPT(\"*\",3)&\" \"&MID('Arş.Gör. Sonuç'!D76,FIND(\" \",'Arş.Gör. Sonuç'!D76)+1,2)&REPT(\"*\",3)))","v":""},{"$f":"IF('Arş.Gör. Sonuç'!E76=\"\",\"\",'Arş.Gör. Sonuç'!E76)","v":""},{"$f":"IF('Arş.Gör. Sonuç'!F76=\"\",\"\",'Arş.Gör. Sonuç'!F76)","v":""},{"$f":"IF('Arş.Gör. Sonuç'!G76=\"\",\"\",'Arş.Gör. Sonuç'!G76)","v":""},{"$f":"IF('Arş.Gör. Sonuç'!H76=\"\",\"\",'Arş.Gör. Sonuç'!H76)","v":""},{"$f":"IF('Arş.Gör. Sonuç'!I76=\"\",\"\",'Arş.Gör. Sonuç'!I76)","v":""},{"$f":"IF('Arş.Gör. Sonuç'!J76=\"\",\"\",'Arş.Gör. Sonuç'!J76)","v":""},{"$f":"IF('Arş.Gör. Sonuç'!K76=\"\",\"\",'Arş.Gör. Sonuç'!K76)","v":""},{"$f":"IF('Arş.Gör. Sonuç'!L76=\"\",\"\",'Arş.Gör. Sonuç'!L76)","v":""},{"$f":"IF('Arş.Gör. Sonuç'!M76=\"\",\"\",'Arş.Gör. Sonuç'!M76)","v":""},{"$f":"IF('Arş.Gör. Sonuç'!N76=\"\",\"\",'Arş.Gör. Sonuç'!N76)","v":""}]
[{"$f":"IF('Arş.Gör. Sonuç'!A77=\"\",\"\",'Arş.Gör. Sonuç'!A77)","v":""},{"$f":"IF('Arş.Gör. Sonuç'!B77=\"\",\"\",LEFT('Arş.Gör. Sonuç'!B77,3)&REPT(\"*\",4)&RIGHT('Arş.Gör. Sonuç'!B77,2))","v":""},{"$f":"IF('Arş.Gör. Sonuç'!C77=\"\",\"\",IF(ISERR(FIND(\" \",'Arş.Gör. Sonuç'!C77))=TRUE,LEFT('Arş.Gör. Sonuç'!C77,2)&REPT(\"*\",3),LEFT('Arş.Gör. Sonuç'!C77,2)&REPT(\"*\",3)&\" \"&MID('Arş.Gör. Sonuç'!C77,FIND(\" \",'Arş.Gör. Sonuç'!C77)+1,2)&REPT(\"*\",3)))","v":""},{"$f":"IF('Arş.Gör. Sonuç'!D77=\"\",\"\",IF(ISERR(FIND(\" \",'Arş.Gör. Sonuç'!D77))=TRUE,LEFT('Arş.Gör. Sonuç'!D77,2)&REPT(\"*\",3),LEFT('Arş.Gör. Sonuç'!D77,2)&REPT(\"*\",3)&\" \"&MID('Arş.Gör. Sonuç'!D77,FIND(\" \",'Arş.Gör. Sonuç'!D77)+1,2)&REPT(\"*\",3)))","v":""},{"$f":"IF('Arş.Gör. Sonuç'!E77=\"\",\"\",'Arş.Gör. Sonuç'!E77)","v":""},{"$f":"IF('Arş.Gör. Sonuç'!F77=\"\",\"\",'Arş.Gör. Sonuç'!F77)","v":""},{"$f":"IF('Arş.Gör. Sonuç'!G77=\"\",\"\",'Arş.Gör. Sonuç'!G77)","v":""},{"$f":"IF('Arş.Gör. Sonuç'!H77=\"\",\"\",'Arş.Gör. Sonuç'!H77)","v":""},{"$f":"IF('Arş.Gör. Sonuç'!I77=\"\",\"\",'Arş.Gör. Sonuç'!I77)","v":""},{"$f":"IF('Arş.Gör. Sonuç'!J77=\"\",\"\",'Arş.Gör. Sonuç'!J77)","v":""},{"$f":"IF('Arş.Gör. Sonuç'!K77=\"\",\"\",'Arş.Gör. Sonuç'!K77)","v":""},{"$f":"IF('Arş.Gör. Sonuç'!L77=\"\",\"\",'Arş.Gör. Sonuç'!L77)","v":""},{"$f":"IF('Arş.Gör. Sonuç'!M77=\"\",\"\",'Arş.Gör. Sonuç'!M77)","v":""},{"$f":"IF('Arş.Gör. Sonuç'!N77=\"\",\"\",'Arş.Gör. Sonuç'!N77)","v":""}]
[{"$f":"IF('Arş.Gör. Sonuç'!A78=\"\",\"\",'Arş.Gör. Sonuç'!A78)","v":""},{"$f":"IF('Arş.Gör. Sonuç'!B78=\"\",\"\",LEFT('Arş.Gör. Sonuç'!B78,3)&REPT(\"*\",4)&RIGHT('Arş.Gör. Sonuç'!B78,2))","v":""},{"$f":"IF('Arş.Gör. Sonuç'!C78=\"\",\"\",IF(ISERR(FIND(\" \",'Arş.Gör. Sonuç'!C78))=TRUE,LEFT('Arş.Gör. Sonuç'!C78,2)&REPT(\"*\",3),LEFT('Arş.Gör. Sonuç'!C78,2)&REPT(\"*\",3)&\" \"&MID('Arş.Gör. Sonuç'!C78,FIND(\" \",'Arş.Gör. Sonuç'!C78)+1,2)&REPT(\"*\",3)))","v":""},{"$f":"IF('Arş.Gör. Sonuç'!D78=\"\",\"\",IF(ISERR(FIND(\" \",'Arş.Gör. Sonuç'!D78))=TRUE,LEFT('Arş.Gör. Sonuç'!D78,2)&REPT(\"*\",3),LEFT('Arş.Gör. Sonuç'!D78,2)&REPT(\"*\",3)&\" \"&MID('Arş.Gör. Sonuç'!D78,FIND(\" \",'Arş.Gör. Sonuç'!D78)+1,2)&REPT(\"*\",3)))","v":""},{"$f":"IF('Arş.Gör. Sonuç'!E78=\"\",\"\",'Arş.Gör. Sonuç'!E78)","v":""},{"$f":"IF('Arş.Gör. Sonuç'!F78=\"\",\"\",'Arş.Gör. Sonuç'!F78)","v":""},{"$f":"IF('Arş.Gör. Sonuç'!G78=\"\",\"\",'Arş.Gör. Sonuç'!G78)","v":""},{"$f":"IF('Arş.Gör. Sonuç'!H78=\"\",\"\",'Arş.Gör. Sonuç'!H78)","v":""},{"$f":"IF('Arş.Gör. Sonuç'!I78=\"\",\"\",'Arş.Gör. Sonuç'!I78)","v":""},{"$f":"IF('Arş.Gör. Sonuç'!J78=\"\",\"\",'Arş.Gör. Sonuç'!J78)","v":""},{"$f":"IF('Arş.Gör. Sonuç'!K78=\"\",\"\",'Arş.Gör. Sonuç'!K78)","v":""},{"$f":"IF('Arş.Gör. Sonuç'!L78=\"\",\"\",'Arş.Gör. Sonuç'!L78)","v":""},{"$f":"IF('Arş.Gör. Sonuç'!M78=\"\",\"\",'Arş.Gör. Sonuç'!M78)","v":""},{"$f":"IF('Arş.Gör. Sonuç'!N78=\"\",\"\",'Arş.Gör. Sonuç'!N78)","v":""}]
[{"$f":"IF('Arş.Gör. Sonuç'!A79=\"\",\"\",'Arş.Gör. Sonuç'!A79)","v":""},{"$f":"IF('Arş.Gör. Sonuç'!B79=\"\",\"\",LEFT('Arş.Gör. Sonuç'!B79,3)&REPT(\"*\",4)&RIGHT('Arş.Gör. Sonuç'!B79,2))","v":""},{"$f":"IF('Arş.Gör. Sonuç'!C79=\"\",\"\",IF(ISERR(FIND(\" \",'Arş.Gör. Sonuç'!C79))=TRUE,LEFT('Arş.Gör. Sonuç'!C79,2)&REPT(\"*\",3),LEFT('Arş.Gör. Sonuç'!C79,2)&REPT(\"*\",3)&\" \"&MID('Arş.Gör. Sonuç'!C79,FIND(\" \",'Arş.Gör. Sonuç'!C79)+1,2)&REPT(\"*\",3)))","v":""},{"$f":"IF('Arş.Gör. Sonuç'!D79=\"\",\"\",IF(ISERR(FIND(\" \",'Arş.Gör. Sonuç'!D79))=TRUE,LEFT('Arş.Gör. Sonuç'!D79,2)&REPT(\"*\",3),LEFT('Arş.Gör. Sonuç'!D79,2)&REPT(\"*\",3)&\" \"&MID('Arş.Gör. Sonuç'!D79,FIND(\" \",'Arş.Gör. Sonuç'!D79)+1,2)&REPT(\"*\",3)))","v":""},{"$f":"IF('Arş.Gör. Sonuç'!E79=\"\",\"\",'Arş.Gör. Sonuç'!E79)","v":""},{"$f":"IF('Arş.Gör. Sonuç'!F79=\"\",\"\",'Arş.Gör. Sonuç'!F79)","v":""},{"$f":"IF('Arş.Gör. Sonuç'!G79=\"\",\"\",'Arş.Gör. Sonuç'!G79)","v":""},{"$f":"IF('Arş.Gör. Sonuç'!H79=\"\",\"\",'Arş.Gör. Sonuç'!H79)","v":""},{"$f":"IF('Arş.Gör. Sonuç'!I79=\"\",\"\",'Arş.Gör. Sonuç'!I79)","v":""},{"$f":"IF('Arş.Gör. Sonuç'!J79=\"\",\"\",'Arş.Gör. Sonuç'!J79)","v":""},{"$f":"IF('Arş.Gör. Sonuç'!K79=\"\",\"\",'Arş.Gör. Sonuç'!K79)","v":""},{"$f":"IF('Arş.Gör. Sonuç'!L79=\"\",\"\",'Arş.Gör. Sonuç'!L79)","v":""},{"$f":"IF('Arş.Gör. Sonuç'!M79=\"\",\"\",'Arş.Gör. Sonuç'!M79)","v":""},{"$f":"IF('Arş.Gör. Sonuç'!N79=\"\",\"\",'Arş.Gör. Sonuç'!N79)","v":""}]
[{"$f":"IF('Arş.Gör. Sonuç'!A80=\"\",\"\",'Arş.Gör. Sonuç'!A80)","v":""},{"$f":"IF('Arş.Gör. Sonuç'!B80=\"\",\"\",LEFT('Arş.Gör. Sonuç'!B80,3)&REPT(\"*\",4)&RIGHT('Arş.Gör. Sonuç'!B80,2))","v":""},{"$f":"IF('Arş.Gör. Sonuç'!C80=\"\",\"\",IF(ISERR(FIND(\" \",'Arş.Gör. Sonuç'!C80))=TRUE,LEFT('Arş.Gör. Sonuç'!C80,2)&REPT(\"*\",3),LEFT('Arş.Gör. Sonuç'!C80,2)&REPT(\"*\",3)&\" \"&MID('Arş.Gör. Sonuç'!C80,FIND(\" \",'Arş.Gör. Sonuç'!C80)+1,2)&REPT(\"*\",3)))","v":""},{"$f":"IF('Arş.Gör. Sonuç'!D80=\"\",\"\",IF(ISERR(FIND(\" \",'Arş.Gör. Sonuç'!D80))=TRUE,LEFT('Arş.Gör. Sonuç'!D80,2)&REPT(\"*\",3),LEFT('Arş.Gör. Sonuç'!D80,2)&REPT(\"*\",3)&\" \"&MID('Arş.Gör. Sonuç'!D80,FIND(\" \",'Arş.Gör. Sonuç'!D80)+1,2)&REPT(\"*\",3)))","v":""},{"$f":"IF('Arş.Gör. Sonuç'!E80=\"\",\"\",'Arş.Gör. Sonuç'!E80)","v":""},{"$f":"IF('Arş.Gör. Sonuç'!F80=\"\",\"\",'Arş.Gör. Sonuç'!F80)","v":""},{"$f":"IF('Arş.Gör. Sonuç'!G80=\"\",\"\",'Arş.Gör. Sonuç'!G80)","v":""},{"$f":"IF('Arş.Gör. Sonuç'!H80=\"\",\"\",'Arş.Gör. Sonuç'!H80)","v":""},{"$f":"IF('Arş.Gör. Sonuç'!I80=\"\",\"\",'Arş.Gör. Sonuç'!I80)","v":""},{"$f":"IF('Arş.Gör. Sonuç'!J80=\"\",\"\",'Arş.Gör. Sonuç'!J80)","v":""},{"$f":"IF('Arş.Gör. Sonuç'!K80=\"\",\"\",'Arş.Gör. Sonuç'!K80)","v":""},{"$f":"IF('Arş.Gör. Sonuç'!L80=\"\",\"\",'Arş.Gör. Sonuç'!L80)","v":""},{"$f":"IF('Arş.Gör. Sonuç'!M80=\"\",\"\",'Arş.Gör. Sonuç'!M80)","v":""},{"$f":"IF('Arş.Gör. Sonuç'!N80=\"\",\"\",'Arş.Gör. Sonuç'!N80)","v":""}]
[{"$f":"IF('Arş.Gör. Sonuç'!A81=\"\",\"\",'Arş.Gör. Sonuç'!A81)","v":""},{"$f":"IF('Arş.Gör. Sonuç'!B81=\"\",\"\",LEFT('Arş.Gör. Sonuç'!B81,3)&REPT(\"*\",4)&RIGHT('Arş.Gör. Sonuç'!B81,2))","v":""},{"$f":"IF('Arş.Gör. Sonuç'!C81=\"\",\"\",IF(ISERR(FIND(\" \",'Arş.Gör. Sonuç'!C81))=TRUE,LEFT('Arş.Gör. Sonuç'!C81,2)&REPT(\"*\",3),LEFT('Arş.Gör. Sonuç'!C81,2)&REPT(\"*\",3)&\" \"&MID('Arş.Gör. Sonuç'!C81,FIND(\" \",'Arş.Gör. Sonuç'!C81)+1,2)&REPT(\"*\",3)))","v":""},{"$f":"IF('Arş.Gör. Sonuç'!D81=\"\",\"\",IF(ISERR(FIND(\" \",'Arş.Gör. Sonuç'!D81))=TRUE,LEFT('Arş.Gör. Sonuç'!D81,2)&REPT(\"*\",3),LEFT('Arş.Gör. Sonuç'!D81,2)&REPT(\"*\",3)&\" \"&MID('Arş.Gör. Sonuç'!D81,FIND(\" \",'Arş.Gör. Sonuç'!D81)+1,2)&REPT(\"*\",3)))","v":""},{"$f":"IF('Arş.Gör. Sonuç'!E81=\"\",\"\",'Arş.Gör. Sonuç'!E81)","v":""},{"$f":"IF('Arş.Gör. Sonuç'!F81=\"\",\"\",'Arş.Gör. Sonuç'!F81)","v":""},{"$f":"IF('Arş.Gör. Sonuç'!G81=\"\",\"\",'Arş.Gör. Sonuç'!G81)","v":""},{"$f":"IF('Arş.Gör. Sonuç'!H81=\"\",\"\",'Arş.Gör. Sonuç'!H81)","v":""},{"$f":"IF('Arş.Gör. Sonuç'!I81=\"\",\"\",'Arş.Gör. Sonuç'!I81)","v":""},{"$f":"IF('Arş.Gör. Sonuç'!J81=\"\",\"\",'Arş.Gör. Sonuç'!J81)","v":""},{"$f":"IF('Arş.Gör. Sonuç'!K81=\"\",\"\",'Arş.Gör. Sonuç'!K81)","v":""},{"$f":"IF('Arş.Gör. Sonuç'!L81=\"\",\"\",'Arş.Gör. Sonuç'!L81)","v":""},{"$f":"IF('Arş.Gör. Sonuç'!M81=\"\",\"\",'Arş.Gör. Sonuç'!M81)","v":""},{"$f":"IF('Arş.Gör. Sonuç'!N81=\"\",\"\",'Arş.Gör. Sonuç'!N81)","v":""}]
[{"$f":"IF('Arş.Gör. Sonuç'!A82=\"\",\"\",'Arş.Gör. Sonuç'!A82)","v":""},{"$f":"IF('Arş.Gör. Sonuç'!B82=\"\",\"\",LEFT('Arş.Gör. Sonuç'!B82,3)&REPT(\"*\",4)&RIGHT('Arş.Gör. Sonuç'!B82,2))","v":""},{"$f":"IF('Arş.Gör. Sonuç'!C82=\"\",\"\",IF(ISERR(FIND(\" \",'Arş.Gör. Sonuç'!C82))=TRUE,LEFT('Arş.Gör. Sonuç'!C82,2)&REPT(\"*\",3),LEFT('Arş.Gör. Sonuç'!C82,2)&REPT(\"*\",3)&\" \"&MID('Arş.Gör. Sonuç'!C82,FIND(\" \",'Arş.Gör. Sonuç'!C82)+1,2)&REPT(\"*\",3)))","v":""},{"$f":"IF('Arş.Gör. Sonuç'!D82=\"\",\"\",IF(ISERR(FIND(\" \",'Arş.Gör. Sonuç'!D82))=TRUE,LEFT('Arş.Gör. Sonuç'!D82,2)&REPT(\"*\",3),LEFT('Arş.Gör. Sonuç'!D82,2)&REPT(\"*\",3)&\" \"&MID('Arş.Gör. Sonuç'!D82,FIND(\" \",'Arş.Gör. Sonuç'!D82)+1,2)&REPT(\"*\",3)))","v":""},{"$f":"IF('Arş.Gör. Sonuç'!E82=\"\",\"\",'Arş.Gör. Sonuç'!E82)","v":""},{"$f":"IF('Arş.Gör. Sonuç'!F82=\"\",\"\",'Arş.Gör. Sonuç'!F82)","v":""},{"$f":"IF('Arş.Gör. Sonuç'!G82=\"\",\"\",'Arş.Gör. Sonuç'!G82)","v":""},{"$f":"IF('Arş.Gör. Sonuç'!H82=\"\",\"\",'Arş.Gör. Sonuç'!H82)","v":""},{"$f":"IF('Arş.Gör. Sonuç'!I82=\"\",\"\",'Arş.Gör. Sonuç'!I82)","v":""},{"$f":"IF('Arş.Gör. Sonuç'!J82=\"\",\"\",'Arş.Gör. Sonuç'!J82)","v":""},{"$f":"IF('Arş.Gör. Sonuç'!K82=\"\",\"\",'Arş.Gör. Sonuç'!K82)","v":""},{"$f":"IF('Arş.Gör. Sonuç'!L82=\"\",\"\",'Arş.Gör. Sonuç'!L82)","v":""},{"$f":"IF('Arş.Gör. Sonuç'!M82=\"\",\"\",'Arş.Gör. Sonuç'!M82)","v":""},{"$f":"IF('Arş.Gör. Sonuç'!N82=\"\",\"\",'Arş.Gör. Sonuç'!N82)","v":""}]
[{"$f":"IF('Arş.Gör. Sonuç'!A83=\"\",\"\",'Arş.Gör. Sonuç'!A83)","v":""},{"$f":"IF('Arş.Gör. Sonuç'!B83=\"\",\"\",LEFT('Arş.Gör. Sonuç'!B83,3)&REPT(\"*\",4)&RIGHT('Arş.Gör. Sonuç'!B83,2))","v":""},{"$f":"IF('Arş.Gör. Sonuç'!C83=\"\",\"\",IF(ISERR(FIND(\" \",'Arş.Gör. Sonuç'!C83))=TRUE,LEFT('Arş.Gör. Sonuç'!C83,2)&REPT(\"*\",3),LEFT('Arş.Gör. Sonuç'!C83,2)&REPT(\"*\",3)&\" \"&MID('Arş.Gör. Sonuç'!C83,FIND(\" \",'Arş.Gör. Sonuç'!C83)+1,2)&REPT(\"*\",3)))","v":""},{"$f":"IF('Arş.Gör. Sonuç'!D83=\"\",\"\",IF(ISERR(FIND(\" \",'Arş.Gör. Sonuç'!D83))=TRUE,LEFT('Arş.Gör. Sonuç'!D83,2)&REPT(\"*\",3),LEFT('Arş.Gör. Sonuç'!D83,2)&REPT(\"*\",3)&\" \"&MID('Arş.Gör. Sonuç'!D83,FIND(\" \",'Arş.Gör. Sonuç'!D83)+1,2)&REPT(\"*\",3)))","v":""},{"$f":"IF('Arş.Gör. Sonuç'!E83=\"\",\"\",'Arş.Gör. Sonuç'!E83)","v":""},{"$f":"IF('Arş.Gör. Sonuç'!F83=\"\",\"\",'Arş.Gör. Sonuç'!F83)","v":""},{"$f":"IF('Arş.Gör. Sonuç'!G83=\"\",\"\",'Arş.Gör. Sonuç'!G83)","v":""},{"$f":"IF('Arş.Gör. Sonuç'!H83=\"\",\"\",'Arş.Gör. Sonuç'!H83)","v":""},{"$f":"IF('Arş.Gör. Sonuç'!I83=\"\",\"\",'Arş.Gör. Sonuç'!I83)","v":""},{"$f":"IF('Arş.Gör. Sonuç'!J83=\"\",\"\",'Arş.Gör. Sonuç'!J83)","v":""},{"$f":"IF('Arş.Gör. Sonuç'!K83=\"\",\"\",'Arş.Gör. Sonuç'!K83)","v":""},{"$f":"IF('Arş.Gör. Sonuç'!L83=\"\",\"\",'Arş.Gör. Sonuç'!L83)","v":""},{"$f":"IF('Arş.Gör. Sonuç'!M83=\"\",\"\",'Arş.Gör. Sonuç'!M83)","v":""},{"$f":"IF('Arş.Gör. Sonuç'!N83=\"\",\"\",'Arş.Gör. Sonuç'!N83)","v":""}]
[{"$f":"IF('Arş.Gör. Sonuç'!A84=\"\",\"\",'Arş.Gör. Sonuç'!A84)","v":""},{"$f":"IF('Arş.Gör. Sonuç'!B84=\"\",\"\",LEFT('Arş.Gör. Sonuç'!B84,3)&REPT(\"*\",4)&RIGHT('Arş.Gör. Sonuç'!B84,2))","v":""},{"$f":"IF('Arş.Gör. Sonuç'!C84=\"\",\"\",IF(ISERR(FIND(\" \",'Arş.Gör. Sonuç'!C84))=TRUE,LEFT('Arş.Gör. Sonuç'!C84,2)&REPT(\"*\",3),LEFT('Arş.Gör. Sonuç'!C84,2)&REPT(\"*\",3)&\" \"&MID('Arş.Gör. Sonuç'!C84,FIND(\" \",'Arş.Gör. Sonuç'!C84)+1,2)&REPT(\"*\",3)))","v":""},{"$f":"IF('Arş.Gör. Sonuç'!D84=\"\",\"\",IF(ISERR(FIND(\" \",'Arş.Gör. Sonuç'!D84))=TRUE,LEFT('Arş.Gör. Sonuç'!D84,2)&REPT(\"*\",3),LEFT('Arş.Gör. Sonuç'!D84,2)&REPT(\"*\",3)&\" \"&MID('Arş.Gör. Sonuç'!D84,FIND(\" \",'Arş.Gör. Sonuç'!D84)+1,2)&REPT(\"*\",3)))","v":""},{"$f":"IF('Arş.Gör. Sonuç'!E84=\"\",\"\",'Arş.Gör. Sonuç'!E84)","v":""},{"$f":"IF('Arş.Gör. Sonuç'!F84=\"\",\"\",'Arş.Gör. Sonuç'!F84)","v":""},{"$f":"IF('Arş.Gör. Sonuç'!G84=\"\",\"\",'Arş.Gör. Sonuç'!G84)","v":""},{"$f":"IF('Arş.Gör. Sonuç'!H84=\"\",\"\",'Arş.Gör. Sonuç'!H84)","v":""},{"$f":"IF('Arş.Gör. Sonuç'!I84=\"\",\"\",'Arş.Gör. Sonuç'!I84)","v":""},{"$f":"IF('Arş.Gör. Sonuç'!J84=\"\",\"\",'Arş.Gör. Sonuç'!J84)","v":""},{"$f":"IF('Arş.Gör. Sonuç'!K84=\"\",\"\",'Arş.Gör. Sonuç'!K84)","v":""},{"$f":"IF('Arş.Gör. Sonuç'!L84=\"\",\"\",'Arş.Gör. Sonuç'!L84)","v":""},{"$f":"IF('Arş.Gör. Sonuç'!M84=\"\",\"\",'Arş.Gör. Sonuç'!M84)","v":""},{"$f":"IF('Arş.Gör. Sonuç'!N84=\"\",\"\",'Arş.Gör. Sonuç'!N84)","v":""}]
[{"$f":"IF('Arş.Gör. Sonuç'!A85=\"\",\"\",'Arş.Gör. Sonuç'!A85)","v":""},{"$f":"IF('Arş.Gör. Sonuç'!B85=\"\",\"\",LEFT('Arş.Gör. Sonuç'!B85,3)&REPT(\"*\",4)&RIGHT('Arş.Gör. Sonuç'!B85,2))","v":""},{"$f":"IF('Arş.Gör. Sonuç'!C85=\"\",\"\",IF(ISERR(FIND(\" \",'Arş.Gör. Sonuç'!C85))=TRUE,LEFT('Arş.Gör. Sonuç'!C85,2)&REPT(\"*\",3),LEFT('Arş.Gör. Sonuç'!C85,2)&REPT(\"*\",3)&\" \"&MID('Arş.Gör. Sonuç'!C85,FIND(\" \",'Arş.Gör. Sonuç'!C85)+1,2)&REPT(\"*\",3)))","v":""},{"$f":"IF('Arş.Gör. Sonuç'!D85=\"\",\"\",IF(ISERR(FIND(\" \",'Arş.Gör. Sonuç'!D85))=TRUE,LEFT('Arş.Gör. Sonuç'!D85,2)&REPT(\"*\",3),LEFT('Arş.Gör. Sonuç'!D85,2)&REPT(\"*\",3)&\" \"&MID('Arş.Gör. Sonuç'!D85,FIND(\" \",'Arş.Gör. Sonuç'!D85)+1,2)&REPT(\"*\",3)))","v":""},{"$f":"IF('Arş.Gör. Sonuç'!E85=\"\",\"\",'Arş.Gör. Sonuç'!E85)","v":""},{"$f":"IF('Arş.Gör. Sonuç'!F85=\"\",\"\",'Arş.Gör. Sonuç'!F85)","v":""},{"$f":"IF('Arş.Gör. Sonuç'!G85=\"\",\"\",'Arş.Gör. Sonuç'!G85)","v":""},{"$f":"IF('Arş.Gör. Sonuç'!H85=\"\",\"\",'Arş.Gör. Sonuç'!H85)","v":""},{"$f":"IF('Arş.Gör. Sonuç'!I85=\"\",\"\",'Arş.Gör. Sonuç'!I85)","v":""},{"$f":"IF('Arş.Gör. Sonuç'!J85=\"\",\"\",'Arş.Gör. Sonuç'!J85)","v":""},{"$f":"IF('Arş.Gör. Sonuç'!K85=\"\",\"\",'Arş.Gör. Sonuç'!K85)","v":""},{"$f":"IF('Arş.Gör. Sonuç'!L85=\"\",\"\",'Arş.Gör. Sonuç'!L85)","v":""},{"$f":"IF('Arş.Gör. Sonuç'!M85=\"\",\"\",'Arş.Gör. Sonuç'!M85)","v":""},{"$f":"IF('Arş.Gör. Sonuç'!N85=\"\",\"\",'Arş.Gör. Sonuç'!N85)","v":""}]
[{"$f":"IF('Arş.Gör. Sonuç'!A86=\"\",\"\",'Arş.Gör. Sonuç'!A86)","v":""},{"$f":"IF('Arş.Gör. Sonuç'!B86=\"\",\"\",LEFT('Arş.Gör. Sonuç'!B86,3)&REPT(\"*\",4)&RIGHT('Arş.Gör. Sonuç'!B86,2))","v":""},{"$f":"IF('Arş.Gör. Sonuç'!C86=\"\",\"\",IF(ISERR(FIND(\" \",'Arş.Gör. Sonuç'!C86))=TRUE,LEFT('Arş.Gör. Sonuç'!C86,2)&REPT(\"*\",3),LEFT('Arş.Gör. Sonuç'!C86,2)&REPT(\"*\",3)&\" \"&MID('Arş.Gör. Sonuç'!C86,FIND(\" \",'Arş.Gör. Sonuç'!C86)+1,2)&REPT(\"*\",3)))","v":""},{"$f":"IF('Arş.Gör. Sonuç'!D86=\"\",\"\",IF(ISERR(FIND(\" \",'Arş.Gör. Sonuç'!D86))=TRUE,LEFT('Arş.Gör. Sonuç'!D86,2)&REPT(\"*\",3),LEFT('Arş.Gör. Sonuç'!D86,2)&REPT(\"*\",3)&\" \"&MID('Arş.Gör. Sonuç'!D86,FIND(\" \",'Arş.Gör. Sonuç'!D86)+1,2)&REPT(\"*\",3)))","v":""},{"$f":"IF('Arş.Gör. Sonuç'!E86=\"\",\"\",'Arş.Gör. Sonuç'!E86)","v":""},{"$f":"IF('Arş.Gör. Sonuç'!F86=\"\",\"\",'Arş.Gör. Sonuç'!F86)","v":""},{"$f":"IF('Arş.Gör. Sonuç'!G86=\"\",\"\",'Arş.Gör. Sonuç'!G86)","v":""},{"$f":"IF('Arş.Gör. Sonuç'!H86=\"\",\"\",'Arş.Gör. Sonuç'!H86)","v":""},{"$f":"IF('Arş.Gör. Sonuç'!I86=\"\",\"\",'Arş.Gör. Sonuç'!I86)","v":""},{"$f":"IF('Arş.Gör. Sonuç'!J86=\"\",\"\",'Arş.Gör. Sonuç'!J86)","v":""},{"$f":"IF('Arş.Gör. Sonuç'!K86=\"\",\"\",'Arş.Gör. Sonuç'!K86)","v":""},{"$f":"IF('Arş.Gör. Sonuç'!L86=\"\",\"\",'Arş.Gör. Sonuç'!L86)","v":""},{"$f":"IF('Arş.Gör. Sonuç'!M86=\"\",\"\",'Arş.Gör. Sonuç'!M86)","v":""},{"$f":"IF('Arş.Gör. Sonuç'!N86=\"\",\"\",'Arş.Gör. Sonuç'!N86)","v":""}]
[{"$f":"IF('Arş.Gör. Sonuç'!A87=\"\",\"\",'Arş.Gör. Sonuç'!A87)","v":""},{"$f":"IF('Arş.Gör. Sonuç'!B87=\"\",\"\",LEFT('Arş.Gör. Sonuç'!B87,3)&REPT(\"*\",4)&RIGHT('Arş.Gör. Sonuç'!B87,2))","v":""},{"$f":"IF('Arş.Gör. Sonuç'!C87=\"\",\"\",IF(ISERR(FIND(\" \",'Arş.Gör. Sonuç'!C87))=TRUE,LEFT('Arş.Gör. Sonuç'!C87,2)&REPT(\"*\",3),LEFT('Arş.Gör. Sonuç'!C87,2)&REPT(\"*\",3)&\" \"&MID('Arş.Gör. Sonuç'!C87,FIND(\" \",'Arş.Gör. Sonuç'!C87)+1,2)&REPT(\"*\",3)))","v":""},{"$f":"IF('Arş.Gör. Sonuç'!D87=\"\",\"\",IF(ISERR(FIND(\" \",'Arş.Gör. Sonuç'!D87))=TRUE,LEFT('Arş.Gör. Sonuç'!D87,2)&REPT(\"*\",3),LEFT('Arş.Gör. Sonuç'!D87,2)&REPT(\"*\",3)&\" \"&MID('Arş.Gör. Sonuç'!D87,FIND(\" \",'Arş.Gör. Sonuç'!D87)+1,2)&REPT(\"*\",3)))","v":""},{"$f":"IF('Arş.Gör. Sonuç'!E87=\"\",\"\",'Arş.Gör. Sonuç'!E87)","v":""},{"$f":"IF('Arş.Gör. Sonuç'!F87=\"\",\"\",'Arş.Gör. Sonuç'!F87)","v":""},{"$f":"IF('Arş.Gör. Sonuç'!G87=\"\",\"\",'Arş.Gör. Sonuç'!G87)","v":""},{"$f":"IF('Arş.Gör. Sonuç'!H87=\"\",\"\",'Arş.Gör. Sonuç'!H87)","v":""},{"$f":"IF('Arş.Gör. Sonuç'!I87=\"\",\"\",'Arş.Gör. Sonuç'!I87)","v":""},{"$f":"IF('Arş.Gör. Sonuç'!J87=\"\",\"\",'Arş.Gör. Sonuç'!J87)","v":""},{"$f":"IF('Arş.Gör. Sonuç'!K87=\"\",\"\",'Arş.Gör. Sonuç'!K87)","v":""},{"$f":"IF('Arş.Gör. Sonuç'!L87=\"\",\"\",'Arş.Gör. Sonuç'!L87)","v":""},{"$f":"IF('Arş.Gör. Sonuç'!M87=\"\",\"\",'Arş.Gör. Sonuç'!M87)","v":""},{"$f":"IF('Arş.Gör. Sonuç'!N87=\"\",\"\",'Arş.Gör. Sonuç'!N87)","v":""}]
[{"$f":"IF('Arş.Gör. Sonuç'!A88=\"\",\"\",'Arş.Gör. Sonuç'!A88)","v":""},{"$f":"IF('Arş.Gör. Sonuç'!B88=\"\",\"\",LEFT('Arş.Gör. Sonuç'!B88,3)&REPT(\"*\",4)&RIGHT('Arş.Gör. Sonuç'!B88,2))","v":""},{"$f":"IF('Arş.Gör. Sonuç'!C88=\"\",\"\",IF(ISERR(FIND(\" \",'Arş.Gör. Sonuç'!C88))=TRUE,LEFT('Arş.Gör. Sonuç'!C88,2)&REPT(\"*\",3),LEFT('Arş.Gör. Sonuç'!C88,2)&REPT(\"*\",3)&\" \"&MID('Arş.Gör. Sonuç'!C88,FIND(\" \",'Arş.Gör. Sonuç'!C88)+1,2)&REPT(\"*\",3)))","v":""},{"$f":"IF('Arş.Gör. Sonuç'!D88=\"\",\"\",IF(ISERR(FIND(\" \",'Arş.Gör. Sonuç'!D88))=TRUE,LEFT('Arş.Gör. Sonuç'!D88,2)&REPT(\"*\",3),LEFT('Arş.Gör. Sonuç'!D88,2)&REPT(\"*\",3)&\" \"&MID('Arş.Gör. Sonuç'!D88,FIND(\" \",'Arş.Gör. Sonuç'!D88)+1,2)&REPT(\"*\",3)))","v":""},{"$f":"IF('Arş.Gör. Sonuç'!E88=\"\",\"\",'Arş.Gör. Sonuç'!E88)","v":""},{"$f":"IF('Arş.Gör. Sonuç'!F88=\"\",\"\",'Arş.Gör. Sonuç'!F88)","v":""},{"$f":"IF('Arş.Gör. Sonuç'!G88=\"\",\"\",'Arş.Gör. Sonuç'!G88)","v":""},{"$f":"IF('Arş.Gör. Sonuç'!H88=\"\",\"\",'Arş.Gör. Sonuç'!H88)","v":""},{"$f":"IF('Arş.Gör. Sonuç'!I88=\"\",\"\",'Arş.Gör. Sonuç'!I88)","v":""},{"$f":"IF('Arş.Gör. Sonuç'!J88=\"\",\"\",'Arş.Gör. Sonuç'!J88)","v":""},{"$f":"IF('Arş.Gör. Sonuç'!K88=\"\",\"\",'Arş.Gör. Sonuç'!K88)","v":""},{"$f":"IF('Arş.Gör. Sonuç'!L88=\"\",\"\",'Arş.Gör. Sonuç'!L88)","v":""},{"$f":"IF('Arş.Gör. Sonuç'!M88=\"\",\"\",'Arş.Gör. Sonuç'!M88)","v":""},{"$f":"IF('Arş.Gör. Sonuç'!N88=\"\",\"\",'Arş.Gör. Sonuç'!N88)","v":""}]
[{"$f":"IF('Arş.Gör. Sonuç'!A89=\"\",\"\",'Arş.Gör. Sonuç'!A89)","v":""},{"$f":"IF('Arş.Gör. Sonuç'!B89=\"\",\"\",LEFT('Arş.Gör. Sonuç'!B89,3)&REPT(\"*\",4)&RIGHT('Arş.Gör. Sonuç'!B89,2))","v":""},{"$f":"IF('Arş.Gör. Sonuç'!C89=\"\",\"\",IF(ISERR(FIND(\" \",'Arş.Gör. Sonuç'!C89))=TRUE,LEFT('Arş.Gör. Sonuç'!C89,2)&REPT(\"*\",3),LEFT('Arş.Gör. Sonuç'!C89,2)&REPT(\"*\",3)&\" \"&MID('Arş.Gör. Sonuç'!C89,FIND(\" \",'Arş.Gör. Sonuç'!C89)+1,2)&REPT(\"*\",3)))","v":""},{"$f":"IF('Arş.Gör. Sonuç'!D89=\"\",\"\",IF(ISERR(FIND(\" \",'Arş.Gör. Sonuç'!D89))=TRUE,LEFT('Arş.Gör. Sonuç'!D89,2)&REPT(\"*\",3),LEFT('Arş.Gör. Sonuç'!D89,2)&REPT(\"*\",3)&\" \"&MID('Arş.Gör. Sonuç'!D89,FIND(\" \",'Arş.Gör. Sonuç'!D89)+1,2)&REPT(\"*\",3)))","v":""},{"$f":"IF('Arş.Gör. Sonuç'!E89=\"\",\"\",'Arş.Gör. Sonuç'!E89)","v":""},{"$f":"IF('Arş.Gör. Sonuç'!F89=\"\",\"\",'Arş.Gör. Sonuç'!F89)","v":""},{"$f":"IF('Arş.Gör. Sonuç'!G89=\"\",\"\",'Arş.Gör. Sonuç'!G89)","v":""},{"$f":"IF('Arş.Gör. Sonuç'!H89=\"\",\"\",'Arş.Gör. Sonuç'!H89)","v":""},{"$f":"IF('Arş.Gör. Sonuç'!I89=\"\",\"\",'Arş.Gör. Sonuç'!I89)","v":""},{"$f":"IF('Arş.Gör. Sonuç'!J89=\"\",\"\",'Arş.Gör. Sonuç'!J89)","v":""},{"$f":"IF('Arş.Gör. Sonuç'!K89=\"\",\"\",'Arş.Gör. Sonuç'!K89)","v":""},{"$f":"IF('Arş.Gör. Sonuç'!L89=\"\",\"\",'Arş.Gör. Sonuç'!L89)","v":""},{"$f":"IF('Arş.Gör. Sonuç'!M89=\"\",\"\",'Arş.Gör. Sonuç'!M89)","v":""},{"$f":"IF('Arş.Gör. Sonuç'!N89=\"\",\"\",'Arş.Gör. Sonuç'!N89)","v":""}]
[{"$f":"IF('Arş.Gör. Sonuç'!A90=\"\",\"\",'Arş.Gör. Sonuç'!A90)","v":""},{"$f":"IF('Arş.Gör. Sonuç'!B90=\"\",\"\",LEFT('Arş.Gör. Sonuç'!B90,3)&REPT(\"*\",4)&RIGHT('Arş.Gör. Sonuç'!B90,2))","v":""},{"$f":"IF('Arş.Gör. Sonuç'!C90=\"\",\"\",IF(ISERR(FIND(\" \",'Arş.Gör. Sonuç'!C90))=TRUE,LEFT('Arş.Gör. Sonuç'!C90,2)&REPT(\"*\",3),LEFT('Arş.Gör. Sonuç'!C90,2)&REPT(\"*\",3)&\" \"&MID('Arş.Gör. Sonuç'!C90,FIND(\" \",'Arş.Gör. Sonuç'!C90)+1,2)&REPT(\"*\",3)))","v":""},{"$f":"IF('Arş.Gör. Sonuç'!D90=\"\",\"\",IF(ISERR(FIND(\" \",'Arş.Gör. Sonuç'!D90))=TRUE,LEFT('Arş.Gör. Sonuç'!D90,2)&REPT(\"*\",3),LEFT('Arş.Gör. Sonuç'!D90,2)&REPT(\"*\",3)&\" \"&MID('Arş.Gör. Sonuç'!D90,FIND(\" \",'Arş.Gör. Sonuç'!D90)+1,2)&REPT(\"*\",3)))","v":""},{"$f":"IF('Arş.Gör. Sonuç'!E90=\"\",\"\",'Arş.Gör. Sonuç'!E90)","v":""},{"$f":"IF('Arş.Gör. Sonuç'!F90=\"\",\"\",'Arş.Gör. Sonuç'!F90)","v":""},{"$f":"IF('Arş.Gör. Sonuç'!G90=\"\",\"\",'Arş.Gör. Sonuç'!G90)","v":""},{"$f":"IF('Arş.Gör. Sonuç'!H90=\"\",\"\",'Arş.Gör. Sonuç'!H90)","v":""},{"$f":"IF('Arş.Gör. Sonuç'!I90=\"\",\"\",'Arş.Gör. Sonuç'!I90)","v":""},{"$f":"IF('Arş.Gör. Sonuç'!J90=\"\",\"\",'Arş.Gör. Sonuç'!J90)","v":""},{"$f":"IF('Arş.Gör. Sonuç'!K90=\"\",\"\",'Arş.Gör. Sonuç'!K90)","v":""},{"$f":"IF('Arş.Gör. Sonuç'!L90=\"\",\"\",'Arş.Gör. Sonuç'!L90)","v":""},{"$f":"IF('Arş.Gör. Sonuç'!M90=\"\",\"\",'Arş.Gör. Sonuç'!M90)","v":""},{"$f":"IF('Arş.Gör. Sonuç'!N90=\"\",\"\",'Arş.Gör. Sonuç'!N90)","v":""}]
[{"$f":"IF('Arş.Gör. Sonuç'!A91=\"\",\"\",'Arş.Gör. Sonuç'!A91)","v":""},{"$f":"IF('Arş.Gör. Sonuç'!B91=\"\",\"\",LEFT('Arş.Gör. Sonuç'!B91,3)&REPT(\"*\",4)&RIGHT('Arş.Gör. Sonuç'!B91,2))","v":""},{"$f":"IF('Arş.Gör. Sonuç'!C91=\"\",\"\",IF(ISERR(FIND(\" \",'Arş.Gör. Sonuç'!C91))=TRUE,LEFT('Arş.Gör. Sonuç'!C91,2)&REPT(\"*\",3),LEFT('Arş.Gör. Sonuç'!C91,2)&REPT(\"*\",3)&\" \"&MID('Arş.Gör. Sonuç'!C91,FIND(\" \",'Arş.Gör. Sonuç'!C91)+1,2)&REPT(\"*\",3)))","v":""},{"$f":"IF('Arş.Gör. Sonuç'!D91=\"\",\"\",IF(ISERR(FIND(\" \",'Arş.Gör. Sonuç'!D91))=TRUE,LEFT('Arş.Gör. Sonuç'!D91,2)&REPT(\"*\",3),LEFT('Arş.Gör. Sonuç'!D91,2)&REPT(\"*\",3)&\" \"&MID('Arş.Gör. Sonuç'!D91,FIND(\" \",'Arş.Gör. Sonuç'!D91)+1,2)&REPT(\"*\",3)))","v":""},{"$f":"IF('Arş.Gör. Sonuç'!E91=\"\",\"\",'Arş.Gör. Sonuç'!E91)","v":""},{"$f":"IF('Arş.Gör. Sonuç'!F91=\"\",\"\",'Arş.Gör. Sonuç'!F91)","v":""},{"$f":"IF('Arş.Gör. Sonuç'!G91=\"\",\"\",'Arş.Gör. Sonuç'!G91)","v":""},{"$f":"IF('Arş.Gör. Sonuç'!H91=\"\",\"\",'Arş.Gör. Sonuç'!H91)","v":""},{"$f":"IF('Arş.Gör. Sonuç'!I91=\"\",\"\",'Arş.Gör. Sonuç'!I91)","v":""},{"$f":"IF('Arş.Gör. Sonuç'!J91=\"\",\"\",'Arş.Gör. Sonuç'!J91)","v":""},{"$f":"IF('Arş.Gör. Sonuç'!K91=\"\",\"\",'Arş.Gör. Sonuç'!K91)","v":""},{"$f":"IF('Arş.Gör. Sonuç'!L91=\"\",\"\",'Arş.Gör. Sonuç'!L91)","v":""},{"$f":"IF('Arş.Gör. Sonuç'!M91=\"\",\"\",'Arş.Gör. Sonuç'!M91)","v":""},{"$f":"IF('Arş.Gör. Sonuç'!N91=\"\",\"\",'Arş.Gör. Sonuç'!N91)","v":""}]
[{"$f":"IF('Arş.Gör. Sonuç'!A92=\"\",\"\",'Arş.Gör. Sonuç'!A92)","v":""},{"$f":"IF('Arş.Gör. Sonuç'!B92=\"\",\"\",LEFT('Arş.Gör. Sonuç'!B92,3)&REPT(\"*\",4)&RIGHT('Arş.Gör. Sonuç'!B92,2))","v":""},{"$f":"IF('Arş.Gör. Sonuç'!C92=\"\",\"\",IF(ISERR(FIND(\" \",'Arş.Gör. Sonuç'!C92))=TRUE,LEFT('Arş.Gör. Sonuç'!C92,2)&REPT(\"*\",3),LEFT('Arş.Gör. Sonuç'!C92,2)&REPT(\"*\",3)&\" \"&MID('Arş.Gör. Sonuç'!C92,FIND(\" \",'Arş.Gör. Sonuç'!C92)+1,2)&REPT(\"*\",3)))","v":""},{"$f":"IF('Arş.Gör. Sonuç'!D92=\"\",\"\",IF(ISERR(FIND(\" \",'Arş.Gör. Sonuç'!D92))=TRUE,LEFT('Arş.Gör. Sonuç'!D92,2)&REPT(\"*\",3),LEFT('Arş.Gör. Sonuç'!D92,2)&REPT(\"*\",3)&\" \"&MID('Arş.Gör. Sonuç'!D92,FIND(\" \",'Arş.Gör. Sonuç'!D92)+1,2)&REPT(\"*\",3)))","v":""},{"$f":"IF('Arş.Gör. Sonuç'!E92=\"\",\"\",'Arş.Gör. Sonuç'!E92)","v":""},{"$f":"IF('Arş.Gör. Sonuç'!F92=\"\",\"\",'Arş.Gör. Sonuç'!F92)","v":""},{"$f":"IF('Arş.Gör. Sonuç'!G92=\"\",\"\",'Arş.Gör. Sonuç'!G92)","v":""},{"$f":"IF('Arş.Gör. Sonuç'!H92=\"\",\"\",'Arş.Gör. Sonuç'!H92)","v":""},{"$f":"IF('Arş.Gör. Sonuç'!I92=\"\",\"\",'Arş.Gör. Sonuç'!I92)","v":""},{"$f":"IF('Arş.Gör. Sonuç'!J92=\"\",\"\",'Arş.Gör. Sonuç'!J92)","v":""},{"$f":"IF('Arş.Gör. Sonuç'!K92=\"\",\"\",'Arş.Gör. Sonuç'!K92)","v":""},{"$f":"IF('Arş.Gör. Sonuç'!L92=\"\",\"\",'Arş.Gör. Sonuç'!L92)","v":""},{"$f":"IF('Arş.Gör. Sonuç'!M92=\"\",\"\",'Arş.Gör. Sonuç'!M92)","v":""},{"$f":"IF('Arş.Gör. Sonuç'!N92=\"\",\"\",'Arş.Gör. Sonuç'!N92)","v":""}]
[{"$f":"IF('Arş.Gör. Sonuç'!A93=\"\",\"\",'Arş.Gör. Sonuç'!A93)","v":""},{"$f":"IF('Arş.Gör. Sonuç'!B93=\"\",\"\",LEFT('Arş.Gör. Sonuç'!B93,3)&REPT(\"*\",4)&RIGHT('Arş.Gör. Sonuç'!B93,2))","v":""},{"$f":"IF('Arş.Gör. Sonuç'!C93=\"\",\"\",IF(ISERR(FIND(\" \",'Arş.Gör. Sonuç'!C93))=TRUE,LEFT('Arş.Gör. Sonuç'!C93,2)&REPT(\"*\",3),LEFT('Arş.Gör. Sonuç'!C93,2)&REPT(\"*\",3)&\" \"&MID('Arş.Gör. Sonuç'!C93,FIND(\" \",'Arş.Gör. Sonuç'!C93)+1,2)&REPT(\"*\",3)))","v":""},{"$f":"IF('Arş.Gör. Sonuç'!D93=\"\",\"\",IF(ISERR(FIND(\" \",'Arş.Gör. Sonuç'!D93))=TRUE,LEFT('Arş.Gör. Sonuç'!D93,2)&REPT(\"*\",3),LEFT('Arş.Gör. Sonuç'!D93,2)&REPT(\"*\",3)&\" \"&MID('Arş.Gör. Sonuç'!D93,FIND(\" \",'Arş.Gör. Sonuç'!D93)+1,2)&REPT(\"*\",3)))","v":""},{"$f":"IF('Arş.Gör. Sonuç'!E93=\"\",\"\",'Arş.Gör. Sonuç'!E93)","v":""},{"$f":"IF('Arş.Gör. Sonuç'!F93=\"\",\"\",'Arş.Gör. Sonuç'!F93)","v":""},{"$f":"IF('Arş.Gör. Sonuç'!G93=\"\",\"\",'Arş.Gör. Sonuç'!G93)","v":""},{"$f":"IF('Arş.Gör. Sonuç'!H93=\"\",\"\",'Arş.Gör. Sonuç'!H93)","v":""},{"$f":"IF('Arş.Gör. Sonuç'!I93=\"\",\"\",'Arş.Gör. Sonuç'!I93)","v":""},{"$f":"IF('Arş.Gör. Sonuç'!J93=\"\",\"\",'Arş.Gör. Sonuç'!J93)","v":""},{"$f":"IF('Arş.Gör. Sonuç'!K93=\"\",\"\",'Arş.Gör. Sonuç'!K93)","v":""},{"$f":"IF('Arş.Gör. Sonuç'!L93=\"\",\"\",'Arş.Gör. Sonuç'!L93)","v":""},{"$f":"IF('Arş.Gör. Sonuç'!M93=\"\",\"\",'Arş.Gör. Sonuç'!M93)","v":""},{"$f":"IF('Arş.Gör. Sonuç'!N93=\"\",\"\",'Arş.Gör. Sonuç'!N93)","v":""}]
[{"$f":"IF('Arş.Gör. Sonuç'!A94=\"\",\"\",'Arş.Gör. Sonuç'!A94)","v":""},{"$f":"IF('Arş.Gör. Sonuç'!B94=\"\",\"\",LEFT('Arş.Gör. Sonuç'!B94,3)&REPT(\"*\",4)&RIGHT('Arş.Gör. Sonuç'!B94,2))","v":""},{"$f":"IF('Arş.Gör. Sonuç'!C94=\"\",\"\",IF(ISERR(FIND(\" \",'Arş.Gör. Sonuç'!C94))=TRUE,LEFT('Arş.Gör. Sonuç'!C94,2)&REPT(\"*\",3),LEFT('Arş.Gör. Sonuç'!C94,2)&REPT(\"*\",3)&\" \"&MID('Arş.Gör. Sonuç'!C94,FIND(\" \",'Arş.Gör. Sonuç'!C94)+1,2)&REPT(\"*\",3)))","v":""},{"$f":"IF('Arş.Gör. Sonuç'!D94=\"\",\"\",IF(ISERR(FIND(\" \",'Arş.Gör. Sonuç'!D94))=TRUE,LEFT('Arş.Gör. Sonuç'!D94,2)&REPT(\"*\",3),LEFT('Arş.Gör. Sonuç'!D94,2)&REPT(\"*\",3)&\" \"&MID('Arş.Gör. Sonuç'!D94,FIND(\" \",'Arş.Gör. Sonuç'!D94)+1,2)&REPT(\"*\",3)))","v":""},{"$f":"IF('Arş.Gör. Sonuç'!E94=\"\",\"\",'Arş.Gör. Sonuç'!E94)","v":""},{"$f":"IF('Arş.Gör. Sonuç'!F94=\"\",\"\",'Arş.Gör. Sonuç'!F94)","v":""},{"$f":"IF('Arş.Gör. Sonuç'!G94=\"\",\"\",'Arş.Gör. Sonuç'!G94)","v":""},{"$f":"IF('Arş.Gör. Sonuç'!H94=\"\",\"\",'Arş.Gör. Sonuç'!H94)","v":""},{"$f":"IF('Arş.Gör. Sonuç'!I94=\"\",\"\",'Arş.Gör. Sonuç'!I94)","v":""},{"$f":"IF('Arş.Gör. Sonuç'!J94=\"\",\"\",'Arş.Gör. Sonuç'!J94)","v":""},{"$f":"IF('Arş.Gör. Sonuç'!K94=\"\",\"\",'Arş.Gör. Sonuç'!K94)","v":""},{"$f":"IF('Arş.Gör. Sonuç'!L94=\"\",\"\",'Arş.Gör. Sonuç'!L94)","v":""},{"$f":"IF('Arş.Gör. Sonuç'!M94=\"\",\"\",'Arş.Gör. Sonuç'!M94)","v":""},{"$f":"IF('Arş.Gör. Sonuç'!N94=\"\",\"\",'Arş.Gör. Sonuç'!N94)","v":""}]
[{"$f":"IF('Arş.Gör. Sonuç'!A95=\"\",\"\",'Arş.Gör. Sonuç'!A95)","v":""},{"$f":"IF('Arş.Gör. Sonuç'!B95=\"\",\"\",LEFT('Arş.Gör. Sonuç'!B95,3)&REPT(\"*\",4)&RIGHT('Arş.Gör. Sonuç'!B95,2))","v":""},{"$f":"IF('Arş.Gör. Sonuç'!C95=\"\",\"\",IF(ISERR(FIND(\" \",'Arş.Gör. Sonuç'!C95))=TRUE,LEFT('Arş.Gör. Sonuç'!C95,2)&REPT(\"*\",3),LEFT('Arş.Gör. Sonuç'!C95,2)&REPT(\"*\",3)&\" \"&MID('Arş.Gör. Sonuç'!C95,FIND(\" \",'Arş.Gör. Sonuç'!C95)+1,2)&REPT(\"*\",3)))","v":""},{"$f":"IF('Arş.Gör. Sonuç'!D95=\"\",\"\",IF(ISERR(FIND(\" \",'Arş.Gör. Sonuç'!D95))=TRUE,LEFT('Arş.Gör. Sonuç'!D95,2)&REPT(\"*\",3),LEFT('Arş.Gör. Sonuç'!D95,2)&REPT(\"*\",3)&\" \"&MID('Arş.Gör. Sonuç'!D95,FIND(\" \",'Arş.Gör. Sonuç'!D95)+1,2)&REPT(\"*\",3)))","v":""},{"$f":"IF('Arş.Gör. Sonuç'!E95=\"\",\"\",'Arş.Gör. Sonuç'!E95)","v":""},{"$f":"IF('Arş.Gör. Sonuç'!F95=\"\",\"\",'Arş.Gör. Sonuç'!F95)","v":""},{"$f":"IF('Arş.Gör. Sonuç'!G95=\"\",\"\",'Arş.Gör. Sonuç'!G95)","v":""},{"$f":"IF('Arş.Gör. Sonuç'!H95=\"\",\"\",'Arş.Gör. Sonuç'!H95)","v":""},{"$f":"IF('Arş.Gör. Sonuç'!I95=\"\",\"\",'Arş.Gör. Sonuç'!I95)","v":""},{"$f":"IF('Arş.Gör. Sonuç'!J95=\"\",\"\",'Arş.Gör. Sonuç'!J95)","v":""},{"$f":"IF('Arş.Gör. Sonuç'!K95=\"\",\"\",'Arş.Gör. Sonuç'!K95)","v":""},{"$f":"IF('Arş.Gör. Sonuç'!L95=\"\",\"\",'Arş.Gör. Sonuç'!L95)","v":""},{"$f":"IF('Arş.Gör. Sonuç'!M95=\"\",\"\",'Arş.Gör. Sonuç'!M95)","v":""},{"$f":"IF('Arş.Gör. Sonuç'!N95=\"\",\"\",'Arş.Gör. Sonuç'!N95)","v":""}]
[{"$f":"IF('Arş.Gör. Sonuç'!A96=\"\",\"\",'Arş.Gör. Sonuç'!A96)","v":""},{"$f":"IF('Arş.Gör. Sonuç'!B96=\"\",\"\",LEFT('Arş.Gör. Sonuç'!B96,3)&REPT(\"*\",4)&RIGHT('Arş.Gör. Sonuç'!B96,2))","v":""},{"$f":"IF('Arş.Gör. Sonuç'!C96=\"\",\"\",IF(ISERR(FIND(\" \",'Arş.Gör. Sonuç'!C96))=TRUE,LEFT('Arş.Gör. Sonuç'!C96,2)&REPT(\"*\",3),LEFT('Arş.Gör. Sonuç'!C96,2)&REPT(\"*\",3)&\" \"&MID('Arş.Gör. Sonuç'!C96,FIND(\" \",'Arş.Gör. Sonuç'!C96)+1,2)&REPT(\"*\",3)))","v":""},{"$f":"IF('Arş.Gör. Sonuç'!D96=\"\",\"\",IF(ISERR(FIND(\" \",'Arş.Gör. Sonuç'!D96))=TRUE,LEFT('Arş.Gör. Sonuç'!D96,2)&REPT(\"*\",3),LEFT('Arş.Gör. Sonuç'!D96,2)&REPT(\"*\",3)&\" \"&MID('Arş.Gör. Sonuç'!D96,FIND(\" \",'Arş.Gör. Sonuç'!D96)+1,2)&REPT(\"*\",3)))","v":""},{"$f":"IF('Arş.Gör. Sonuç'!E96=\"\",\"\",'Arş.Gör. Sonuç'!E96)","v":""},{"$f":"IF('Arş.Gör. Sonuç'!F96=\"\",\"\",'Arş.Gör. Sonuç'!F96)","v":""},{"$f":"IF('Arş.Gör. Sonuç'!G96=\"\",\"\",'Arş.Gör. Sonuç'!G96)","v":""},{"$f":"IF('Arş.Gör. Sonuç'!H96=\"\",\"\",'Arş.Gör. Sonuç'!H96)","v":""},{"$f":"IF('Arş.Gör. Sonuç'!I96=\"\",\"\",'Arş.Gör. Sonuç'!I96)","v":""},{"$f":"IF('Arş.Gör. Sonuç'!J96=\"\",\"\",'Arş.Gör. Sonuç'!J96)","v":""},{"$f":"IF('Arş.Gör. Sonuç'!K96=\"\",\"\",'Arş.Gör. Sonuç'!K96)","v":""},{"$f":"IF('Arş.Gör. Sonuç'!L96=\"\",\"\",'Arş.Gör. Sonuç'!L96)","v":""},{"$f":"IF('Arş.Gör. Sonuç'!M96=\"\",\"\",'Arş.Gör. Sonuç'!M96)","v":""},{"$f":"IF('Arş.Gör. Sonuç'!N96=\"\",\"\",'Arş.Gör. Sonuç'!N96)","v":""}]
[{"$f":"IF('Arş.Gör. Sonuç'!A97=\"\",\"\",'Arş.Gör. Sonuç'!A97)","v":""},{"$f":"IF('Arş.Gör. Sonuç'!B97=\"\",\"\",LEFT('Arş.Gör. Sonuç'!B97,3)&REPT(\"*\",4)&RIGHT('Arş.Gör. Sonuç'!B97,2))","v":""},{"$f":"IF('Arş.Gör. Sonuç'!C97=\"\",\"\",IF(ISERR(FIND(\" \",'Arş.Gör. Sonuç'!C97))=TRUE,LEFT('Arş.Gör. Sonuç'!C97,2)&REPT(\"*\",3),LEFT('Arş.Gör. Sonuç'!C97,2)&REPT(\"*\",3)&\" \"&MID('Arş.Gör. Sonuç'!C97,FIND(\" \",'Arş.Gör. Sonuç'!C97)+1,2)&REPT(\"*\",3)))","v":""},{"$f":"IF('Arş.Gör. Sonuç'!D97=\"\",\"\",IF(ISERR(FIND(\" \",'Arş.Gör. Sonuç'!D97))=TRUE,LEFT('Arş.Gör. Sonuç'!D97,2)&REPT(\"*\",3),LEFT('Arş.Gör. Sonuç'!D97,2)&REPT(\"*\",3)&\" \"&MID('Arş.Gör. Sonuç'!D97,FIND(\" \",'Arş.Gör. Sonuç'!D97)+1,2)&REPT(\"*\",3)))","v":""},{"$f":"IF('Arş.Gör. Sonuç'!E97=\"\",\"\",'Arş.Gör. Sonuç'!E97)","v":""},{"$f":"IF('Arş.Gör. Sonuç'!F97=\"\",\"\",'Arş.Gör. Sonuç'!F97)","v":""},{"$f":"IF('Arş.Gör. Sonuç'!G97=\"\",\"\",'Arş.Gör. Sonuç'!G97)","v":""},{"$f":"IF('Arş.Gör. Sonuç'!H97=\"\",\"\",'Arş.Gör. Sonuç'!H97)","v":""},{"$f":"IF('Arş.Gör. Sonuç'!I97=\"\",\"\",'Arş.Gör. Sonuç'!I97)","v":""},{"$f":"IF('Arş.Gör. Sonuç'!J97=\"\",\"\",'Arş.Gör. Sonuç'!J97)","v":""},{"$f":"IF('Arş.Gör. Sonuç'!K97=\"\",\"\",'Arş.Gör. Sonuç'!K97)","v":""},{"$f":"IF('Arş.Gör. Sonuç'!L97=\"\",\"\",'Arş.Gör. Sonuç'!L97)","v":""},{"$f":"IF('Arş.Gör. Sonuç'!M97=\"\",\"\",'Arş.Gör. Sonuç'!M97)","v":""},{"$f":"IF('Arş.Gör. Sonuç'!N97=\"\",\"\",'Arş.Gör. Sonuç'!N97)","v":""}]
[{"$f":"IF('Arş.Gör. Sonuç'!A98=\"\",\"\",'Arş.Gör. Sonuç'!A98)","v":""},{"$f":"IF('Arş.Gör. Sonuç'!B98=\"\",\"\",LEFT('Arş.Gör. Sonuç'!B98,3)&REPT(\"*\",4)&RIGHT('Arş.Gör. Sonuç'!B98,2))","v":""},{"$f":"IF('Arş.Gör. Sonuç'!C98=\"\",\"\",IF(ISERR(FIND(\" \",'Arş.Gör. Sonuç'!C98))=TRUE,LEFT('Arş.Gör. Sonuç'!C98,2)&REPT(\"*\",3),LEFT('Arş.Gör. Sonuç'!C98,2)&REPT(\"*\",3)&\" \"&MID('Arş.Gör. Sonuç'!C98,FIND(\" \",'Arş.Gör. Sonuç'!C98)+1,2)&REPT(\"*\",3)))","v":""},{"$f":"IF('Arş.Gör. Sonuç'!D98=\"\",\"\",IF(ISERR(FIND(\" \",'Arş.Gör. Sonuç'!D98))=TRUE,LEFT('Arş.Gör. Sonuç'!D98,2)&REPT(\"*\",3),LEFT('Arş.Gör. Sonuç'!D98,2)&REPT(\"*\",3)&\" \"&MID('Arş.Gör. Sonuç'!D98,FIND(\" \",'Arş.Gör. Sonuç'!D98)+1,2)&REPT(\"*\",3)))","v":""},{"$f":"IF('Arş.Gör. Sonuç'!E98=\"\",\"\",'Arş.Gör. Sonuç'!E98)","v":""},{"$f":"IF('Arş.Gör. Sonuç'!F98=\"\",\"\",'Arş.Gör. Sonuç'!F98)","v":""},{"$f":"IF('Arş.Gör. Sonuç'!G98=\"\",\"\",'Arş.Gör. Sonuç'!G98)","v":""},{"$f":"IF('Arş.Gör. Sonuç'!H98=\"\",\"\",'Arş.Gör. Sonuç'!H98)","v":""},{"$f":"IF('Arş.Gör. Sonuç'!I98=\"\",\"\",'Arş.Gör. Sonuç'!I98)","v":""},{"$f":"IF('Arş.Gör. Sonuç'!J98=\"\",\"\",'Arş.Gör. Sonuç'!J98)","v":""},{"$f":"IF('Arş.Gör. Sonuç'!K98=\"\",\"\",'Arş.Gör. Sonuç'!K98)","v":""},{"$f":"IF('Arş.Gör. Sonuç'!L98=\"\",\"\",'Arş.Gör. Sonuç'!L98)","v":""},{"$f":"IF('Arş.Gör. Sonuç'!M98=\"\",\"\",'Arş.Gör. Sonuç'!M98)","v":""},{"$f":"IF('Arş.Gör. Sonuç'!N98=\"\",\"\",'Arş.Gör. Sonuç'!N98)","v":""}]
[{"$f":"IF('Arş.Gör. Sonuç'!A99=\"\",\"\",'Arş.Gör. Sonuç'!A99)","v":""},{"$f":"IF('Arş.Gör. Sonuç'!B99=\"\",\"\",LEFT('Arş.Gör. Sonuç'!B99,3)&REPT(\"*\",4)&RIGHT('Arş.Gör. Sonuç'!B99,2))","v":""},{"$f":"IF('Arş.Gör. Sonuç'!C99=\"\",\"\",IF(ISERR(FIND(\" \",'Arş.Gör. Sonuç'!C99))=TRUE,LEFT('Arş.Gör. Sonuç'!C99,2)&REPT(\"*\",3),LEFT('Arş.Gör. Sonuç'!C99,2)&REPT(\"*\",3)&\" \"&MID('Arş.Gör. Sonuç'!C99,FIND(\" \",'Arş.Gör. Sonuç'!C99)+1,2)&REPT(\"*\",3)))","v":""},{"$f":"IF('Arş.Gör. Sonuç'!D99=\"\",\"\",IF(ISERR(FIND(\" \",'Arş.Gör. Sonuç'!D99))=TRUE,LEFT('Arş.Gör. Sonuç'!D99,2)&REPT(\"*\",3),LEFT('Arş.Gör. Sonuç'!D99,2)&REPT(\"*\",3)&\" \"&MID('Arş.Gör. Sonuç'!D99,FIND(\" \",'Arş.Gör. Sonuç'!D99)+1,2)&REPT(\"*\",3)))","v":""},{"$f":"IF('Arş.Gör. Sonuç'!E99=\"\",\"\",'Arş.Gör. Sonuç'!E99)","v":""},{"$f":"IF('Arş.Gör. Sonuç'!F99=\"\",\"\",'Arş.Gör. Sonuç'!F99)","v":""},{"$f":"IF('Arş.Gör. Sonuç'!G99=\"\",\"\",'Arş.Gör. Sonuç'!G99)","v":""},{"$f":"IF('Arş.Gör. Sonuç'!H99=\"\",\"\",'Arş.Gör. Sonuç'!H99)","v":""},{"$f":"IF('Arş.Gör. Sonuç'!I99=\"\",\"\",'Arş.Gör. Sonuç'!I99)","v":""},{"$f":"IF('Arş.Gör. Sonuç'!J99=\"\",\"\",'Arş.Gör. Sonuç'!J99)","v":""},{"$f":"IF('Arş.Gör. Sonuç'!K99=\"\",\"\",'Arş.Gör. Sonuç'!K99)","v":""},{"$f":"IF('Arş.Gör. Sonuç'!L99=\"\",\"\",'Arş.Gör. Sonuç'!L99)","v":""},{"$f":"IF('Arş.Gör. Sonuç'!M99=\"\",\"\",'Arş.Gör. Sonuç'!M99)","v":""},{"$f":"IF('Arş.Gör. Sonuç'!N99=\"\",\"\",'Arş.Gör. Sonuç'!N99)","v":""}]
[{"$f":"IF('Arş.Gör. Sonuç'!A100=\"\",\"\",'Arş.Gör. Sonuç'!A100)","v":""},{"$f":"IF('Arş.Gör. Sonuç'!B100=\"\",\"\",LEFT('Arş.Gör. Sonuç'!B100,3)&REPT(\"*\",4)&RIGHT('Arş.Gör. Sonuç'!B100,2))","v":""},{"$f":"IF('Arş.Gör. Sonuç'!C100=\"\",\"\",IF(ISERR(FIND(\" \",'Arş.Gör. Sonuç'!C100))=TRUE,LEFT('Arş.Gör. Sonuç'!C100,2)&REPT(\"*\",3),LEFT('Arş.Gör. Sonuç'!C100,2)&REPT(\"*\",3)&\" \"&MID('Arş.Gör. Sonuç'!C100,FIND(\" \",'Arş.Gör. Sonuç'!C100)+1,2)&REPT(\"*\",3)))","v":""},{"$f":"IF('Arş.Gör. Sonuç'!D100=\"\",\"\",IF(ISERR(FIND(\" \",'Arş.Gör. Sonuç'!D100))=TRUE,LEFT('Arş.Gör. Sonuç'!D100,2)&REPT(\"*\",3),LEFT('Arş.Gör. Sonuç'!D100,2)&REPT(\"*\",3)&\" \"&MID('Arş.Gör. Sonuç'!D100,FIND(\" \",'Arş.Gör. Sonuç'!D100)+1,2)&REPT(\"*\",3)))","v":""},{"$f":"IF('Arş.Gör. Sonuç'!E100=\"\",\"\",'Arş.Gör. Sonuç'!E100)","v":""},{"$f":"IF('Arş.Gör. Sonuç'!F100=\"\",\"\",'Arş.Gör. Sonuç'!F100)","v":""},{"$f":"IF('Arş.Gör. Sonuç'!G100=\"\",\"\",'Arş.Gör. Sonuç'!G100)","v":""},{"$f":"IF('Arş.Gör. Sonuç'!H100=\"\",\"\",'Arş.Gör. Sonuç'!H100)","v":""},{"$f":"IF('Arş.Gör. Sonuç'!I100=\"\",\"\",'Arş.Gör. Sonuç'!I100)","v":""},{"$f":"IF('Arş.Gör. Sonuç'!J100=\"\",\"\",'Arş.Gör. Sonuç'!J100)","v":""},{"$f":"IF('Arş.Gör. Sonuç'!K100=\"\",\"\",'Arş.Gör. Sonuç'!K100)","v":""},{"$f":"IF('Arş.Gör. Sonuç'!L100=\"\",\"\",'Arş.Gör. Sonuç'!L100)","v":""},{"$f":"IF('Arş.Gör. Sonuç'!M100=\"\",\"\",'Arş.Gör. Sonuç'!M100)","v":""},{"$f":"IF('Arş.Gör. Sonuç'!N100=\"\",\"\",'Arş.Gör. Sonuç'!N100)","v":""}]
[{"$f":"IF('Arş.Gör. Sonuç'!A101=\"\",\"\",'Arş.Gör. Sonuç'!A101)","v":""},{"$f":"IF('Arş.Gör. Sonuç'!B101=\"\",\"\",LEFT('Arş.Gör. Sonuç'!B101,3)&REPT(\"*\",4)&RIGHT('Arş.Gör. Sonuç'!B101,2))","v":""},{"$f":"IF('Arş.Gör. Sonuç'!C101=\"\",\"\",IF(ISERR(FIND(\" \",'Arş.Gör. Sonuç'!C101))=TRUE,LEFT('Arş.Gör. Sonuç'!C101,2)&REPT(\"*\",3),LEFT('Arş.Gör. Sonuç'!C101,2)&REPT(\"*\",3)&\" \"&MID('Arş.Gör. Sonuç'!C101,FIND(\" \",'Arş.Gör. Sonuç'!C101)+1,2)&REPT(\"*\",3)))","v":""},{"$f":"IF('Arş.Gör. Sonuç'!D101=\"\",\"\",IF(ISERR(FIND(\" \",'Arş.Gör. Sonuç'!D101))=TRUE,LEFT('Arş.Gör. Sonuç'!D101,2)&REPT(\"*\",3),LEFT('Arş.Gör. Sonuç'!D101,2)&REPT(\"*\",3)&\" \"&MID('Arş.Gör. Sonuç'!D101,FIND(\" \",'Arş.Gör. Sonuç'!D101)+1,2)&REPT(\"*\",3)))","v":""},{"$f":"IF('Arş.Gör. Sonuç'!E101=\"\",\"\",'Arş.Gör. Sonuç'!E101)","v":""},{"$f":"IF('Arş.Gör. Sonuç'!F101=\"\",\"\",'Arş.Gör. Sonuç'!F101)","v":""},{"$f":"IF('Arş.Gör. Sonuç'!G101=\"\",\"\",'Arş.Gör. Sonuç'!G101)","v":""},{"$f":"IF('Arş.Gör. Sonuç'!H101=\"\",\"\",'Arş.Gör. Sonuç'!H101)","v":""},{"$f":"IF('Arş.Gör. Sonuç'!I101=\"\",\"\",'Arş.Gör. Sonuç'!I101)","v":""},{"$f":"IF('Arş.Gör. Sonuç'!J101=\"\",\"\",'Arş.Gör. Sonuç'!J101)","v":""},{"$f":"IF('Arş.Gör. Sonuç'!K101=\"\",\"\",'Arş.Gör. Sonuç'!K101)","v":""},{"$f":"IF('Arş.Gör. Sonuç'!L101=\"\",\"\",'Arş.Gör. Sonuç'!L101)","v":""},{"$f":"IF('Arş.Gör. Sonuç'!M101=\"\",\"\",'Arş.Gör. Sonuç'!M101)","v":""},{"$f":"IF('Arş.Gör. Sonuç'!N101=\"\",\"\",'Arş.Gör. Sonuç'!N101)","v":""}]
[{"$f":"IF('Arş.Gör. Sonuç'!A102=\"\",\"\",'Arş.Gör. Sonuç'!A102)","v":""},{"$f":"IF('Arş.Gör. Sonuç'!B102=\"\",\"\",LEFT('Arş.Gör. Sonuç'!B102,3)&REPT(\"*\",4)&RIGHT('Arş.Gör. Sonuç'!B102,2))","v":""},{"$f":"IF('Arş.Gör. Sonuç'!C102=\"\",\"\",IF(ISERR(FIND(\" \",'Arş.Gör. Sonuç'!C102))=TRUE,LEFT('Arş.Gör. Sonuç'!C102,2)&REPT(\"*\",3),LEFT('Arş.Gör. Sonuç'!C102,2)&REPT(\"*\",3)&\" \"&MID('Arş.Gör. Sonuç'!C102,FIND(\" \",'Arş.Gör. Sonuç'!C102)+1,2)&REPT(\"*\",3)))","v":""},{"$f":"IF('Arş.Gör. Sonuç'!D102=\"\",\"\",IF(ISERR(FIND(\" \",'Arş.Gör. Sonuç'!D102))=TRUE,LEFT('Arş.Gör. Sonuç'!D102,2)&REPT(\"*\",3),LEFT('Arş.Gör. Sonuç'!D102,2)&REPT(\"*\",3)&\" \"&MID('Arş.Gör. Sonuç'!D102,FIND(\" \",'Arş.Gör. Sonuç'!D102)+1,2)&REPT(\"*\",3)))","v":""},{"$f":"IF('Arş.Gör. Sonuç'!E102=\"\",\"\",'Arş.Gör. Sonuç'!E102)","v":""},{"$f":"IF('Arş.Gör. Sonuç'!F102=\"\",\"\",'Arş.Gör. Sonuç'!F102)","v":""},{"$f":"IF('Arş.Gör. Sonuç'!G102=\"\",\"\",'Arş.Gör. Sonuç'!G102)","v":""},{"$f":"IF('Arş.Gör. Sonuç'!H102=\"\",\"\",'Arş.Gör. Sonuç'!H102)","v":""},{"$f":"IF('Arş.Gör. Sonuç'!I102=\"\",\"\",'Arş.Gör. Sonuç'!I102)","v":""},{"$f":"IF('Arş.Gör. Sonuç'!J102=\"\",\"\",'Arş.Gör. Sonuç'!J102)","v":""},{"$f":"IF('Arş.Gör. Sonuç'!K102=\"\",\"\",'Arş.Gör. Sonuç'!K102)","v":""},{"$f":"IF('Arş.Gör. Sonuç'!L102=\"\",\"\",'Arş.Gör. Sonuç'!L102)","v":""},{"$f":"IF('Arş.Gör. Sonuç'!M102=\"\",\"\",'Arş.Gör. Sonuç'!M102)","v":""},{"$f":"IF('Arş.Gör. Sonuç'!N102=\"\",\"\",'Arş.Gör. Sonuç'!N102)","v":""}]
[{"$f":"IF('Arş.Gör. Sonuç'!A103=\"\",\"\",'Arş.Gör. Sonuç'!A103)","v":""},{"$f":"IF('Arş.Gör. Sonuç'!B103=\"\",\"\",LEFT('Arş.Gör. Sonuç'!B103,3)&REPT(\"*\",4)&RIGHT('Arş.Gör. Sonuç'!B103,2))","v":""},{"$f":"IF('Arş.Gör. Sonuç'!C103=\"\",\"\",IF(ISERR(FIND(\" \",'Arş.Gör. Sonuç'!C103))=TRUE,LEFT('Arş.Gör. Sonuç'!C103,2)&REPT(\"*\",3),LEFT('Arş.Gör. Sonuç'!C103,2)&REPT(\"*\",3)&\" \"&MID('Arş.Gör. Sonuç'!C103,FIND(\" \",'Arş.Gör. Sonuç'!C103)+1,2)&REPT(\"*\",3)))","v":""},{"$f":"IF('Arş.Gör. Sonuç'!D103=\"\",\"\",IF(ISERR(FIND(\" \",'Arş.Gör. Sonuç'!D103))=TRUE,LEFT('Arş.Gör. Sonuç'!D103,2)&REPT(\"*\",3),LEFT('Arş.Gör. Sonuç'!D103,2)&REPT(\"*\",3)&\" \"&MID('Arş.Gör. Sonuç'!D103,FIND(\" \",'Arş.Gör. Sonuç'!D103)+1,2)&REPT(\"*\",3)))","v":""},{"$f":"IF('Arş.Gör. Sonuç'!E103=\"\",\"\",'Arş.Gör. Sonuç'!E103)","v":""},{"$f":"IF('Arş.Gör. Sonuç'!F103=\"\",\"\",'Arş.Gör. Sonuç'!F103)","v":""},{"$f":"IF('Arş.Gör. Sonuç'!G103=\"\",\"\",'Arş.Gör. Sonuç'!G103)","v":""},{"$f":"IF('Arş.Gör. Sonuç'!H103=\"\",\"\",'Arş.Gör. Sonuç'!H103)","v":""},{"$f":"IF('Arş.Gör. Sonuç'!I103=\"\",\"\",'Arş.Gör. Sonuç'!I103)","v":""},{"$f":"IF('Arş.Gör. Sonuç'!J103=\"\",\"\",'Arş.Gör. Sonuç'!J103)","v":""},{"$f":"IF('Arş.Gör. Sonuç'!K103=\"\",\"\",'Arş.Gör. Sonuç'!K103)","v":""},{"$f":"IF('Arş.Gör. Sonuç'!L103=\"\",\"\",'Arş.Gör. Sonuç'!L103)","v":""},{"$f":"IF('Arş.Gör. Sonuç'!M103=\"\",\"\",'Arş.Gör. Sonuç'!M103)","v":""},{"$f":"IF('Arş.Gör. Sonuç'!N103=\"\",\"\",'Arş.Gör. Sonuç'!N103)","v":""}]

{"sheet":"Önc. Alan Sonuç","index":4,"n_rows":15,"n_cols":14,"rows_kept":15,"cut":false,"hidden":false,"merged":[[7,6,7,8],[7,9,7,10],[7,11,7,12],[8,0,8,1],[8,2,8,13],[7,0,7,1],[7,2,7,5],[0,0,0,13],[1,0,1,13],[2,0,2,13],[3,0,3,13],[6,0,6,1],[6,2,6,5],[6,6,6,8],[6,9,6,13],[4,0,4,1],[4,2,4,5],[4,6,4,8],[4,9,4,13],[5,0,5,1],[5,2,5,5],[5,6,5,8],[5,9,5,13],[9,12,10,12],[9,13,10,13],[9,10,9,11],[9,0,10,0],[9,4,9,5],[9,6,9,7],[9,8,9,9],[9,1,9,3]]}
["T.C."]
["BAYBURT ÜNİVERSİTESİ"]
["GİRİŞ SINAVI SONUÇ TUTANAĞI"]
[" Üniversitemize bağlı birimlere, 2547 sayılı Kanunun ilgili maddeleri ve 09.11.2018 tarih ve 30590 sayılı Resmi Gazetede yayımlanan \"Öğretim Üyesi Dışındaki Öğretim Elemanı Kadrolarına Naklen veya Açıktan Yapılacak Atamalarda Uygulanacak Merkezi Sınav ile Giriş Sınavlarına İlişkin Usul ve Esaslar Hakkında Yönetmelik” 11. ve 12. maddeleri hükümleri uyarınca yapılan Giriş Sınavında başarılı olan adayların isimleri aşağıda belirtilmiştir."]
["İlan No:",null,null,null,null,null,"Birimi:",null,null,"….. Fakültesi / Yüksekokulu"]
["İlan Tarihi:",null,"…/.../....",null,null,null,"Bölümü:",null,null,"….. Bölümü"]
["Kadro Unvanı:",null,"Araştırma Görevlisi (Öncelikli Alan)",null,null,null,"Anabili Dalı:",null,null,"…… Anabilim Dalı"]
["Kadro Adedi:",null,1,null,null,null,"Sınav Tarihi:",null,null,"…/.../....",null,"Sonuç Tarihi:",null,"…/.../...."]
["İlan Özel Şartı:"]
["Sıra No","Başvuranın",null,null,"ALES",null,"Yabancı Dil",null,null,null,"Giriş (Sözlü) Sınavı",null,"(A+B+C+D) Değerlendirme Notu","Sonuç"]
[null,"T.C. Kimlik No","Adı","Soyadı","Puanı","(A) Puanın %30' u","Puanı","(B) Puanın %10' u","100' lük Sistem ","(C) Notun %30' u","Sözlü Sınav Notu","(D)  Notunun %30' u"]
[1,11111111111,"Örnek Örnek","Örnek",82.513919999999999,{"$f":"E12*0.3","v":24.754175999999998},62.5,{"$f":"G12*0.1","v":6.25},76.66,{"$f":"I12*0.3","v":22.997999999999998},95,{"$f":"K12*0.3","v":28.5},{"$f":"F12+H12+J12+L12","v":82.502175999999992},"BAŞARILI (ASIL)"]
[2,11111111111,"Örnek","Örnek Örnek",82.513919999999999,{"$f":"E13*0.3","v":24.754175999999998},62.5,{"$f":"G13*0.1","v":6.25},76.66,{"$f":"I13*0.3","v":22.997999999999998},90,{"$f":"K13*0.3","v":27},{"$f":"F13+H13+J13+L13","v":81.002175999999992},"BAŞARILI (YEDEK)*"]
[3,11111111111,"Örnek Örnek","Örnek Örnek",85.030479999999997,{"$f":"E14*0.3","v":25.509143999999999},52.5,{"$f":"G14*0.1","v":5.25},76.66,{"$f":"I14*0.3","v":22.997999999999998},85,{"$f":"K14*0.3","v":25.5},{"$f":"F14+H14+J14+L14","v":79.257143999999997},"YÖNETMELİK GEREĞİ ELENDİ**"]
[4,11111111111,"Örnek","Örnek",85.030479999999997,{"$f":"E15*0.3","v":25.509143999999999},52.5,{"$f":"G15*0.1","v":5.25},76.66,{"$f":"I15*0.3","v":22.997999999999998},63,"-","-","YÖNETMELİK GEREĞİ BAŞARISIZ***"]

{"sheet":"Ön. Al. Sonuç Rapor","index":5,"n_rows":103,"n_cols":14,"rows_kept":103,"cut":false,"hidden":false,"merged":[[9,12,10,12],[9,13,10,13],[9,0,10,0],[9,1,9,3],[9,4,9,5],[9,6,9,7],[9,8,9,9],[9,10,9,11],[8,0,8,1],[8,2,8,13],[5,0,5,1],[5,2,5,5],[5,6,5,8],[5,9,5,13],[6,0,6,1],[6,2,6,5],[6,6,6,8],[6,9,6,13],[7,0,7,1],[7,2,7,5],[7,6,7,8],[7,9,7,10],[7,11,7,12],[0,0,0,13],[1,0,1,13],[2,0,2,13],[3,0,3,13],[4,0,4,1],[4,2,4,5],[4,6,4,8],[4,9,4,13]]}
["T.C."]
["BAYBURT ÜNİVERSİTESİ"]
["GİRİŞ SINAVI SONUÇ TUTANAĞI"]
[" Üniversitemize bağlı birimlere, 2547 sayılı Kanunun ilgili maddeleri ve 09.11.2018 tarih ve 30590 sayılı Resmi Gazetede yayımlanan \"Öğretim Üyesi Dışındaki Öğretim Elemanı Kadrolarına Naklen veya Açıktan Yapılacak Atamalarda Uygulanacak Merkezi Sınav ile Giriş Sınavlarına İlişkin Usul ve Esaslar Hakkında Yönetmelik” 11. ve 12. maddeleri hükümleri uyarınca yapılan Giriş Sınavında başarılı olan adayların isimleri aşağıda belirtilmiştir."]
["İlan No:",null,{"$f":"IF('Önc. Alan Sonuç'!C5=\"\",\"\",'Önc. Alan Sonuç'!C5)","v":""},null,null,null,"Birimi:",null,null,{"$f":"IF('Önc. Alan Sonuç'!J5=\"\",\"\",'Önc. Alan Sonuç'!J5)","v":"….. Fakültesi / Yüksekokulu"}]
["İlan Tarihi:",null,{"$f":"IF('Önc. Alan Sonuç'!C6=\"\",\"\",'Önc. Alan Sonuç'!C6)","v":"…/.../...."},null,null,null,"Bölümü:",null,null,{"$f":"IF('Önc. Alan Sonuç'!J6=\"\",\"\",'Önc. Alan Sonuç'!J6)","v":"….. Bölümü"}]
["Kadro Unvanı:",null,{"$f":"IF('Önc. Alan Sonuç'!C7=\"\",\"\",'Önc. Alan Sonuç'!C7)","v":"Araştırma Görevlisi (Öncelikli Alan)"},null,null,null,"Anabili Dalı:",null,null,{"$f":"IF('Önc. Alan Sonuç'!J7=\"\",\"\",'Önc. Alan Sonuç'!J7)","v":"…… Anabilim Dalı"}]
["Kadro Adedi:",null,{"$f":"IF('Önc. Alan Sonuç'!C8=\"\",\"\",'Önc. Alan Sonuç'!C8)","v":1},null,null,null,"Sınav Tarihi:",null,null,{"$f":"IF('Önc. Alan Sonuç'!J8=\"\",\"\",'Önc. Alan Sonuç'!J8)","v":"…/.../...."},null,"Sonuç Tarihi:",null,{"$f":"IF('Önc. Alan Sonuç'!N8=\"\",\"\",'Önc. Alan Sonuç'!N8)","v":"…/.../...."}]
["İlan Özel Şartı:",null,{"$f":"IF('Önc. Alan Sonuç'!C9=\"\",\"\",'Önc. Alan Sonuç'!C9)","v":""}]
["Sıra No","Başvuranın",null,null,"ALES Puanı",null,"Yabancı Dil Puanı",null,"Lisans Mezuniyet Notu",null,"Giriş Sınavı",null,"(A+B+C+D) Değerlendirme Notu","Sonuç"]
[null,"T.C. Kimlik No","Adı","Soyadı","Puanı","(A) Puanın %30' u","Puanı","(B) Puanın %10' u","100' lük Sistem ","(C) Notun %30' u","Giriş Sınav Notu","(D) Notunun %30' u"]
[{"$f":"IF('Önc. Alan Sonuç'!A12=\"\",\"\",'Önc. Alan Sonuç'!A12)","v":1},{"$f":"IF('Önc. Alan Sonuç'!B12=\"\",\"\",LEFT('Önc. Alan Sonuç'!B12,3)&REPT(\"*\",4)&RIGHT('Önc. Alan Sonuç'!B12,2))","v":"111****11"},{"$f":"IF('Önc. Alan Sonuç'!C12=\"\",\"\",IF(ISERR(FIND(\" \",'Önc. Alan Sonuç'!C12))=TRUE,LEFT('Önc. Alan Sonuç'!C12,2)&REPT(\"*\",3),LEFT('Önc. Alan Sonuç'!C12,2)&REPT(\"*\",3)&\" \"&MID('Önc. Alan Sonuç'!C12,FIND(\" \",'Önc. Alan Sonuç'!C12)+1,2)&REPT(\"*\",3)))","v":"Ör*** Ör***"},{"$f":"IF('Önc. Alan Sonuç'!D12=\"\",\"\",IF(ISERR(FIND(\" \",'Önc. Alan Sonuç'!D12))=TRUE,LEFT('Önc. Alan Sonuç'!D12,2)&REPT(\"*\",3),LEFT('Önc. Alan Sonuç'!D12,2)&REPT(\"*\",3)&\" \"&MID('Önc. Alan Sonuç'!D12,FIND(\" \",'Önc. Alan Sonuç'!D12)+1,2)&REPT(\"*\",3)))","v":"Ör***"},{"$f":"IF('Önc. Alan Sonuç'!E12=\"\",\"\",'Önc. Alan Sonuç'!E12)","v":82.513919999999999},{"$f":"IF('Önc. Alan Sonuç'!F12=\"\",\"\",'Önc. Alan Sonuç'!F12)","v":24.754175999999998},{"$f":"IF('Önc. Alan Sonuç'!G12=\"\",\"\",'Önc. Alan Sonuç'!G12)","v":62.5},{"$f":"IF('Önc. Alan Sonuç'!H12=\"\",\"\",'Önc. Alan Sonuç'!H12)","v":6.25},{"$f":"IF('Önc. Alan Sonuç'!I12=\"\",\"\",'Önc. Alan Sonuç'!I12)","v":76.66},{"$f":"IF('Önc. Alan Sonuç'!J12=\"\",\"\",'Önc. Alan Sonuç'!J12)","v":22.997999999999998},{"$f":"IF('Önc. Alan Sonuç'!K12=\"\",\"\",'Önc. Alan Sonuç'!K12)","v":95},{"$f":"IF('Önc. Alan Sonuç'!L12=\"\",\"\",'Önc. Alan Sonuç'!L12)","v":28.5},{"$f":"IF('Önc. Alan Sonuç'!M12=\"\",\"\",'Önc. Alan Sonuç'!M12)","v":82.502175999999992},{"$f":"IF('Önc. Alan Sonuç'!N12=\"\",\"\",'Önc. Alan Sonuç'!N12)","v":"BAŞARILI (ASIL)"}]
[{"$f":"IF('Önc. Alan Sonuç'!A13=\"\",\"\",'Önc. Alan Sonuç'!A13)","v":2},{"$f":"IF('Önc. Alan Sonuç'!B13=\"\",\"\",LEFT('Önc. Alan Sonuç'!B13,3)&REPT(\"*\",4)&RIGHT('Önc. Alan Sonuç'!B13,2))","v":"111****11"},{"$f":"IF('Önc. Alan Sonuç'!C13=\"\",\"\",IF(ISERR(FIND(\" \",'Önc. Alan Sonuç'!C13))=TRUE,LEFT('Önc. Alan Sonuç'!C13,2)&REPT(\"*\",3),LEFT('Önc. Alan Sonuç'!C13,2)&REPT(\"*\",3)&\" \"&MID('Önc. Alan Sonuç'!C13,FIND(\" \",'Önc. Alan Sonuç'!C13)+1,2)&REPT(\"*\",3)))","v":"Ör***"},{"$f":"IF('Önc. Alan Sonuç'!D13=\"\",\"\",IF(ISERR(FIND(\" \",'Önc. Alan Sonuç'!D13))=TRUE,LEFT('Önc. Alan Sonuç'!D13,2)&REPT(\"*\",3),LEFT('Önc. Alan Sonuç'!D13,2)&REPT(\"*\",3)&\" \"&MID('Önc. Alan Sonuç'!D13,FIND(\" \",'Önc. Alan Sonuç'!D13)+1,2)&REPT(\"*\",3)))","v":"Ör*** Ör***"},{"$f":"IF('Önc. Alan Sonuç'!E13=\"\",\"\",'Önc. Alan Sonuç'!E13)","v":82.513919999999999},{"$f":"IF('Önc. Alan Sonuç'!F13=\"\",\"\",'Önc. Alan Sonuç'!F13)","v":24.754175999999998},{"$f":"IF('Önc. Alan Sonuç'!G13=\"\",\"\",'Önc. Alan Sonuç'!G13)","v":62.5},{"$f":"IF('Önc. Alan Sonuç'!H13=\"\",\"\",'Önc. Alan Sonuç'!H13)","v":6.25},{"$f":"IF('Önc. Alan Sonuç'!I13=\"\",\"\",'Önc. Alan Sonuç'!I13)","v":76.66},{"$f":"IF('Önc. Alan Sonuç'!J13=\"\",\"\",'Önc. Alan Sonuç'!J13)","v":22.997999999999998},{"$f":"IF('Önc. Alan Sonuç'!K13=\"\",\"\",'Önc. Alan Sonuç'!K13)","v":90},{"$f":"IF('Önc. Alan Sonuç'!L13=\"\",\"\",'Önc. Alan Sonuç'!L13)","v":27},{"$f":"IF('Önc. Alan Sonuç'!M13=\"\",\"\",'Önc. Alan Sonuç'!M13)","v":81.002175999999992},{"$f":"IF('Önc. Alan Sonuç'!N13=\"\",\"\",'Önc. Alan Sonuç'!N13)","v":"BAŞARILI (YEDEK)*"}]
[{"$f":"IF('Önc. Alan Sonuç'!A14=\"\",\"\",'Önc. Alan Sonuç'!A14)","v":3},{"$f":"IF('Önc. Alan Sonuç'!B14=\"\",\"\",LEFT('Önc. Alan Sonuç'!B14,3)&REPT(\"*\",4)&RIGHT('Önc. Alan Sonuç'!B14,2))","v":"111****11"},{"$f":"IF('Önc. Alan Sonuç'!C14=\"\",\"\",IF(ISERR(FIND(\" \",'Önc. Alan Sonuç'!C14))=TRUE,LEFT('Önc. Alan Sonuç'!C14,2)&REPT(\"*\",3),LEFT('Önc. Alan Sonuç'!C14,2)&REPT(\"*\",3)&\" \"&MID('Önc. Alan Sonuç'!C14,FIND(\" \",'Önc. Alan Sonuç'!C14)+1,2)&REPT(\"*\",3)))","v":"Ör*** Ör***"},{"$f":"IF('Önc. Alan Sonuç'!D14=\"\",\"\",IF(ISERR(FIND(\" \",'Önc. Alan Sonuç'!D14))=TRUE,LEFT('Önc. Alan Sonuç'!D14,2)&REPT(\"*\",3),LEFT('Önc. Alan Sonuç'!D14,2)&REPT(\"*\",3)&\" \"&MID('Önc. Alan Sonuç'!D14,FIND(\" \",'Önc. Alan Sonuç'!D14)+1,2)&REPT(\"*\",3)))","v":"Ör*** Ör***"},{"$f":"IF('Önc. Alan Sonuç'!E14=\"\",\"\",'Önc. Alan Sonuç'!E14)","v":85.030479999999997},{"$f":"IF('Önc. Alan Sonuç'!F14=\"\",\"\",'Önc. Alan Sonuç'!F14)","v":25.509143999999999},{"$f":"IF('Önc. Alan Sonuç'!G14=\"\",\"\",'Önc. Alan Sonuç'!G14)","v":52.5},{"$f":"IF('Önc. Alan Sonuç'!H14=\"\",\"\",'Önc. Alan Sonuç'!H14)","v":5.25},{"$f":"IF('Önc. Alan Sonuç'!I14=\"\",\"\",'Önc. Alan Sonuç'!I14)","v":76.66},{"$f":"IF('Önc. Alan Sonuç'!J14=\"\",\"\",'Önc. Alan Sonuç'!J14)","v":22.997999999999998},{"$f":"IF('Önc. Alan Sonuç'!K14=\"\",\"\",'Önc. Alan Sonuç'!K14)","v":85},{"$f":"IF('Önc. Alan Sonuç'!L14=\"\",\"\",'Önc. Alan Sonuç'!L14)","v":25.5},{"$f":"IF('Önc. Alan Sonuç'!M14=\"\",\"\",'Önc. Alan Sonuç'!M14)","v":79.257143999999997},{"$f":"IF('Önc. Alan Sonuç'!N14=\"\",\"\",'Önc. Alan Sonuç'!N14)","v":"YÖNETMELİK GEREĞİ ELENDİ**"}]
[{"$f":"IF('Önc. Alan Sonuç'!A15=\"\",\"\",'Önc. Alan Sonuç'!A15)","v":4},{"$f":"IF('Önc. Alan Sonuç'!B15=\"\",\"\",LEFT('Önc. Alan Sonuç'!B15,3)&REPT(\"*\",4)&RIGHT('Önc. Alan Sonuç'!B15,2))","v":"111****11"},{"$f":"IF('Önc. Alan Sonuç'!C15=\"\",\"\",IF(ISERR(FIND(\" \",'Önc. Alan Sonuç'!C15))=TRUE,LEFT('Önc. Alan Sonuç'!C15,2)&REPT(\"*\",3),LEFT('Önc. Alan Sonuç'!C15,2)&REPT(\"*\",3)&\" \"&MID('Önc. Alan Sonuç'!C15,FIND(\" \",'Önc. Alan Sonuç'!C15)+1,2)&REPT(\"*\",3)))","v":"Ör***"},{"$f":"IF('Önc. Alan Sonuç'!D15=\"\",\"\",IF(ISERR(FIND(\" \",'Önc. Alan Sonuç'!D15))=TRUE,LEFT('Önc. Alan Sonuç'!D15,2)&REPT(\"*\",3),LEFT('Önc. Alan Sonuç'!D15,2)&REPT(\"*\",3)&\" \"&MID('Önc. Alan Sonuç'!D15,FIND(\" \",'Önc. Alan Sonuç'!D15)+1,2)&REPT(\"*\",3)))","v":"Ör***"},{"$f":"IF('Önc. Alan Sonuç'!E15=\"\",\"\",'Önc. Alan Sonuç'!E15)","v":85.030479999999997},{"$f":"IF('Önc. Alan Sonuç'!F15=\"\",\"\",'Önc. Alan Sonuç'!F15)","v":25.509143999999999},{"$f":"IF('Önc. Alan Sonuç'!G15=\"\",\"\",'Önc. Alan Sonuç'!G15)","v":52.5},{"$f":"IF('Önc. Alan Sonuç'!H15=\"\",\"\",'Önc. Alan Sonuç'!H15)","v":5.25},{"$f":"IF('Önc. Alan Sonuç'!I15=\"\",\"\",'Önc. Alan Sonuç'!I15)","v":76.66},{"$f":"IF('Önc. Alan Sonuç'!J15=\"\",\"\",'Önc. Alan Sonuç'!J15)","v":22.997999999999998},{"$f":"IF('Önc. Alan Sonuç'!K15=\"\",\"\",'Önc. Alan Sonuç'!K15)","v":63},{"$f":"IF('Önc. Alan Sonuç'!L15=\"\",\"\",'Önc. Alan Sonuç'!L15)","v":"-"},{"$f":"IF('Önc. Alan Sonuç'!M15=\"\",\"\",'Önc. Alan Sonuç'!M15)","v":"-"},{"$f":"IF('Önc. Alan Sonuç'!N15=\"\",\"\",'Önc. Alan Sonuç'!N15)","v":"YÖNETMELİK GEREĞİ BAŞARISIZ***"}]
[{"$f":"IF('Önc. Alan Sonuç'!A16=\"\",\"\",'Önc. Alan Sonuç'!A16)","v":""},{"$f":"IF('Önc. Alan Sonuç'!B16=\"\",\"\",LEFT('Önc. Alan Sonuç'!B16,3)&REPT(\"*\",4)&RIGHT('Önc. Alan Sonuç'!B16,2))","v":""},{"$f":"IF('Önc. Alan Sonuç'!C16=\"\",\"\",IF(ISERR(FIND(\" \",'Önc. Alan Sonuç'!C16))=TRUE,LEFT('Önc. Alan Sonuç'!C16,2)&REPT(\"*\",3),LEFT('Önc. Alan Sonuç'!C16,2)&REPT(\"*\",3)&\" \"&MID('Önc. Alan Sonuç'!C16,FIND(\" \",'Önc. Alan Sonuç'!C16)+1,2)&REPT(\"*\",3)))","v":""},{"$f":"IF('Önc. Alan Sonuç'!D16=\"\",\"\",IF(ISERR(FIND(\" \",'Önc. Alan Sonuç'!D16))=TRUE,LEFT('Önc. Alan Sonuç'!D16,2)&REPT(\"*\",3),LEFT('Önc. Alan Sonuç'!D16,2)&REPT(\"*\",3)&\" \"&MID('Önc. Alan Sonuç'!D16,FIND(\" \",'Önc. Alan Sonuç'!D16)+1,2)&REPT(\"*\",3)))","v":""},{"$f":"IF('Önc. Alan Sonuç'!E16=\"\",\"\",'Önc. Alan Sonuç'!E16)","v":""},{"$f":"IF('Önc. Alan Sonuç'!F16=\"\",\"\",'Önc. Alan Sonuç'!F16)","v":""},{"$f":"IF('Önc. Alan Sonuç'!G16=\"\",\"\",'Önc. Alan Sonuç'!G16)","v":""},{"$f":"IF('Önc. Alan Sonuç'!H16=\"\",\"\",'Önc. Alan Sonuç'!H16)","v":""},{"$f":"IF('Önc. Alan Sonuç'!I16=\"\",\"\",'Önc. Alan Sonuç'!I16)","v":""},{"$f":"IF('Önc. Alan Sonuç'!J16=\"\",\"\",'Önc. Alan Sonuç'!J16)","v":""},{"$f":"IF('Önc. Alan Sonuç'!K16=\"\",\"\",'Önc. Alan Sonuç'!K16)","v":""},{"$f":"IF('Önc. Alan Sonuç'!L16=\"\",\"\",'Önc. Alan Sonuç'!L16)","v":""},{"$f":"IF('Önc. Alan Sonuç'!M16=\"\",\"\",'Önc. Alan Sonuç'!M16)","v":""},{"$f":"IF('Önc. Alan Sonuç'!N16=\"\",\"\",'Önc. Alan Sonuç'!N16)","v":""}]
[{"$f":"IF('Önc. Alan Sonuç'!A17=\"\",\"\",'Önc. Alan Sonuç'!A17)","v":""},{"$f":"IF('Önc. Alan Sonuç'!B17=\"\",\"\",LEFT('Önc. Alan Sonuç'!B17,3)&REPT(\"*\",4)&RIGHT('Önc. Alan Sonuç'!B17,2))","v":""},{"$f":"IF('Önc. Alan Sonuç'!C17=\"\",\"\",IF(ISERR(FIND(\" \",'Önc. Alan Sonuç'!C17))=TRUE,LEFT('Önc. Alan Sonuç'!C17,2)&REPT(\"*\",3),LEFT('Önc. Alan Sonuç'!C17,2)&REPT(\"*\",3)&\" \"&MID('Önc. Alan Sonuç'!C17,FIND(\" \",'Önc. Alan Sonuç'!C17)+1,2)&REPT(\"*\",3)))","v":""},{"$f":"IF('Önc. Alan Sonuç'!D17=\"\",\"\",IF(ISERR(FIND(\" \",'Önc. Alan Sonuç'!D17))=TRUE,LEFT('Önc. Alan Sonuç'!D17,2)&REPT(\"*\",3),LEFT('Önc. Alan Sonuç'!D17,2)&REPT(\"*\",3)&\" \"&MID('Önc. Alan Sonuç'!D17,FIND(\" \",'Önc. Alan Sonuç'!D17)+1,2)&REPT(\"*\",3)))","v":""},{"$f":"IF('Önc. Alan Sonuç'!E17=\"\",\"\",'Önc. Alan Sonuç'!E17)","v":""},{"$f":"IF('Önc. Alan Sonuç'!F17=\"\",\"\",'Önc. Alan Sonuç'!F17)","v":""},{"$f":"IF('Önc. Alan Sonuç'!G17=\"\",\"\",'Önc. Alan Sonuç'!G17)","v":""},{"$f":"IF('Önc. Alan Sonuç'!H17=\"\",\"\",'Önc. Alan Sonuç'!H17)","v":""},{"$f":"IF('Önc. Alan Sonuç'!I17=\"\",\"\",'Önc. Alan Sonuç'!I17)","v":""},{"$f":"IF('Önc. Alan Sonuç'!J17=\"\",\"\",'Önc. Alan Sonuç'!J17)","v":""},{"$f":"IF('Önc. Alan Sonuç'!K17=\"\",\"\",'Önc. Alan Sonuç'!K17)","v":""},{"$f":"IF('Önc. Alan Sonuç'!L17=\"\",\"\",'Önc. Alan Sonuç'!L17)","v":""},{"$f":"IF('Önc. Alan Sonuç'!M17=\"\",\"\",'Önc. Alan Sonuç'!M17)","v":""},{"$f":"IF('Önc. Alan Sonuç'!N17=\"\",\"\",'Önc. Alan Sonuç'!N17)","v":""}]
[{"$f":"IF('Önc. Alan Sonuç'!A18=\"\",\"\",'Önc. Alan Sonuç'!A18)","v":""},{"$f":"IF('Önc. Alan Sonuç'!B18=\"\",\"\",LEFT('Önc. Alan Sonuç'!B18,3)&REPT(\"*\",4)&RIGHT('Önc. Alan Sonuç'!B18,2))","v":""},{"$f":"IF('Önc. Alan Sonuç'!C18=\"\",\"\",IF(ISERR(FIND(\" \",'Önc. Alan Sonuç'!C18))=TRUE,LEFT('Önc. Alan Sonuç'!C18,2)&REPT(\"*\",3),LEFT('Önc. Alan Sonuç'!C18,2)&REPT(\"*\",3)&\" \"&MID('Önc. Alan Sonuç'!C18,FIND(\" \",'Önc. Alan Sonuç'!C18)+1,2)&REPT(\"*\",3)))","v":""},{"$f":"IF('Önc. Alan Sonuç'!D18=\"\",\"\",IF(ISERR(FIND(\" \",'Önc. Alan Sonuç'!D18))=TRUE,LEFT('Önc. Alan Sonuç'!D18,2)&REPT(\"*\",3),LEFT('Önc. Alan Sonuç'!D18,2)&REPT(\"*\",3)&\" \"&MID('Önc. Alan Sonuç'!D18,FIND(\" \",'Önc. Alan Sonuç'!D18)+1,2)&REPT(\"*\",3)))","v":""},{"$f":"IF('Önc. Alan Sonuç'!E18=\"\",\"\",'Önc. Alan Sonuç'!E18)","v":""},{"$f":"IF('Önc. Alan Sonuç'!F18=\"\",\"\",'Önc. Alan Sonuç'!F18)","v":""},{"$f":"IF('Önc. Alan Sonuç'!G18=\"\",\"\",'Önc. Alan Sonuç'!G18)","v":""},{"$f":"IF('Önc. Alan Sonuç'!H18=\"\",\"\",'Önc. Alan Sonuç'!H18)","v":""},{"$f":"IF('Önc. Alan Sonuç'!I18=\"\",\"\",'Önc. Alan Sonuç'!I18)","v":""},{"$f":"IF('Önc. Alan Sonuç'!J18=\"\",\"\",'Önc. Alan Sonuç'!J18)","v":""},{"$f":"IF('Önc. Alan Sonuç'!K18=\"\",\"\",'Önc. Alan Sonuç'!K18)","v":""},{"$f":"IF('Önc. Alan Sonuç'!L18=\"\",\"\",'Önc. Alan Sonuç'!L18)","v":""},{"$f":"IF('Önc. Alan Sonuç'!M18=\"\",\"\",'Önc. Alan Sonuç'!M18)","v":""},{"$f":"IF('Önc. Alan Sonuç'!N18=\"\",\"\",'Önc. Alan Sonuç'!N18)","v":""}]
[{"$f":"IF('Önc. Alan Sonuç'!A19=\"\",\"\",'Önc. Alan Sonuç'!A19)","v":""},{"$f":"IF('Önc. Alan Sonuç'!B19=\"\",\"\",LEFT('Önc. Alan Sonuç'!B19,3)&REPT(\"*\",4)&RIGHT('Önc. Alan Sonuç'!B19,2))","v":""},{"$f":"IF('Önc. Alan Sonuç'!C19=\"\",\"\",IF(ISERR(FIND(\" \",'Önc. Alan Sonuç'!C19))=TRUE,LEFT('Önc. Alan Sonuç'!C19,2)&REPT(\"*\",3),LEFT('Önc. Alan Sonuç'!C19,2)&REPT(\"*\",3)&\" \"&MID('Önc. Alan Sonuç'!C19,FIND(\" \",'Önc. Alan Sonuç'!C19)+1,2)&REPT(\"*\",3)))","v":""},{"$f":"IF('Önc. Alan Sonuç'!D19=\"\",\"\",IF(ISERR(FIND(\" \",'Önc. Alan Sonuç'!D19))=TRUE,LEFT('Önc. Alan Sonuç'!D19,2)&REPT(\"*\",3),LEFT('Önc. Alan Sonuç'!D19,2)&REPT(\"*\",3)&\" \"&MID('Önc. Alan Sonuç'!D19,FIND(\" \",'Önc. Alan Sonuç'!D19)+1,2)&REPT(\"*\",3)))","v":""},{"$f":"IF('Önc. Alan Sonuç'!E19=\"\",\"\",'Önc. Alan Sonuç'!E19)","v":""},{"$f":"IF('Önc. Alan Sonuç'!F19=\"\",\"\",'Önc. Alan Sonuç'!F19)","v":""},{"$f":"IF('Önc. Alan Sonuç'!G19=\"\",\"\",'Önc. Alan Sonuç'!G19)","v":""},{"$f":"IF('Önc. Alan Sonuç'!H19=\"\",\"\",'Önc. Alan Sonuç'!H19)","v":""},{"$f":"IF('Önc. Alan Sonuç'!I19=\"\",\"\",'Önc. Alan Sonuç'!I19)","v":""},{"$f":"IF('Önc. Alan Sonuç'!J19=\"\",\"\",'Önc. Alan Sonuç'!J19)","v":""},{"$f":"IF('Önc. Alan Sonuç'!K19=\"\",\"\",'Önc. Alan Sonuç'!K19)","v":""},{"$f":"IF('Önc. Alan Sonuç'!L19=\"\",\"\",'Önc. Alan Sonuç'!L19)","v":""},{"$f":"IF('Önc. Alan Sonuç'!M19=\"\",\"\",'Önc. Alan Sonuç'!M19)","v":""},{"$f":"IF('Önc. Alan Sonuç'!N19=\"\",\"\",'Önc. Alan Sonuç'!N19)","v":""}]
[{"$f":"IF('Önc. Alan Sonuç'!A20=\"\",\"\",'Önc. Alan Sonuç'!A20)","v":""},{"$f":"IF('Önc. Alan Sonuç'!B20=\"\",\"\",LEFT('Önc. Alan Sonuç'!B20,3)&REPT(\"*\",4)&RIGHT('Önc. Alan Sonuç'!B20,2))","v":""},{"$f":"IF('Önc. Alan Sonuç'!C20=\"\",\"\",IF(ISERR(FIND(\" \",'Önc. Alan Sonuç'!C20))=TRUE,LEFT('Önc. Alan Sonuç'!C20,2)&REPT(\"*\",3),LEFT('Önc. Alan Sonuç'!C20,2)&REPT(\"*\",3)&\" \"&MID('Önc. Alan Sonuç'!C20,FIND(\" \",'Önc. Alan Sonuç'!C20)+1,2)&REPT(\"*\",3)))","v":""},{"$f":"IF('Önc. Alan Sonuç'!D20=\"\",\"\",IF(ISERR(FIND(\" \",'Önc. Alan Sonuç'!D20))=TRUE,LEFT('Önc. Alan Sonuç'!D20,2)&REPT(\"*\",3),LEFT('Önc. Alan Sonuç'!D20,2)&REPT(\"*\",3)&\" \"&MID('Önc. Alan Sonuç'!D20,FIND(\" \",'Önc. Alan Sonuç'!D20)+1,2)&REPT(\"*\",3)))","v":""},{"$f":"IF('Önc. Alan Sonuç'!E20=\"\",\"\",'Önc. Alan Sonuç'!E20)","v":""},{"$f":"IF('Önc. Alan Sonuç'!F20=\"\",\"\",'Önc. Alan Sonuç'!F20)","v":""},{"$f":"IF('Önc. Alan Sonuç'!G20=\"\",\"\",'Önc. Alan Sonuç'!G20)","v":""},{"$f":"IF('Önc. Alan Sonuç'!H20=\"\",\"\",'Önc. Alan Sonuç'!H20)","v":""},{"$f":"IF('Önc. Alan Sonuç'!I20=\"\",\"\",'Önc. Alan Sonuç'!I20)","v":""},{"$f":"IF('Önc. Alan Sonuç'!J20=\"\",\"\",'Önc. Alan Sonuç'!J20)","v":""},{"$f":"IF('Önc. Alan Sonuç'!K20=\"\",\"\",'Önc. Alan Sonuç'!K20)","v":""},{"$f":"IF('Önc. Alan Sonuç'!L20=\"\",\"\",'Önc. Alan Sonuç'!L20)","v":""},{"$f":"IF('Önc. Alan Sonuç'!M20=\"\",\"\",'Önc. Alan Sonuç'!M20)","v":""},{"$f":"IF('Önc. Alan Sonuç'!N20=\"\",\"\",'Önc. Alan Sonuç'!N20)","v":""}]
[{"$f":"IF('Önc. Alan Sonuç'!A21=\"\",\"\",'Önc. Alan Sonuç'!A21)","v":""},{"$f":"IF('Önc. Alan Sonuç'!B21=\"\",\"\",LEFT('Önc. Alan Sonuç'!B21,3)&REPT(\"*\",4)&RIGHT('Önc. Alan Sonuç'!B21,2))","v":""},{"$f":"IF('Önc. Alan Sonuç'!C21=\"\",\"\",IF(ISERR(FIND(\" \",'Önc. Alan Sonuç'!C21))=TRUE,LEFT('Önc. Alan Sonuç'!C21,2)&REPT(\"*\",3),LEFT('Önc. Alan Sonuç'!C21,2)&REPT(\"*\",3)&\" \"&MID('Önc. Alan Sonuç'!C21,FIND(\" \",'Önc. Alan Sonuç'!C21)+1,2)&REPT(\"*\",3)))","v":""},{"$f":"IF('Önc. Alan Sonuç'!D21=\"\",\"\",IF(ISERR(FIND(\" \",'Önc. Alan Sonuç'!D21))=TRUE,LEFT('Önc. Alan Sonuç'!D21,2)&REPT(\"*\",3),LEFT('Önc. Alan Sonuç'!D21,2)&REPT(\"*\",3)&\" \"&MID('Önc. Alan Sonuç'!D21,FIND(\" \",'Önc. Alan Sonuç'!D21)+1,2)&REPT(\"*\",3)))","v":""},{"$f":"IF('Önc. Alan Sonuç'!E21=\"\",\"\",'Önc. Alan Sonuç'!E21)","v":""},{"$f":"IF('Önc. Alan Sonuç'!F21=\"\",\"\",'Önc. Alan Sonuç'!F21)","v":""},{"$f":"IF('Önc. Alan Sonuç'!G21=\"\",\"\",'Önc. Alan Sonuç'!G21)","v":""},{"$f":"IF('Önc. Alan Sonuç'!H21=\"\",\"\",'Önc. Alan Sonuç'!H21)","v":""},{"$f":"IF('Önc. Alan Sonuç'!I21=\"\",\"\",'Önc. Alan Sonuç'!I21)","v":""},{"$f":"IF('Önc. Alan Sonuç'!J21=\"\",\"\",'Önc. Alan Sonuç'!J21)","v":""},{"$f":"IF('Önc. Alan Sonuç'!K21=\"\",\"\",'Önc. Alan Sonuç'!K21)","v":""},{"$f":"IF('Önc. Alan Sonuç'!L21=\"\",\"\",'Önc. Alan Sonuç'!L21)","v":""},{"$f":"IF('Önc. Alan Sonuç'!M21=\"\",\"\",'Önc. Alan Sonuç'!M21)","v":""},{"$f":"IF('Önc. Alan Sonuç'!N21=\"\",\"\",'Önc. Alan Sonuç'!N21)","v":""}]
[{"$f":"IF('Önc. Alan Sonuç'!A22=\"\",\"\",'Önc. Alan Sonuç'!A22)","v":""},{"$f":"IF('Önc. Alan Sonuç'!B22=\"\",\"\",LEFT('Önc. Alan Sonuç'!B22,3)&REPT(\"*\",4)&RIGHT('Önc. Alan Sonuç'!B22,2))","v":""},{"$f":"IF('Önc. Alan Sonuç'!C22=\"\",\"\",IF(ISERR(FIND(\" \",'Önc. Alan Sonuç'!C22))=TRUE,LEFT('Önc. Alan Sonuç'!C22,2)&REPT(\"*\",3),LEFT('Önc. Alan Sonuç'!C22,2)&REPT(\"*\",3)&\" \"&MID('Önc. Alan Sonuç'!C22,FIND(\" \",'Önc. Alan Sonuç'!C22)+1,2)&REPT(\"*\",3)))","v":""},{"$f":"IF('Önc. Alan Sonuç'!D22=\"\",\"\",IF(ISERR(FIND(\" \",'Önc. Alan Sonuç'!D22))=TRUE,LEFT('Önc. Alan Sonuç'!D22,2)&REPT(\"*\",3),LEFT('Önc. Alan Sonuç'!D22,2)&REPT(\"*\",3)&\" \"&MID('Önc. Alan Sonuç'!D22,FIND(\" \",'Önc. Alan Sonuç'!D22)+1,2)&REPT(\"*\",3)))","v":""},{"$f":"IF('Önc. Alan Sonuç'!E22=\"\",\"\",'Önc. Alan Sonuç'!E22)","v":""},{"$f":"IF('Önc. Alan Sonuç'!F22=\"\",\"\",'Önc. Alan Sonuç'!F22)","v":""},{"$f":"IF('Önc. Alan Sonuç'!G22=\"\",\"\",'Önc. Alan Sonuç'!G22)","v":""},{"$f":"IF('Önc. Alan Sonuç'!H22=\"\",\"\",'Önc. Alan Sonuç'!H22)","v":""},{"$f":"IF('Önc. Alan Sonuç'!I22=\"\",\"\",'Önc. Alan Sonuç'!I22)","v":""},{"$f":"IF('Önc. Alan Sonuç'!J22=\"\",\"\",'Önc. Alan Sonuç'!J22)","v":""},{"$f":"IF('Önc. Alan Sonuç'!K22=\"\",\"\",'Önc. Alan Sonuç'!K22)","v":""},{"$f":"IF('Önc. Alan Sonuç'!L22=\"\",\"\",'Önc. Alan Sonuç'!L22)","v":""},{"$f":"IF('Önc. Alan Sonuç'!M22=\"\",\"\",'Önc. Alan Sonuç'!M22)","v":""},{"$f":"IF('Önc. Alan Sonuç'!N22=\"\",\"\",'Önc. Alan Sonuç'!N22)","v":""}]
[{"$f":"IF('Önc. Alan Sonuç'!A23=\"\",\"\",'Önc. Alan Sonuç'!A23)","v":""},{"$f":"IF('Önc. Alan Sonuç'!B23=\"\",\"\",LEFT('Önc. Alan Sonuç'!B23,3)&REPT(\"*\",4)&RIGHT('Önc. Alan Sonuç'!B23,2))","v":""},{"$f":"IF('Önc. Alan Sonuç'!C23=\"\",\"\",IF(ISERR(FIND(\" \",'Önc. Alan Sonuç'!C23))=TRUE,LEFT('Önc. Alan Sonuç'!C23,2)&REPT(\"*\",3),LEFT('Önc. Alan Sonuç'!C23,2)&REPT(\"*\",3)&\" \"&MID('Önc. Alan Sonuç'!C23,FIND(\" \",'Önc. Alan Sonuç'!C23)+1,2)&REPT(\"*\",3)))","v":""},{"$f":"IF('Önc. Alan Sonuç'!D23=\"\",\"\",IF(ISERR(FIND(\" \",'Önc. Alan Sonuç'!D23))=TRUE,LEFT('Önc. Alan Sonuç'!D23,2)&REPT(\"*\",3),LEFT('Önc. Alan Sonuç'!D23,2)&REPT(\"*\",3)&\" \"&MID('Önc. Alan Sonuç'!D23,FIND(\" \",'Önc. Alan Sonuç'!D23)+1,2)&REPT(\"*\",3)))","v":""},{"$f":"IF('Önc. Alan Sonuç'!E23=\"\",\"\",'Önc. Alan Sonuç'!E23)","v":""},{"$f":"IF('Önc. Alan Sonuç'!F23=\"\",\"\",'Önc. Alan Sonuç'!F23)","v":""},{"$f":"IF('Önc. Alan Sonuç'!G23=\"\",\"\",'Önc. Alan Sonuç'!G23)","v":""},{"$f":"IF('Önc. Alan Sonuç'!H23=\"\",\"\",'Önc. Alan Sonuç'!H23)","v":""},{"$f":"IF('Önc. Alan Sonuç'!I23=\"\",\"\",'Önc. Alan Sonuç'!I23)","v":""},{"$f":"IF('Önc. Alan Sonuç'!J23=\"\",\"\",'Önc. Alan Sonuç'!J23)","v":""},{"$f":"IF('Önc. Alan Sonuç'!K23=\"\",\"\",'Önc. Alan Sonuç'!K23)","v":""},{"$f":"IF('Önc. Alan Sonuç'!L23=\"\",\"\",'Önc. Alan Sonuç'!L23)","v":""},{"$f":"IF('Önc. Alan Sonuç'!M23=\"\",\"\",'Önc. Alan Sonuç'!M23)","v":""},{"$f":"IF('Önc. Alan Sonuç'!N23=\"\",\"\",'Önc. Alan Sonuç'!N23)","v":""}]
[{"$f":"IF('Önc. Alan Sonuç'!A24=\"\",\"\",'Önc. Alan Sonuç'!A24)","v":""},{"$f":"IF('Önc. Alan Sonuç'!B24=\"\",\"\",LEFT('Önc. Alan Sonuç'!B24,3)&REPT(\"*\",4)&RIGHT('Önc. Alan Sonuç'!B24,2))","v":""},{"$f":"IF('Önc. Alan Sonuç'!C24=\"\",\"\",IF(ISERR(FIND(\" \",'Önc. Alan Sonuç'!C24))=TRUE,LEFT('Önc. Alan Sonuç'!C24,2)&REPT(\"*\",3),LEFT('Önc. Alan Sonuç'!C24,2)&REPT(\"*\",3)&\" \"&MID('Önc. Alan Sonuç'!C24,FIND(\" \",'Önc. Alan Sonuç'!C24)+1,2)&REPT(\"*\",3)))","v":""},{"$f":"IF('Önc. Alan Sonuç'!D24=\"\",\"\",IF(ISERR(FIND(\" \",'Önc. Alan Sonuç'!D24))=TRUE,LEFT('Önc. Alan Sonuç'!D24,2)&REPT(\"*\",3),LEFT('Önc. Alan Sonuç'!D24,2)&REPT(\"*\",3)&\" \"&MID('Önc. Alan Sonuç'!D24,FIND(\" \",'Önc. Alan Sonuç'!D24)+1,2)&REPT(\"*\",3)))","v":""},{"$f":"IF('Önc. Alan Sonuç'!E24=\"\",\"\",'Önc. Alan Sonuç'!E24)","v":""},{"$f":"IF('Önc. Alan Sonuç'!F24=\"\",\"\",'Önc. Alan Sonuç'!F24)","v":""},{"$f":"IF('Önc. Alan Sonuç'!G24=\"\",\"\",'Önc. Alan Sonuç'!G24)","v":""},{"$f":"IF('Önc. Alan Sonuç'!H24=\"\",\"\",'Önc. Alan Sonuç'!H24)","v":""},{"$f":"IF('Önc. Alan Sonuç'!I24=\"\",\"\",'Önc. Alan Sonuç'!I24)","v":""},{"$f":"IF('Önc. Alan Sonuç'!J24=\"\",\"\",'Önc. Alan Sonuç'!J24)","v":""},{"$f":"IF('Önc. Alan Sonuç'!K24=\"\",\"\",'Önc. Alan Sonuç'!K24)","v":""},{"$f":"IF('Önc. Alan Sonuç'!L24=\"\",\"\",'Önc. Alan Sonuç'!L24)","v":""},{"$f":"IF('Önc. Alan Sonuç'!M24=\"\",\"\",'Önc. Alan Sonuç'!M24)","v":""},{"$f":"IF('Önc. Alan Sonuç'!N24=\"\",\"\",'Önc. Alan Sonuç'!N24)","v":""}]
[{"$f":"IF('Önc. Alan Sonuç'!A25=\"\",\"\",'Önc. Alan Sonuç'!A25)","v":""},{"$f":"IF('Önc. Alan Sonuç'!B25=\"\",\"\",LEFT('Önc. Alan Sonuç'!B25,3)&REPT(\"*\",4)&RIGHT('Önc. Alan Sonuç'!B25,2))","v":""},{"$f":"IF('Önc. Alan Sonuç'!C25=\"\",\"\",IF(ISERR(FIND(\" \",'Önc. Alan Sonuç'!C25))=TRUE,LEFT('Önc. Alan Sonuç'!C25,2)&REPT(\"*\",3),LEFT('Önc. Alan Sonuç'!C25,2)&REPT(\"*\",3)&\" \"&MID('Önc. Alan Sonuç'!C25,FIND(\" \",'Önc. Alan Sonuç'!C25)+1,2)&REPT(\"*\",3)))","v":""},{"$f":"IF('Önc. Alan Sonuç'!D25=\"\",\"\",IF(ISERR(FIND(\" \",'Önc. Alan Sonuç'!D25))=TRUE,LEFT('Önc. Alan Sonuç'!D25,2)&REPT(\"*\",3),LEFT('Önc. Alan Sonuç'!D25,2)&REPT(\"*\",3)&\" \"&MID('Önc. Alan Sonuç'!D25,FIND(\" \",'Önc. Alan Sonuç'!D25)+1,2)&REPT(\"*\",3)))","v":""},{"$f":"IF('Önc. Alan Sonuç'!E25=\"\",\"\",'Önc. Alan Sonuç'!E25)","v":""},{"$f":"IF('Önc. Alan Sonuç'!F25=\"\",\"\",'Önc. Alan Sonuç'!F25)","v":""},{"$f":"IF('Önc. Alan Sonuç'!G25=\"\",\"\",'Önc. Alan Sonuç'!G25)","v":""},{"$f":"IF('Önc. Alan Sonuç'!H25=\"\",\"\",'Önc. Alan Sonuç'!H25)","v":""},{"$f":"IF('Önc. Alan Sonuç'!I25=\"\",\"\",'Önc. Alan Sonuç'!I25)","v":""},{"$f":"IF('Önc. Alan Sonuç'!J25=\"\",\"\",'Önc. Alan Sonuç'!J25)","v":""},{"$f":"IF('Önc. Alan Sonuç'!K25=\"\",\"\",'Önc. Alan Sonuç'!K25)","v":""},{"$f":"IF('Önc. Alan Sonuç'!L25=\"\",\"\",'Önc. Alan Sonuç'!L25)","v":""},{"$f":"IF('Önc. Alan Sonuç'!M25=\"\",\"\",'Önc. Alan Sonuç'!M25)","v":""},{"$f":"IF('Önc. Alan Sonuç'!N25=\"\",\"\",'Önc. Alan Sonuç'!N25)","v":""}]
[{"$f":"IF('Önc. Alan Sonuç'!A26=\"\",\"\",'Önc. Alan Sonuç'!A26)","v":""},{"$f":"IF('Önc. Alan Sonuç'!B26=\"\",\"\",LEFT('Önc. Alan Sonuç'!B26,3)&REPT(\"*\",4)&RIGHT('Önc. Alan Sonuç'!B26,2))","v":""},{"$f":"IF('Önc. Alan Sonuç'!C26=\"\",\"\",IF(ISERR(FIND(\" \",'Önc. Alan Sonuç'!C26))=TRUE,LEFT('Önc. Alan Sonuç'!C26,2)&REPT(\"*\",3),LEFT('Önc. Alan Sonuç'!C26,2)&REPT(\"*\",3)&\" \"&MID('Önc. Alan Sonuç'!C26,FIND(\" \",'Önc. Alan Sonuç'!C26)+1,2)&REPT(\"*\",3)))","v":""},{"$f":"IF('Önc. Alan Sonuç'!D26=\"\",\"\",IF(ISERR(FIND(\" \",'Önc. Alan Sonuç'!D26))=TRUE,LEFT('Önc. Alan Sonuç'!D26,2)&REPT(\"*\",3),LEFT('Önc. Alan Sonuç'!D26,2)&REPT(\"*\",3)&\" \"&MID('Önc. Alan Sonuç'!D26,FIND(\" \",'Önc. Alan Sonuç'!D26)+1,2)&REPT(\"*\",3)))","v":""},{"$f":"IF('Önc. Alan Sonuç'!E26=\"\",\"\",'Önc. Alan Sonuç'!E26)","v":""},{"$f":"IF('Önc. Alan Sonuç'!F26=\"\",\"\",'Önc. Alan Sonuç'!F26)","v":""},{"$f":"IF('Önc. Alan Sonuç'!G26=\"\",\"\",'Önc. Alan Sonuç'!G26)","v":""},{"$f":"IF('Önc. Alan Sonuç'!H26=\"\",\"\",'Önc. Alan Sonuç'!H26)","v":""},{"$f":"IF('Önc. Alan Sonuç'!I26=\"\",\"\",'Önc. Alan Sonuç'!I26)","v":""},{"$f":"IF('Önc. Alan Sonuç'!J26=\"\",\"\",'Önc. Alan Sonuç'!J26)","v":""},{"$f":"IF('Önc. Alan Sonuç'!K26=\"\",\"\",'Önc. Alan Sonuç'!K26)","v":""},{"$f":"IF('Önc. Alan Sonuç'!L26=\"\",\"\",'Önc. Alan Sonuç'!L26)","v":""},{"$f":"IF('Önc. Alan Sonuç'!M26=\"\",\"\",'Önc. Alan Sonuç'!M26)","v":""},{"$f":"IF('Önc. Alan Sonuç'!N26=\"\",\"\",'Önc. Alan Sonuç'!N26)","v":""}]
[{"$f":"IF('Önc. Alan Sonuç'!A27=\"\",\"\",'Önc. Alan Sonuç'!A27)","v":""},{"$f":"IF('Önc. Alan Sonuç'!B27=\"\",\"\",LEFT('Önc. Alan Sonuç'!B27,3)&REPT(\"*\",4)&RIGHT('Önc. Alan Sonuç'!B27,2))","v":""},{"$f":"IF('Önc. Alan Sonuç'!C27=\"\",\"\",IF(ISERR(FIND(\" \",'Önc. Alan Sonuç'!C27))=TRUE,LEFT('Önc. Alan Sonuç'!C27,2)&REPT(\"*\",3),LEFT('Önc. Alan Sonuç'!C27,2)&REPT(\"*\",3)&\" \"&MID('Önc. Alan Sonuç'!C27,FIND(\" \",'Önc. Alan Sonuç'!C27)+1,2)&REPT(\"*\",3)))","v":""},{"$f":"IF('Önc. Alan Sonuç'!D27=\"\",\"\",IF(ISERR(FIND(\" \",'Önc. Alan Sonuç'!D27))=TRUE,LEFT('Önc. Alan Sonuç'!D27,2)&REPT(\"*\",3),LEFT('Önc. Alan Sonuç'!D27,2)&REPT(\"*\",3)&\" \"&MID('Önc. Alan Sonuç'!D27,FIND(\" \",'Önc. Alan Sonuç'!D27)+1,2)&REPT(\"*\",3)))","v":""},{"$f":"IF('Önc. Alan Sonuç'!E27=\"\",\"\",'Önc. Alan Sonuç'!E27)","v":""},{"$f":"IF('Önc. Alan Sonuç'!F27=\"\",\"\",'Önc. Alan Sonuç'!F27)","v":""},{"$f":"IF('Önc. Alan Sonuç'!G27=\"\",\"\",'Önc. Alan Sonuç'!G27)","v":""},{"$f":"IF('Önc. Alan Sonuç'!H27=\"\",\"\",'Önc. Alan Sonuç'!H27)","v":""},{"$f":"IF('Önc. Alan Sonuç'!I27=\"\",\"\",'Önc. Alan Sonuç'!I27)","v":""},{"$f":"IF('Önc. Alan Sonuç'!J27=\"\",\"\",'Önc. Alan Sonuç'!J27)","v":""},{"$f":"IF('Önc. Alan Sonuç'!K27=\"\",\"\",'Önc. Alan Sonuç'!K27)","v":""},{"$f":"IF('Önc. Alan Sonuç'!L27=\"\",\"\",'Önc. Alan Sonuç'!L27)","v":""},{"$f":"IF('Önc. Alan Sonuç'!M27=\"\",\"\",'Önc. Alan Sonuç'!M27)","v":""},{"$f":"IF('Önc. Alan Sonuç'!N27=\"\",\"\",'Önc. Alan Sonuç'!N27)","v":""}]
[{"$f":"IF('Önc. Alan Sonuç'!A28=\"\",\"\",'Önc. Alan Sonuç'!A28)","v":""},{"$f":"IF('Önc. Alan Sonuç'!B28=\"\",\"\",LEFT('Önc. Alan Sonuç'!B28,3)&REPT(\"*\",4)&RIGHT('Önc. Alan Sonuç'!B28,2))","v":""},{"$f":"IF('Önc. Alan Sonuç'!C28=\"\",\"\",IF(ISERR(FIND(\" \",'Önc. Alan Sonuç'!C28))=TRUE,LEFT('Önc. Alan Sonuç'!C28,2)&REPT(\"*\",3),LEFT('Önc. Alan Sonuç'!C28,2)&REPT(\"*\",3)&\" \"&MID('Önc. Alan Sonuç'!C28,FIND(\" \",'Önc. Alan Sonuç'!C28)+1,2)&REPT(\"*\",3)))","v":""},{"$f":"IF('Önc. Alan Sonuç'!D28=\"\",\"\",IF(ISERR(FIND(\" \",'Önc. Alan Sonuç'!D28))=TRUE,LEFT('Önc. Alan Sonuç'!D28,2)&REPT(\"*\",3),LEFT('Önc. Alan Sonuç'!D28,2)&REPT(\"*\",3)&\" \"&MID('Önc. Alan Sonuç'!D28,FIND(\" \",'Önc. Alan Sonuç'!D28)+1,2)&REPT(\"*\",3)))","v":""},{"$f":"IF('Önc. Alan Sonuç'!E28=\"\",\"\",'Önc. Alan Sonuç'!E28)","v":""},{"$f":"IF('Önc. Alan Sonuç'!F28=\"\",\"\",'Önc. Alan Sonuç'!F28)","v":""},{"$f":"IF('Önc. Alan Sonuç'!G28=\"\",\"\",'Önc. Alan Sonuç'!G28)","v":""},{"$f":"IF('Önc. Alan Sonuç'!H28=\"\",\"\",'Önc. Alan Sonuç'!H28)","v":""},{"$f":"IF('Önc. Alan Sonuç'!I28=\"\",\"\",'Önc. Alan Sonuç'!I28)","v":""},{"$f":"IF('Önc. Alan Sonuç'!J28=\"\",\"\",'Önc. Alan Sonuç'!J28)","v":""},{"$f":"IF('Önc. Alan Sonuç'!K28=\"\",\"\",'Önc. Alan Sonuç'!K28)","v":""},{"$f":"IF('Önc. Alan Sonuç'!L28=\"\",\"\",'Önc. Alan Sonuç'!L28)","v":""},{"$f":"IF('Önc. Alan Sonuç'!M28=\"\",\"\",'Önc. Alan Sonuç'!M28)","v":""},{"$f":"IF('Önc. Alan Sonuç'!N28=\"\",\"\",'Önc. Alan Sonuç'!N28)","v":""}]
[{"$f":"IF('Önc. Alan Sonuç'!A29=\"\",\"\",'Önc. Alan Sonuç'!A29)","v":""},{"$f":"IF('Önc. Alan Sonuç'!B29=\"\",\"\",LEFT('Önc. Alan Sonuç'!B29,3)&REPT(\"*\",4)&RIGHT('Önc. Alan Sonuç'!B29,2))","v":""},{"$f":"IF('Önc. Alan Sonuç'!C29=\"\",\"\",IF(ISERR(FIND(\" \",'Önc. Alan Sonuç'!C29))=TRUE,LEFT('Önc. Alan Sonuç'!C29,2)&REPT(\"*\",3),LEFT('Önc. Alan Sonuç'!C29,2)&REPT(\"*\",3)&\" \"&MID('Önc. Alan Sonuç'!C29,FIND(\" \",'Önc. Alan Sonuç'!C29)+1,2)&REPT(\"*\",3)))","v":""},{"$f":"IF('Önc. Alan Sonuç'!D29=\"\",\"\",IF(ISERR(FIND(\" \",'Önc. Alan Sonuç'!D29))=TRUE,LEFT('Önc. Alan Sonuç'!D29,2)&REPT(\"*\",3),LEFT('Önc. Alan Sonuç'!D29,2)&REPT(\"*\",3)&\" \"&MID('Önc. Alan Sonuç'!D29,FIND(\" \",'Önc. Alan Sonuç'!D29)+1,2)&REPT(\"*\",3)))","v":""},{"$f":"IF('Önc. Alan Sonuç'!E29=\"\",\"\",'Önc. Alan Sonuç'!E29)","v":""},{"$f":"IF('Önc. Alan Sonuç'!F29=\"\",\"\",'Önc. Alan Sonuç'!F29)","v":""},{"$f":"IF('Önc. Alan Sonuç'!G29=\"\",\"\",'Önc. Alan Sonuç'!G29)","v":""},{"$f":"IF('Önc. Alan Sonuç'!H29=\"\",\"\",'Önc. Alan Sonuç'!H29)","v":""},{"$f":"IF('Önc. Alan Sonuç'!I29=\"\",\"\",'Önc. Alan Sonuç'!I29)","v":""},{"$f":"IF('Önc. Alan Sonuç'!J29=\"\",\"\",'Önc. Alan Sonuç'!J29)","v":""},{"$f":"IF('Önc. Alan Sonuç'!K29=\"\",\"\",'Önc. Alan Sonuç'!K29)","v":""},{"$f":"IF('Önc. Alan Sonuç'!L29=\"\",\"\",'Önc. Alan Sonuç'!L29)","v":""},{"$f":"IF('Önc. Alan Sonuç'!M29=\"\",\"\",'Önc. Alan Sonuç'!M29)","v":""},{"$f":"IF('Önc. Alan Sonuç'!N29=\"\",\"\",'Önc. Alan Sonuç'!N29)","v":""}]
[{"$f":"IF('Önc. Alan Sonuç'!A30=\"\",\"\",'Önc. Alan Sonuç'!A30)","v":""},{"$f":"IF('Önc. Alan Sonuç'!B30=\"\",\"\",LEFT('Önc. Alan Sonuç'!B30,3)&REPT(\"*\",4)&RIGHT('Önc. Alan Sonuç'!B30,2))","v":""},{"$f":"IF('Önc. Alan Sonuç'!C30=\"\",\"\",IF(ISERR(FIND(\" \",'Önc. Alan Sonuç'!C30))=TRUE,LEFT('Önc. Alan Sonuç'!C30,2)&REPT(\"*\",3),LEFT('Önc. Alan Sonuç'!C30,2)&REPT(\"*\",3)&\" \"&MID('Önc. Alan Sonuç'!C30,FIND(\" \",'Önc. Alan Sonuç'!C30)+1,2)&REPT(\"*\",3)))","v":""},{"$f":"IF('Önc. Alan Sonuç'!D30=\"\",\"\",IF(ISERR(FIND(\" \",'Önc. Alan Sonuç'!D30))=TRUE,LEFT('Önc. Alan Sonuç'!D30,2)&REPT(\"*\",3),LEFT('Önc. Alan Sonuç'!D30,2)&REPT(\"*\",3)&\" \"&MID('Önc. Alan Sonuç'!D30,FIND(\" \",'Önc. Alan Sonuç'!D30)+1,2)&REPT(\"*\",3)))","v":""},{"$f":"IF('Önc. Alan Sonuç'!E30=\"\",\"\",'Önc. Alan Sonuç'!E30)","v":""},{"$f":"IF('Önc. Alan Sonuç'!F30=\"\",\"\",'Önc. Alan Sonuç'!F30)","v":""},{"$f":"IF('Önc. Alan Sonuç'!G30=\"\",\"\",'Önc. Alan Sonuç'!G30)","v":""},{"$f":"IF('Önc. Alan Sonuç'!H30=\"\",\"\",'Önc. Alan Sonuç'!H30)","v":""},{"$f":"IF('Önc. Alan Sonuç'!I30=\"\",\"\",'Önc. Alan Sonuç'!I30)","v":""},{"$f":"IF('Önc. Alan Sonuç'!J30=\"\",\"\",'Önc. Alan Sonuç'!J30)","v":""},{"$f":"IF('Önc. Alan Sonuç'!K30=\"\",\"\",'Önc. Alan Sonuç'!K30)","v":""},{"$f":"IF('Önc. Alan Sonuç'!L30=\"\",\"\",'Önc. Alan Sonuç'!L30)","v":""},{"$f":"IF('Önc. Alan Sonuç'!M30=\"\",\"\",'Önc. Alan Sonuç'!M30)","v":""},{"$f":"IF('Önc. Alan Sonuç'!N30=\"\",\"\",'Önc. Alan Sonuç'!N30)","v":""}]
[{"$f":"IF('Önc. Alan Sonuç'!A31=\"\",\"\",'Önc. Alan Sonuç'!A31)","v":""},{"$f":"IF('Önc. Alan Sonuç'!B31=\"\",\"\",LEFT('Önc. Alan Sonuç'!B31,3)&REPT(\"*\",4)&RIGHT('Önc. Alan Sonuç'!B31,2))","v":""},{"$f":"IF('Önc. Alan Sonuç'!C31=\"\",\"\",IF(ISERR(FIND(\" \",'Önc. Alan Sonuç'!C31))=TRUE,LEFT('Önc. Alan Sonuç'!C31,2)&REPT(\"*\",3),LEFT('Önc. Alan Sonuç'!C31,2)&REPT(\"*\",3)&\" \"&MID('Önc. Alan Sonuç'!C31,FIND(\" \",'Önc. Alan Sonuç'!C31)+1,2)&REPT(\"*\",3)))","v":""},{"$f":"IF('Önc. Alan Sonuç'!D31=\"\",\"\",IF(ISERR(FIND(\" \",'Önc. Alan Sonuç'!D31))=TRUE,LEFT('Önc. Alan Sonuç'!D31,2)&REPT(\"*\",3),LEFT('Önc. Alan Sonuç'!D31,2)&REPT(\"*\",3)&\" \"&MID('Önc. Alan Sonuç'!D31,FIND(\" \",'Önc. Alan Sonuç'!D31)+1,2)&REPT(\"*\",3)))","v":""},{"$f":"IF('Önc. Alan Sonuç'!E31=\"\",\"\",'Önc. Alan Sonuç'!E31)","v":""},{"$f":"IF('Önc. Alan Sonuç'!F31=\"\",\"\",'Önc. Alan Sonuç'!F31)","v":""},{"$f":"IF('Önc. Alan Sonuç'!G31=\"\",\"\",'Önc. Alan Sonuç'!G31)","v":""},{"$f":"IF('Önc. Alan Sonuç'!H31=\"\",\"\",'Önc. Alan Sonuç'!H31)","v":""},{"$f":"IF('Önc. Alan Sonuç'!I31=\"\",\"\",'Önc. Alan Sonuç'!I31)","v":""},{"$f":"IF('Önc. Alan Sonuç'!J31=\"\",\"\",'Önc. Alan Sonuç'!J31)","v":""},{"$f":"IF('Önc. Alan Sonuç'!K31=\"\",\"\",'Önc. Alan Sonuç'!K31)","v":""},{"$f":"IF('Önc. Alan Sonuç'!L31=\"\",\"\",'Önc. Alan Sonuç'!L31)","v":""},{"$f":"IF('Önc. Alan Sonuç'!M31=\"\",\"\",'Önc. Alan Sonuç'!M31)","v":""},{"$f":"IF('Önc. Alan Sonuç'!N31=\"\",\"\",'Önc. Alan Sonuç'!N31)","v":""}]
[{"$f":"IF('Önc. Alan Sonuç'!A32=\"\",\"\",'Önc. Alan Sonuç'!A32)","v":""},{"$f":"IF('Önc. Alan Sonuç'!B32=\"\",\"\",LEFT('Önc. Alan Sonuç'!B32,3)&REPT(\"*\",4)&RIGHT('Önc. Alan Sonuç'!B32,2))","v":""},{"$f":"IF('Önc. Alan Sonuç'!C32=\"\",\"\",IF(ISERR(FIND(\" \",'Önc. Alan Sonuç'!C32))=TRUE,LEFT('Önc. Alan Sonuç'!C32,2)&REPT(\"*\",3),LEFT('Önc. Alan Sonuç'!C32,2)&REPT(\"*\",3)&\" \"&MID('Önc. Alan Sonuç'!C32,FIND(\" \",'Önc. Alan Sonuç'!C32)+1,2)&REPT(\"*\",3)))","v":""},{"$f":"IF('Önc. Alan Sonuç'!D32=\"\",\"\",IF(ISERR(FIND(\" \",'Önc. Alan Sonuç'!D32))=TRUE,LEFT('Önc. Alan Sonuç'!D32,2)&REPT(\"*\",3),LEFT('Önc. Alan Sonuç'!D32,2)&REPT(\"*\",3)&\" \"&MID('Önc. Alan Sonuç'!D32,FIND(\" \",'Önc. Alan Sonuç'!D32)+1,2)&REPT(\"*\",3)))","v":""},{"$f":"IF('Önc. Alan Sonuç'!E32=\"\",\"\",'Önc. Alan Sonuç'!E32)","v":""},{"$f":"IF('Önc. Alan Sonuç'!F32=\"\",\"\",'Önc. Alan Sonuç'!F32)","v":""},{"$f":"IF('Önc. Alan Sonuç'!G32=\"\",\"\",'Önc. Alan Sonuç'!G32)","v":""},{"$f":"IF('Önc. Alan Sonuç'!H32=\"\",\"\",'Önc. Alan Sonuç'!H32)","v":""},{"$f":"IF('Önc. Alan Sonuç'!I32=\"\",\"\",'Önc. Alan Sonuç'!I32)","v":""},{"$f":"IF('Önc. Alan Sonuç'!J32=\"\",\"\",'Önc. Alan Sonuç'!J32)","v":""},{"$f":"IF('Önc. Alan Sonuç'!K32=\"\",\"\",'Önc. Alan Sonuç'!K32)","v":""},{"$f":"IF('Önc. Alan Sonuç'!L32=\"\",\"\",'Önc. Alan Sonuç'!L32)","v":""},{"$f":"IF('Önc. Alan Sonuç'!M32=\"\",\"\",'Önc. Alan Sonuç'!M32)","v":""},{"$f":"IF('Önc. Alan Sonuç'!N32=\"\",\"\",'Önc. Alan Sonuç'!N32)","v":""}]
[{"$f":"IF('Önc. Alan Sonuç'!A33=\"\",\"\",'Önc. Alan Sonuç'!A33)","v":""},{"$f":"IF('Önc. Alan Sonuç'!B33=\"\",\"\",LEFT('Önc. Alan Sonuç'!B33,3)&REPT(\"*\",4)&RIGHT('Önc. Alan Sonuç'!B33,2))","v":""},{"$f":"IF('Önc. Alan Sonuç'!C33=\"\",\"\",IF(ISERR(FIND(\" \",'Önc. Alan Sonuç'!C33))=TRUE,LEFT('Önc. Alan Sonuç'!C33,2)&REPT(\"*\",3),LEFT('Önc. Alan Sonuç'!C33,2)&REPT(\"*\",3)&\" \"&MID('Önc. Alan Sonuç'!C33,FIND(\" \",'Önc. Alan Sonuç'!C33)+1,2)&REPT(\"*\",3)))","v":""},{"$f":"IF('Önc. Alan Sonuç'!D33=\"\",\"\",IF(ISERR(FIND(\" \",'Önc. Alan Sonuç'!D33))=TRUE,LEFT('Önc. Alan Sonuç'!D33,2)&REPT(\"*\",3),LEFT('Önc. Alan Sonuç'!D33,2)&REPT(\"*\",3)&\" \"&MID('Önc. Alan Sonuç'!D33,FIND(\" \",'Önc. Alan Sonuç'!D33)+1,2)&REPT(\"*\",3)))","v":""},{"$f":"IF('Önc. Alan Sonuç'!E33=\"\",\"\",'Önc. Alan Sonuç'!E33)","v":""},{"$f":"IF('Önc. Alan Sonuç'!F33=\"\",\"\",'Önc. Alan Sonuç'!F33)","v":""},{"$f":"IF('Önc. Alan Sonuç'!G33=\"\",\"\",'Önc. Alan Sonuç'!G33)","v":""},{"$f":"IF('Önc. Alan Sonuç'!H33=\"\",\"\",'Önc. Alan Sonuç'!H33)","v":""},{"$f":"IF('Önc. Alan Sonuç'!I33=\"\",\"\",'Önc. Alan Sonuç'!I33)","v":""},{"$f":"IF('Önc. Alan Sonuç'!J33=\"\",\"\",'Önc. Alan Sonuç'!J33)","v":""},{"$f":"IF('Önc. Alan Sonuç'!K33=\"\",\"\",'Önc. Alan Sonuç'!K33)","v":""},{"$f":"IF('Önc. Alan Sonuç'!L33=\"\",\"\",'Önc. Alan Sonuç'!L33)","v":""},{"$f":"IF('Önc. Alan Sonuç'!M33=\"\",\"\",'Önc. Alan Sonuç'!M33)","v":""},{"$f":"IF('Önc. Alan Sonuç'!N33=\"\",\"\",'Önc. Alan Sonuç'!N33)","v":""}]
[{"$f":"IF('Önc. Alan Sonuç'!A34=\"\",\"\",'Önc. Alan Sonuç'!A34)","v":""},{"$f":"IF('Önc. Alan Sonuç'!B34=\"\",\"\",LEFT('Önc. Alan Sonuç'!B34,3)&REPT(\"*\",4)&RIGHT('Önc. Alan Sonuç'!B34,2))","v":""},{"$f":"IF('Önc. Alan Sonuç'!C34=\"\",\"\",IF(ISERR(FIND(\" \",'Önc. Alan Sonuç'!C34))=TRUE,LEFT('Önc. Alan Sonuç'!C34,2)&REPT(\"*\",3),LEFT('Önc. Alan Sonuç'!C34,2)&REPT(\"*\",3)&\" \"&MID('Önc. Alan Sonuç'!C34,FIND(\" \",'Önc. Alan Sonuç'!C34)+1,2)&REPT(\"*\",3)))","v":""},{"$f":"IF('Önc. Alan Sonuç'!D34=\"\",\"\",IF(ISERR(FIND(\" \",'Önc. Alan Sonuç'!D34))=TRUE,LEFT('Önc. Alan Sonuç'!D34,2)&REPT(\"*\",3),LEFT('Önc. Alan Sonuç'!D34,2)&REPT(\"*\",3)&\" \"&MID('Önc. Alan Sonuç'!D34,FIND(\" \",'Önc. Alan Sonuç'!D34)+1,2)&REPT(\"*\",3)))","v":""},{"$f":"IF('Önc. Alan Sonuç'!E34=\"\",\"\",'Önc. Alan Sonuç'!E34)","v":""},{"$f":"IF('Önc. Alan Sonuç'!F34=\"\",\"\",'Önc. Alan Sonuç'!F34)","v":""},{"$f":"IF('Önc. Alan Sonuç'!G34=\"\",\"\",'Önc. Alan Sonuç'!G34)","v":""},{"$f":"IF('Önc. Alan Sonuç'!H34=\"\",\"\",'Önc. Alan Sonuç'!H34)","v":""},{"$f":"IF('Önc. Alan Sonuç'!I34=\"\",\"\",'Önc. Alan Sonuç'!I34)","v":""},{"$f":"IF('Önc. Alan Sonuç'!J34=\"\",\"\",'Önc. Alan Sonuç'!J34)","v":""},{"$f":"IF('Önc. Alan Sonuç'!K34=\"\",\"\",'Önc. Alan Sonuç'!K34)","v":""},{"$f":"IF('Önc. Alan Sonuç'!L34=\"\",\"\",'Önc. Alan Sonuç'!L34)","v":""},{"$f":"IF('Önc. Alan Sonuç'!M34=\"\",\"\",'Önc. Alan Sonuç'!M34)","v":""},{"$f":"IF('Önc. Alan Sonuç'!N34=\"\",\"\",'Önc. Alan Sonuç'!N34)","v":""}]
[{"$f":"IF('Önc. Alan Sonuç'!A35=\"\",\"\",'Önc. Alan Sonuç'!A35)","v":""},{"$f":"IF('Önc. Alan Sonuç'!B35=\"\",\"\",LEFT('Önc. Alan Sonuç'!B35,3)&REPT(\"*\",4)&RIGHT('Önc. Alan Sonuç'!B35,2))","v":""},{"$f":"IF('Önc. Alan Sonuç'!C35=\"\",\"\",IF(ISERR(FIND(\" \",'Önc. Alan Sonuç'!C35))=TRUE,LEFT('Önc. Alan Sonuç'!C35,2)&REPT(\"*\",3),LEFT('Önc. Alan Sonuç'!C35,2)&REPT(\"*\",3)&\" \"&MID('Önc. Alan Sonuç'!C35,FIND(\" \",'Önc. Alan Sonuç'!C35)+1,2)&REPT(\"*\",3)))","v":""},{"$f":"IF('Önc. Alan Sonuç'!D35=\"\",\"\",IF(ISERR(FIND(\" \",'Önc. Alan Sonuç'!D35))=TRUE,LEFT('Önc. Alan Sonuç'!D35,2)&REPT(\"*\",3),LEFT('Önc. Alan Sonuç'!D35,2)&REPT(\"*\",3)&\" \"&MID('Önc. Alan Sonuç'!D35,FIND(\" \",'Önc. Alan Sonuç'!D35)+1,2)&REPT(\"*\",3)))","v":""},{"$f":"IF('Önc. Alan Sonuç'!E35=\"\",\"\",'Önc. Alan Sonuç'!E35)","v":""},{"$f":"IF('Önc. Alan Sonuç'!F35=\"\",\"\",'Önc. Alan Sonuç'!F35)","v":""},{"$f":"IF('Önc. Alan Sonuç'!G35=\"\",\"\",'Önc. Alan Sonuç'!G35)","v":""},{"$f":"IF('Önc. Alan Sonuç'!H35=\"\",\"\",'Önc. Alan Sonuç'!H35)","v":""},{"$f":"IF('Önc. Alan Sonuç'!I35=\"\",\"\",'Önc. Alan Sonuç'!I35)","v":""},{"$f":"IF('Önc. Alan Sonuç'!J35=\"\",\"\",'Önc. Alan Sonuç'!J35)","v":""},{"$f":"IF('Önc. Alan Sonuç'!K35=\"\",\"\",'Önc. Alan Sonuç'!K35)","v":""},{"$f":"IF('Önc. Alan Sonuç'!L35=\"\",\"\",'Önc. Alan Sonuç'!L35)","v":""},{"$f":"IF('Önc. Alan Sonuç'!M35=\"\",\"\",'Önc. Alan Sonuç'!M35)","v":""},{"$f":"IF('Önc. Alan Sonuç'!N35=\"\",\"\",'Önc. Alan Sonuç'!N35)","v":""}]
[{"$f":"IF('Önc. Alan Sonuç'!A36=\"\",\"\",'Önc. Alan Sonuç'!A36)","v":""},{"$f":"IF('Önc. Alan Sonuç'!B36=\"\",\"\",LEFT('Önc. Alan Sonuç'!B36,3)&REPT(\"*\",4)&RIGHT('Önc. Alan Sonuç'!B36,2))","v":""},{"$f":"IF('Önc. Alan Sonuç'!C36=\"\",\"\",IF(ISERR(FIND(\" \",'Önc. Alan Sonuç'!C36))=TRUE,LEFT('Önc. Alan Sonuç'!C36,2)&REPT(\"*\",3),LEFT('Önc. Alan Sonuç'!C36,2)&REPT(\"*\",3)&\" \"&MID('Önc. Alan Sonuç'!C36,FIND(\" \",'Önc. Alan Sonuç'!C36)+1,2)&REPT(\"*\",3)))","v":""},{"$f":"IF('Önc. Alan Sonuç'!D36=\"\",\"\",IF(ISERR(FIND(\" \",'Önc. Alan Sonuç'!D36))=TRUE,LEFT('Önc. Alan Sonuç'!D36,2)&REPT(\"*\",3),LEFT('Önc. Alan Sonuç'!D36,2)&REPT(\"*\",3)&\" \"&MID('Önc. Alan Sonuç'!D36,FIND(\" \",'Önc. Alan Sonuç'!D36)+1,2)&REPT(\"*\",3)))","v":""},{"$f":"IF('Önc. Alan Sonuç'!E36=\"\",\"\",'Önc. Alan Sonuç'!E36)","v":""},{"$f":"IF('Önc. Alan Sonuç'!F36=\"\",\"\",'Önc. Alan Sonuç'!F36)","v":""},{"$f":"IF('Önc. Alan Sonuç'!G36=\"\",\"\",'Önc. Alan Sonuç'!G36)","v":""},{"$f":"IF('Önc. Alan Sonuç'!H36=\"\",\"\",'Önc. Alan Sonuç'!H36)","v":""},{"$f":"IF('Önc. Alan Sonuç'!I36=\"\",\"\",'Önc. Alan Sonuç'!I36)","v":""},{"$f":"IF('Önc. Alan Sonuç'!J36=\"\",\"\",'Önc. Alan Sonuç'!J36)","v":""},{"$f":"IF('Önc. Alan Sonuç'!K36=\"\",\"\",'Önc. Alan Sonuç'!K36)","v":""},{"$f":"IF('Önc. Alan Sonuç'!L36=\"\",\"\",'Önc. Alan Sonuç'!L36)","v":""},{"$f":"IF('Önc. Alan Sonuç'!M36=\"\",\"\",'Önc. Alan Sonuç'!M36)","v":""},{"$f":"IF('Önc. Alan Sonuç'!N36=\"\",\"\",'Önc. Alan Sonuç'!N36)","v":""}]
[{"$f":"IF('Önc. Alan Sonuç'!A37=\"\",\"\",'Önc. Alan Sonuç'!A37)","v":""},{"$f":"IF('Önc. Alan Sonuç'!B37=\"\",\"\",LEFT('Önc. Alan Sonuç'!B37,3)&REPT(\"*\",4)&RIGHT('Önc. Alan Sonuç'!B37,2))","v":""},{"$f":"IF('Önc. Alan Sonuç'!C37=\"\",\"\",IF(ISERR(FIND(\" \",'Önc. Alan Sonuç'!C37))=TRUE,LEFT('Önc. Alan Sonuç'!C37,2)&REPT(\"*\",3),LEFT('Önc. Alan Sonuç'!C37,2)&REPT(\"*\",3)&\" \"&MID('Önc. Alan Sonuç'!C37,FIND(\" \",'Önc. Alan Sonuç'!C37)+1,2)&REPT(\"*\",3)))","v":""},{"$f":"IF('Önc. Alan Sonuç'!D37=\"\",\"\",IF(ISERR(FIND(\" \",'Önc. Alan Sonuç'!D37))=TRUE,LEFT('Önc. Alan Sonuç'!D37,2)&REPT(\"*\",3),LEFT('Önc. Alan Sonuç'!D37,2)&REPT(\"*\",3)&\" \"&MID('Önc. Alan Sonuç'!D37,FIND(\" \",'Önc. Alan Sonuç'!D37)+1,2)&REPT(\"*\",3)))","v":""},{"$f":"IF('Önc. Alan Sonuç'!E37=\"\",\"\",'Önc. Alan Sonuç'!E37)","v":""},{"$f":"IF('Önc. Alan Sonuç'!F37=\"\",\"\",'Önc. Alan Sonuç'!F37)","v":""},{"$f":"IF('Önc. Alan Sonuç'!G37=\"\",\"\",'Önc. Alan Sonuç'!G37)","v":""},{"$f":"IF('Önc. Alan Sonuç'!H37=\"\",\"\",'Önc. Alan Sonuç'!H37)","v":""},{"$f":"IF('Önc. Alan Sonuç'!I37=\"\",\"\",'Önc. Alan Sonuç'!I37)","v":""},{"$f":"IF('Önc. Alan Sonuç'!J37=\"\",\"\",'Önc. Alan Sonuç'!J37)","v":""},{"$f":"IF('Önc. Alan Sonuç'!K37=\"\",\"\",'Önc. Alan Sonuç'!K37)","v":""},{"$f":"IF('Önc. Alan Sonuç'!L37=\"\",\"\",'Önc. Alan Sonuç'!L37)","v":""},{"$f":"IF('Önc. Alan Sonuç'!M37=\"\",\"\",'Önc. Alan Sonuç'!M37)","v":""},{"$f":"IF('Önc. Alan Sonuç'!N37=\"\",\"\",'Önc. Alan Sonuç'!N37)","v":""}]
[{"$f":"IF('Önc. Alan Sonuç'!A38=\"\",\"\",'Önc. Alan Sonuç'!A38)","v":""},{"$f":"IF('Önc. Alan Sonuç'!B38=\"\",\"\",LEFT('Önc. Alan Sonuç'!B38,3)&REPT(\"*\",4)&RIGHT('Önc. Alan Sonuç'!B38,2))","v":""},{"$f":"IF('Önc. Alan Sonuç'!C38=\"\",\"\",IF(ISERR(FIND(\" \",'Önc. Alan Sonuç'!C38))=TRUE,LEFT('Önc. Alan Sonuç'!C38,2)&REPT(\"*\",3),LEFT('Önc. Alan Sonuç'!C38,2)&REPT(\"*\",3)&\" \"&MID('Önc. Alan Sonuç'!C38,FIND(\" \",'Önc. Alan Sonuç'!C38)+1,2)&REPT(\"*\",3)))","v":""},{"$f":"IF('Önc. Alan Sonuç'!D38=\"\",\"\",IF(ISERR(FIND(\" \",'Önc. Alan Sonuç'!D38))=TRUE,LEFT('Önc. Alan Sonuç'!D38,2)&REPT(\"*\",3),LEFT('Önc. Alan Sonuç'!D38,2)&REPT(\"*\",3)&\" \"&MID('Önc. Alan Sonuç'!D38,FIND(\" \",'Önc. Alan Sonuç'!D38)+1,2)&REPT(\"*\",3)))","v":""},{"$f":"IF('Önc. Alan Sonuç'!E38=\"\",\"\",'Önc. Alan Sonuç'!E38)","v":""},{"$f":"IF('Önc. Alan Sonuç'!F38=\"\",\"\",'Önc. Alan Sonuç'!F38)","v":""},{"$f":"IF('Önc. Alan Sonuç'!G38=\"\",\"\",'Önc. Alan Sonuç'!G38)","v":""},{"$f":"IF('Önc. Alan Sonuç'!H38=\"\",\"\",'Önc. Alan Sonuç'!H38)","v":""},{"$f":"IF('Önc. Alan Sonuç'!I38=\"\",\"\",'Önc. Alan Sonuç'!I38)","v":""},{"$f":"IF('Önc. Alan Sonuç'!J38=\"\",\"\",'Önc. Alan Sonuç'!J38)","v":""},{"$f":"IF('Önc. Alan Sonuç'!K38=\"\",\"\",'Önc. Alan Sonuç'!K38)","v":""},{"$f":"IF('Önc. Alan Sonuç'!L38=\"\",\"\",'Önc. Alan Sonuç'!L38)","v":""},{"$f":"IF('Önc. Alan Sonuç'!M38=\"\",\"\",'Önc. Alan Sonuç'!M38)","v":""},{"$f":"IF('Önc. Alan Sonuç'!N38=\"\",\"\",'Önc. Alan Sonuç'!N38)","v":""}]
[{"$f":"IF('Önc. Alan Sonuç'!A39=\"\",\"\",'Önc. Alan Sonuç'!A39)","v":""},{"$f":"IF('Önc. Alan Sonuç'!B39=\"\",\"\",LEFT('Önc. Alan Sonuç'!B39,3)&REPT(\"*\",4)&RIGHT('Önc. Alan Sonuç'!B39,2))","v":""},{"$f":"IF('Önc. Alan Sonuç'!C39=\"\",\"\",IF(ISERR(FIND(\" \",'Önc. Alan Sonuç'!C39))=TRUE,LEFT('Önc. Alan Sonuç'!C39,2)&REPT(\"*\",3),LEFT('Önc. Alan Sonuç'!C39,2)&REPT(\"*\",3)&\" \"&MID('Önc. Alan Sonuç'!C39,FIND(\" \",'Önc. Alan Sonuç'!C39)+1,2)&REPT(\"*\",3)))","v":""},{"$f":"IF('Önc. Alan Sonuç'!D39=\"\",\"\",IF(ISERR(FIND(\" \",'Önc. Alan Sonuç'!D39))=TRUE,LEFT('Önc. Alan Sonuç'!D39,2)&REPT(\"*\",3),LEFT('Önc. Alan Sonuç'!D39,2)&REPT(\"*\",3)&\" \"&MID('Önc. Alan Sonuç'!D39,FIND(\" \",'Önc. Alan Sonuç'!D39)+1,2)&REPT(\"*\",3)))","v":""},{"$f":"IF('Önc. Alan Sonuç'!E39=\"\",\"\",'Önc. Alan Sonuç'!E39)","v":""},{"$f":"IF('Önc. Alan Sonuç'!F39=\"\",\"\",'Önc. Alan Sonuç'!F39)","v":""},{"$f":"IF('Önc. Alan Sonuç'!G39=\"\",\"\",'Önc. Alan Sonuç'!G39)","v":""},{"$f":"IF('Önc. Alan Sonuç'!H39=\"\",\"\",'Önc. Alan Sonuç'!H39)","v":""},{"$f":"IF('Önc. Alan Sonuç'!I39=\"\",\"\",'Önc. Alan Sonuç'!I39)","v":""},{"$f":"IF('Önc. Alan Sonuç'!J39=\"\",\"\",'Önc. Alan Sonuç'!J39)","v":""},{"$f":"IF('Önc. Alan Sonuç'!K39=\"\",\"\",'Önc. Alan Sonuç'!K39)","v":""},{"$f":"IF('Önc. Alan Sonuç'!L39=\"\",\"\",'Önc. Alan Sonuç'!L39)","v":""},{"$f":"IF('Önc. Alan Sonuç'!M39=\"\",\"\",'Önc. Alan Sonuç'!M39)","v":""},{"$f":"IF('Önc. Alan Sonuç'!N39=\"\",\"\",'Önc. Alan Sonuç'!N39)","v":""}]
[{"$f":"IF('Önc. Alan Sonuç'!A40=\"\",\"\",'Önc. Alan Sonuç'!A40)","v":""},{"$f":"IF('Önc. Alan Sonuç'!B40=\"\",\"\",LEFT('Önc. Alan Sonuç'!B40,3)&REPT(\"*\",4)&RIGHT('Önc. Alan Sonuç'!B40,2))","v":""},{"$f":"IF('Önc. Alan Sonuç'!C40=\"\",\"\",IF(ISERR(FIND(\" \",'Önc. Alan Sonuç'!C40))=TRUE,LEFT('Önc. Alan Sonuç'!C40,2)&REPT(\"*\",3),LEFT('Önc. Alan Sonuç'!C40,2)&REPT(\"*\",3)&\" \"&MID('Önc. Alan Sonuç'!C40,FIND(\" \",'Önc. Alan Sonuç'!C40)+1,2)&REPT(\"*\",3)))","v":""},{"$f":"IF('Önc. Alan Sonuç'!D40=\"\",\"\",IF(ISERR(FIND(\" \",'Önc. Alan Sonuç'!D40))=TRUE,LEFT('Önc. Alan Sonuç'!D40,2)&REPT(\"*\",3),LEFT('Önc. Alan Sonuç'!D40,2)&REPT(\"*\",3)&\" \"&MID('Önc. Alan Sonuç'!D40,FIND(\" \",'Önc. Alan Sonuç'!D40)+1,2)&REPT(\"*\",3)))","v":""},{"$f":"IF('Önc. Alan Sonuç'!E40=\"\",\"\",'Önc. Alan Sonuç'!E40)","v":""},{"$f":"IF('Önc. Alan Sonuç'!F40=\"\",\"\",'Önc. Alan Sonuç'!F40)","v":""},{"$f":"IF('Önc. Alan Sonuç'!G40=\"\",\"\",'Önc. Alan Sonuç'!G40)","v":""},{"$f":"IF('Önc. Alan Sonuç'!H40=\"\",\"\",'Önc. Alan Sonuç'!H40)","v":""},{"$f":"IF('Önc. Alan Sonuç'!I40=\"\",\"\",'Önc. Alan Sonuç'!I40)","v":""},{"$f":"IF('Önc. Alan Sonuç'!J40=\"\",\"\",'Önc. Alan Sonuç'!J40)","v":""},{"$f":"IF('Önc. Alan Sonuç'!K40=\"\",\"\",'Önc. Alan Sonuç'!K40)","v":""},{"$f":"IF('Önc. Alan Sonuç'!L40=\"\",\"\",'Önc. Alan Sonuç'!L40)","v":""},{"$f":"IF('Önc. Alan Sonuç'!M40=\"\",\"\",'Önc. Alan Sonuç'!M40)","v":""},{"$f":"IF('Önc. Alan Sonuç'!N40=\"\",\"\",'Önc. Alan Sonuç'!N40)","v":""}]
[{"$f":"IF('Önc. Alan Sonuç'!A41=\"\",\"\",'Önc. Alan Sonuç'!A41)","v":""},{"$f":"IF('Önc. Alan Sonuç'!B41=\"\",\"\",LEFT('Önc. Alan Sonuç'!B41,3)&REPT(\"*\",4)&RIGHT('Önc. Alan Sonuç'!B41,2))","v":""},{"$f":"IF('Önc. Alan Sonuç'!C41=\"\",\"\",IF(ISERR(FIND(\" \",'Önc. Alan Sonuç'!C41))=TRUE,LEFT('Önc. Alan Sonuç'!C41,2)&REPT(\"*\",3),LEFT('Önc. Alan Sonuç'!C41,2)&REPT(\"*\",3)&\" \"&MID('Önc. Alan Sonuç'!C41,FIND(\" \",'Önc. Alan Sonuç'!C41)+1,2)&REPT(\"*\",3)))","v":""},{"$f":"IF('Önc. Alan Sonuç'!D41=\"\",\"\",IF(ISERR(FIND(\" \",'Önc. Alan Sonuç'!D41))=TRUE,LEFT('Önc. Alan Sonuç'!D41,2)&REPT(\"*\",3),LEFT('Önc. Alan Sonuç'!D41,2)&REPT(\"*\",3)&\" \"&MID('Önc. Alan Sonuç'!D41,FIND(\" \",'Önc. Alan Sonuç'!D41)+1,2)&REPT(\"*\",3)))","v":""},{"$f":"IF('Önc. Alan Sonuç'!E41=\"\",\"\",'Önc. Alan Sonuç'!E41)","v":""},{"$f":"IF('Önc. Alan Sonuç'!F41=\"\",\"\",'Önc. Alan Sonuç'!F41)","v":""},{"$f":"IF('Önc. Alan Sonuç'!G41=\"\",\"\",'Önc. Alan Sonuç'!G41)","v":""},{"$f":"IF('Önc. Alan Sonuç'!H41=\"\",\"\",'Önc. Alan Sonuç'!H41)","v":""},{"$f":"IF('Önc. Alan Sonuç'!I41=\"\",\"\",'Önc. Alan Sonuç'!I41)","v":""},{"$f":"IF('Önc. Alan Sonuç'!J41=\"\",\"\",'Önc. Alan Sonuç'!J41)","v":""},{"$f":"IF('Önc. Alan Sonuç'!K41=\"\",\"\",'Önc. Alan Sonuç'!K41)","v":""},{"$f":"IF('Önc. Alan Sonuç'!L41=\"\",\"\",'Önc. Alan Sonuç'!L41)","v":""},{"$f":"IF('Önc. Alan Sonuç'!M41=\"\",\"\",'Önc. Alan Sonuç'!M41)","v":""},{"$f":"IF('Önc. Alan Sonuç'!N41=\"\",\"\",'Önc. Alan Sonuç'!N41)","v":""}]
[{"$f":"IF('Önc. Alan Sonuç'!A42=\"\",\"\",'Önc. Alan Sonuç'!A42)","v":""},{"$f":"IF('Önc. Alan Sonuç'!B42=\"\",\"\",LEFT('Önc. Alan Sonuç'!B42,3)&REPT(\"*\",4)&RIGHT('Önc. Alan Sonuç'!B42,2))","v":""},{"$f":"IF('Önc. Alan Sonuç'!C42=\"\",\"\",IF(ISERR(FIND(\" \",'Önc. Alan Sonuç'!C42))=TRUE,LEFT('Önc. Alan Sonuç'!C42,2)&REPT(\"*\",3),LEFT('Önc. Alan Sonuç'!C42,2)&REPT(\"*\",3)&\" \"&MID('Önc. Alan Sonuç'!C42,FIND(\" \",'Önc. Alan Sonuç'!C42)+1,2)&REPT(\"*\",3)))","v":""},{"$f":"IF('Önc. Alan Sonuç'!D42=\"\",\"\",IF(ISERR(FIND(\" \",'Önc. Alan Sonuç'!D42))=TRUE,LEFT('Önc. Alan Sonuç'!D42,2)&REPT(\"*\",3),LEFT('Önc. Alan Sonuç'!D42,2)&REPT(\"*\",3)&\" \"&MID('Önc. Alan Sonuç'!D42,FIND(\" \",'Önc. Alan Sonuç'!D42)+1,2)&REPT(\"*\",3)))","v":""},{"$f":"IF('Önc. Alan Sonuç'!E42=\"\",\"\",'Önc. Alan Sonuç'!E42)","v":""},{"$f":"IF('Önc. Alan Sonuç'!F42=\"\",\"\",'Önc. Alan Sonuç'!F42)","v":""},{"$f":"IF('Önc. Alan Sonuç'!G42=\"\",\"\",'Önc. Alan Sonuç'!G42)","v":""},{"$f":"IF('Önc. Alan Sonuç'!H42=\"\",\"\",'Önc. Alan Sonuç'!H42)","v":""},{"$f":"IF('Önc. Alan Sonuç'!I42=\"\",\"\",'Önc. Alan Sonuç'!I42)","v":""},{"$f":"IF('Önc. Alan Sonuç'!J42=\"\",\"\",'Önc. Alan Sonuç'!J42)","v":""},{"$f":"IF('Önc. Alan Sonuç'!K42=\"\",\"\",'Önc. Alan Sonuç'!K42)","v":""},{"$f":"IF('Önc. Alan Sonuç'!L42=\"\",\"\",'Önc. Alan Sonuç'!L42)","v":""},{"$f":"IF('Önc. Alan Sonuç'!M42=\"\",\"\",'Önc. Alan Sonuç'!M42)","v":""},{"$f":"IF('Önc. Alan Sonuç'!N42=\"\",\"\",'Önc. Alan Sonuç'!N42)","v":""}]
[{"$f":"IF('Önc. Alan Sonuç'!A43=\"\",\"\",'Önc. Alan Sonuç'!A43)","v":""},{"$f":"IF('Önc. Alan Sonuç'!B43=\"\",\"\",LEFT('Önc. Alan Sonuç'!B43,3)&REPT(\"*\",4)&RIGHT('Önc. Alan Sonuç'!B43,2))","v":""},{"$f":"IF('Önc. Alan Sonuç'!C43=\"\",\"\",IF(ISERR(FIND(\" \",'Önc. Alan Sonuç'!C43))=TRUE,LEFT('Önc. Alan Sonuç'!C43,2)&REPT(\"*\",3),LEFT('Önc. Alan Sonuç'!C43,2)&REPT(\"*\",3)&\" \"&MID('Önc. Alan Sonuç'!C43,FIND(\" \",'Önc. Alan Sonuç'!C43)+1,2)&REPT(\"*\",3)))","v":""},{"$f":"IF('Önc. Alan Sonuç'!D43=\"\",\"\",IF(ISERR(FIND(\" \",'Önc. Alan Sonuç'!D43))=TRUE,LEFT('Önc. Alan Sonuç'!D43,2)&REPT(\"*\",3),LEFT('Önc. Alan Sonuç'!D43,2)&REPT(\"*\",3)&\" \"&MID('Önc. Alan Sonuç'!D43,FIND(\" \",'Önc. Alan Sonuç'!D43)+1,2)&REPT(\"*\",3)))","v":""},{"$f":"IF('Önc. Alan Sonuç'!E43=\"\",\"\",'Önc. Alan Sonuç'!E43)","v":""},{"$f":"IF('Önc. Alan Sonuç'!F43=\"\",\"\",'Önc. Alan Sonuç'!F43)","v":""},{"$f":"IF('Önc. Alan Sonuç'!G43=\"\",\"\",'Önc. Alan Sonuç'!G43)","v":""},{"$f":"IF('Önc. Alan Sonuç'!H43=\"\",\"\",'Önc. Alan Sonuç'!H43)","v":""},{"$f":"IF('Önc. Alan Sonuç'!I43=\"\",\"\",'Önc. Alan Sonuç'!I43)","v":""},{"$f":"IF('Önc. Alan Sonuç'!J43=\"\",\"\",'Önc. Alan Sonuç'!J43)","v":""},{"$f":"IF('Önc. Alan Sonuç'!K43=\"\",\"\",'Önc. Alan Sonuç'!K43)","v":""},{"$f":"IF('Önc. Alan Sonuç'!L43=\"\",\"\",'Önc. Alan Sonuç'!L43)","v":""},{"$f":"IF('Önc. Alan Sonuç'!M43=\"\",\"\",'Önc. Alan Sonuç'!M43)","v":""},{"$f":"IF('Önc. Alan Sonuç'!N43=\"\",\"\",'Önc. Alan Sonuç'!N43)","v":""}]
[{"$f":"IF('Önc. Alan Sonuç'!A44=\"\",\"\",'Önc. Alan Sonuç'!A44)","v":""},{"$f":"IF('Önc. Alan Sonuç'!B44=\"\",\"\",LEFT('Önc. Alan Sonuç'!B44,3)&REPT(\"*\",4)&RIGHT('Önc. Alan Sonuç'!B44,2))","v":""},{"$f":"IF('Önc. Alan Sonuç'!C44=\"\",\"\",IF(ISERR(FIND(\" \",'Önc. Alan Sonuç'!C44))=TRUE,LEFT('Önc. Alan Sonuç'!C44,2)&REPT(\"*\",3),LEFT('Önc. Alan Sonuç'!C44,2)&REPT(\"*\",3)&\" \"&MID('Önc. Alan Sonuç'!C44,FIND(\" \",'Önc. Alan Sonuç'!C44)+1,2)&REPT(\"*\",3)))","v":""},{"$f":"IF('Önc. Alan Sonuç'!D44=\"\",\"\",IF(ISERR(FIND(\" \",'Önc. Alan Sonuç'!D44))=TRUE,LEFT('Önc. Alan Sonuç'!D44,2)&REPT(\"*\",3),LEFT('Önc. Alan Sonuç'!D44,2)&REPT(\"*\",3)&\" \"&MID('Önc. Alan Sonuç'!D44,FIND(\" \",'Önc. Alan Sonuç'!D44)+1,2)&REPT(\"*\",3)))","v":""},{"$f":"IF('Önc. Alan Sonuç'!E44=\"\",\"\",'Önc. Alan Sonuç'!E44)","v":""},{"$f":"IF('Önc. Alan Sonuç'!F44=\"\",\"\",'Önc. Alan Sonuç'!F44)","v":""},{"$f":"IF('Önc. Alan Sonuç'!G44=\"\",\"\",'Önc. Alan Sonuç'!G44)","v":""},{"$f":"IF('Önc. Alan Sonuç'!H44=\"\",\"\",'Önc. Alan Sonuç'!H44)","v":""},{"$f":"IF('Önc. Alan Sonuç'!I44=\"\",\"\",'Önc. Alan Sonuç'!I44)","v":""},{"$f":"IF('Önc. Alan Sonuç'!J44=\"\",\"\",'Önc. Alan Sonuç'!J44)","v":""},{"$f":"IF('Önc. Alan Sonuç'!K44=\"\",\"\",'Önc. Alan Sonuç'!K44)","v":""},{"$f":"IF('Önc. Alan Sonuç'!L44=\"\",\"\",'Önc. Alan Sonuç'!L44)","v":""},{"$f":"IF('Önc. Alan Sonuç'!M44=\"\",\"\",'Önc. Alan Sonuç'!M44)","v":""},{"$f":"IF('Önc. Alan Sonuç'!N44=\"\",\"\",'Önc. Alan Sonuç'!N44)","v":""}]
[{"$f":"IF('Önc. Alan Sonuç'!A45=\"\",\"\",'Önc. Alan Sonuç'!A45)","v":""},{"$f":"IF('Önc. Alan Sonuç'!B45=\"\",\"\",LEFT('Önc. Alan Sonuç'!B45,3)&REPT(\"*\",4)&RIGHT('Önc. Alan Sonuç'!B45,2))","v":""},{"$f":"IF('Önc. Alan Sonuç'!C45=\"\",\"\",IF(ISERR(FIND(\" \",'Önc. Alan Sonuç'!C45))=TRUE,LEFT('Önc. Alan Sonuç'!C45,2)&REPT(\"*\",3),LEFT('Önc. Alan Sonuç'!C45,2)&REPT(\"*\",3)&\" \"&MID('Önc. Alan Sonuç'!C45,FIND(\" \",'Önc. Alan Sonuç'!C45)+1,2)&REPT(\"*\",3)))","v":""},{"$f":"IF('Önc. Alan Sonuç'!D45=\"\",\"\",IF(ISERR(FIND(\" \",'Önc. Alan Sonuç'!D45))=TRUE,LEFT('Önc. Alan Sonuç'!D45,2)&REPT(\"*\",3),LEFT('Önc. Alan Sonuç'!D45,2)&REPT(\"*\",3)&\" \"&MID('Önc. Alan Sonuç'!D45,FIND(\" \",'Önc. Alan Sonuç'!D45)+1,2)&REPT(\"*\",3)))","v":""},{"$f":"IF('Önc. Alan Sonuç'!E45=\"\",\"\",'Önc. Alan Sonuç'!E45)","v":""},{"$f":"IF('Önc. Alan Sonuç'!F45=\"\",\"\",'Önc. Alan Sonuç'!F45)","v":""},{"$f":"IF('Önc. Alan Sonuç'!G45=\"\",\"\",'Önc. Alan Sonuç'!G45)","v":""},{"$f":"IF('Önc. Alan Sonuç'!H45=\"\",\"\",'Önc. Alan Sonuç'!H45)","v":""},{"$f":"IF('Önc. Alan Sonuç'!I45=\"\",\"\",'Önc. Alan Sonuç'!I45)","v":""},{"$f":"IF('Önc. Alan Sonuç'!J45=\"\",\"\",'Önc. Alan Sonuç'!J45)","v":""},{"$f":"IF('Önc. Alan Sonuç'!K45=\"\",\"\",'Önc. Alan Sonuç'!K45)","v":""},{"$f":"IF('Önc. Alan Sonuç'!L45=\"\",\"\",'Önc. Alan Sonuç'!L45)","v":""},{"$f":"IF('Önc. Alan Sonuç'!M45=\"\",\"\",'Önc. Alan Sonuç'!M45)","v":""},{"$f":"IF('Önc. Alan Sonuç'!N45=\"\",\"\",'Önc. Alan Sonuç'!N45)","v":""}]
[{"$f":"IF('Önc. Alan Sonuç'!A46=\"\",\"\",'Önc. Alan Sonuç'!A46)","v":""},{"$f":"IF('Önc. Alan Sonuç'!B46=\"\",\"\",LEFT('Önc. Alan Sonuç'!B46,3)&REPT(\"*\",4)&RIGHT('Önc. Alan Sonuç'!B46,2))","v":""},{"$f":"IF('Önc. Alan Sonuç'!C46=\"\",\"\",IF(ISERR(FIND(\" \",'Önc. Alan Sonuç'!C46))=TRUE,LEFT('Önc. Alan Sonuç'!C46,2)&REPT(\"*\",3),LEFT('Önc. Alan Sonuç'!C46,2)&REPT(\"*\",3)&\" \"&MID('Önc. Alan Sonuç'!C46,FIND(\" \",'Önc. Alan Sonuç'!C46)+1,2)&REPT(\"*\",3)))","v":""},{"$f":"IF('Önc. Alan Sonuç'!D46=\"\",\"\",IF(ISERR(FIND(\" \",'Önc. Alan Sonuç'!D46))=TRUE,LEFT('Önc. Alan Sonuç'!D46,2)&REPT(\"*\",3),LEFT('Önc. Alan Sonuç'!D46,2)&REPT(\"*\",3)&\" \"&MID('Önc. Alan Sonuç'!D46,FIND(\" \",'Önc. Alan Sonuç'!D46)+1,2)&REPT(\"*\",3)))","v":""},{"$f":"IF('Önc. Alan Sonuç'!E46=\"\",\"\",'Önc. Alan Sonuç'!E46)","v":""},{"$f":"IF('Önc. Alan Sonuç'!F46=\"\",\"\",'Önc. Alan Sonuç'!F46)","v":""},{"$f":"IF('Önc. Alan Sonuç'!G46=\"\",\"\",'Önc. Alan Sonuç'!G46)","v":""},{"$f":"IF('Önc. Alan Sonuç'!H46=\"\",\"\",'Önc. Alan Sonuç'!H46)","v":""},{"$f":"IF('Önc. Alan Sonuç'!I46=\"\",\"\",'Önc. Alan Sonuç'!I46)","v":""},{"$f":"IF('Önc. Alan Sonuç'!J46=\"\",\"\",'Önc. Alan Sonuç'!J46)","v":""},{"$f":"IF('Önc. Alan Sonuç'!K46=\"\",\"\",'Önc. Alan Sonuç'!K46)","v":""},{"$f":"IF('Önc. Alan Sonuç'!L46=\"\",\"\",'Önc. Alan Sonuç'!L46)","v":""},{"$f":"IF('Önc. Alan Sonuç'!M46=\"\",\"\",'Önc. Alan Sonuç'!M46)","v":""},{"$f":"IF('Önc. Alan Sonuç'!N46=\"\",\"\",'Önc. Alan Sonuç'!N46)","v":""}]
[{"$f":"IF('Önc. Alan Sonuç'!A47=\"\",\"\",'Önc. Alan Sonuç'!A47)","v":""},{"$f":"IF('Önc. Alan Sonuç'!B47=\"\",\"\",LEFT('Önc. Alan Sonuç'!B47,3)&REPT(\"*\",4)&RIGHT('Önc. Alan Sonuç'!B47,2))","v":""},{"$f":"IF('Önc. Alan Sonuç'!C47=\"\",\"\",IF(ISERR(FIND(\" \",'Önc. Alan Sonuç'!C47))=TRUE,LEFT('Önc. Alan Sonuç'!C47,2)&REPT(\"*\",3),LEFT('Önc. Alan Sonuç'!C47,2)&REPT(\"*\",3)&\" \"&MID('Önc. Alan Sonuç'!C47,FIND(\" \",'Önc. Alan Sonuç'!C47)+1,2)&REPT(\"*\",3)))","v":""},{"$f":"IF('Önc. Alan Sonuç'!D47=\"\",\"\",IF(ISERR(FIND(\" \",'Önc. Alan Sonuç'!D47))=TRUE,LEFT('Önc. Alan Sonuç'!D47,2)&REPT(\"*\",3),LEFT('Önc. Alan Sonuç'!D47,2)&REPT(\"*\",3)&\" \"&MID('Önc. Alan Sonuç'!D47,FIND(\" \",'Önc. Alan Sonuç'!D47)+1,2)&REPT(\"*\",3)))","v":""},{"$f":"IF('Önc. Alan Sonuç'!E47=\"\",\"\",'Önc. Alan Sonuç'!E47)","v":""},{"$f":"IF('Önc. Alan Sonuç'!F47=\"\",\"\",'Önc. Alan Sonuç'!F47)","v":""},{"$f":"IF('Önc. Alan Sonuç'!G47=\"\",\"\",'Önc. Alan Sonuç'!G47)","v":""},{"$f":"IF('Önc. Alan Sonuç'!H47=\"\",\"\",'Önc. Alan Sonuç'!H47)","v":""},{"$f":"IF('Önc. Alan Sonuç'!I47=\"\",\"\",'Önc. Alan Sonuç'!I47)","v":""},{"$f":"IF('Önc. Alan Sonuç'!J47=\"\",\"\",'Önc. Alan Sonuç'!J47)","v":""},{"$f":"IF('Önc. Alan Sonuç'!K47=\"\",\"\",'Önc. Alan Sonuç'!K47)","v":""},{"$f":"IF('Önc. Alan Sonuç'!L47=\"\",\"\",'Önc. Alan Sonuç'!L47)","v":""},{"$f":"IF('Önc. Alan Sonuç'!M47=\"\",\"\",'Önc. Alan Sonuç'!M47)","v":""},{"$f":"IF('Önc. Alan Sonuç'!N47=\"\",\"\",'Önc. Alan Sonuç'!N47)","v":""}]
[{"$f":"IF('Önc. Alan Sonuç'!A48=\"\",\"\",'Önc. Alan Sonuç'!A48)","v":""},{"$f":"IF('Önc. Alan Sonuç'!B48=\"\",\"\",LEFT('Önc. Alan Sonuç'!B48,3)&REPT(\"*\",4)&RIGHT('Önc. Alan Sonuç'!B48,2))","v":""},{"$f":"IF('Önc. Alan Sonuç'!C48=\"\",\"\",IF(ISERR(FIND(\" \",'Önc. Alan Sonuç'!C48))=TRUE,LEFT('Önc. Alan Sonuç'!C48,2)&REPT(\"*\",3),LEFT('Önc. Alan Sonuç'!C48,2)&REPT(\"*\",3)&\" \"&MID('Önc. Alan Sonuç'!C48,FIND(\" \",'Önc. Alan Sonuç'!C48)+1,2)&REPT(\"*\",3)))","v":""},{"$f":"IF('Önc. Alan Sonuç'!D48=\"\",\"\",IF(ISERR(FIND(\" \",'Önc. Alan Sonuç'!D48))=TRUE,LEFT('Önc. Alan Sonuç'!D48,2)&REPT(\"*\",3),LEFT('Önc. Alan Sonuç'!D48,2)&REPT(\"*\",3)&\" \"&MID('Önc. Alan Sonuç'!D48,FIND(\" \",'Önc. Alan Sonuç'!D48)+1,2)&REPT(\"*\",3)))","v":""},{"$f":"IF('Önc. Alan Sonuç'!E48=\"\",\"\",'Önc. Alan Sonuç'!E48)","v":""},{"$f":"IF('Önc. Alan Sonuç'!F48=\"\",\"\",'Önc. Alan Sonuç'!F48)","v":""},{"$f":"IF('Önc. Alan Sonuç'!G48=\"\",\"\",'Önc. Alan Sonuç'!G48)","v":""},{"$f":"IF('Önc. Alan Sonuç'!H48=\"\",\"\",'Önc. Alan Sonuç'!H48)","v":""},{"$f":"IF('Önc. Alan Sonuç'!I48=\"\",\"\",'Önc. Alan Sonuç'!I48)","v":""},{"$f":"IF('Önc. Alan Sonuç'!J48=\"\",\"\",'Önc. Alan Sonuç'!J48)","v":""},{"$f":"IF('Önc. Alan Sonuç'!K48=\"\",\"\",'Önc. Alan Sonuç'!K48)","v":""},{"$f":"IF('Önc. Alan Sonuç'!L48=\"\",\"\",'Önc. Alan Sonuç'!L48)","v":""},{"$f":"IF('Önc. Alan Sonuç'!M48=\"\",\"\",'Önc. Alan Sonuç'!M48)","v":""},{"$f":"IF('Önc. Alan Sonuç'!N48=\"\",\"\",'Önc. Alan Sonuç'!N48)","v":""}]
[{"$f":"IF('Önc. Alan Sonuç'!A49=\"\",\"\",'Önc. Alan Sonuç'!A49)","v":""},{"$f":"IF('Önc. Alan Sonuç'!B49=\"\",\"\",LEFT('Önc. Alan Sonuç'!B49,3)&REPT(\"*\",4)&RIGHT('Önc. Alan Sonuç'!B49,2))","v":""},{"$f":"IF('Önc. Alan Sonuç'!C49=\"\",\"\",IF(ISERR(FIND(\" \",'Önc. Alan Sonuç'!C49))=TRUE,LEFT('Önc. Alan Sonuç'!C49,2)&REPT(\"*\",3),LEFT('Önc. Alan Sonuç'!C49,2)&REPT(\"*\",3)&\" \"&MID('Önc. Alan Sonuç'!C49,FIND(\" \",'Önc. Alan Sonuç'!C49)+1,2)&REPT(\"*\",3)))","v":""},{"$f":"IF('Önc. Alan Sonuç'!D49=\"\",\"\",IF(ISERR(FIND(\" \",'Önc. Alan Sonuç'!D49))=TRUE,LEFT('Önc. Alan Sonuç'!D49,2)&REPT(\"*\",3),LEFT('Önc. Alan Sonuç'!D49,2)&REPT(\"*\",3)&\" \"&MID('Önc. Alan Sonuç'!D49,FIND(\" \",'Önc. Alan Sonuç'!D49)+1,2)&REPT(\"*\",3)))","v":""},{"$f":"IF('Önc. Alan Sonuç'!E49=\"\",\"\",'Önc. Alan Sonuç'!E49)","v":""},{"$f":"IF('Önc. Alan Sonuç'!F49=\"\",\"\",'Önc. Alan Sonuç'!F49)","v":""},{"$f":"IF('Önc. Alan Sonuç'!G49=\"\",\"\",'Önc. Alan Sonuç'!G49)","v":""},{"$f":"IF('Önc. Alan Sonuç'!H49=\"\",\"\",'Önc. Alan Sonuç'!H49)","v":""},{"$f":"IF('Önc. Alan Sonuç'!I49=\"\",\"\",'Önc. Alan Sonuç'!I49)","v":""},{"$f":"IF('Önc. Alan Sonuç'!J49=\"\",\"\",'Önc. Alan Sonuç'!J49)","v":""},{"$f":"IF('Önc. Alan Sonuç'!K49=\"\",\"\",'Önc. Alan Sonuç'!K49)","v":""},{"$f":"IF('Önc. Alan Sonuç'!L49=\"\",\"\",'Önc. Alan Sonuç'!L49)","v":""},{"$f":"IF('Önc. Alan Sonuç'!M49=\"\",\"\",'Önc. Alan Sonuç'!M49)","v":""},{"$f":"IF('Önc. Alan Sonuç'!N49=\"\",\"\",'Önc. Alan Sonuç'!N49)","v":""}]
[{"$f":"IF('Önc. Alan Sonuç'!A50=\"\",\"\",'Önc. Alan Sonuç'!A50)","v":""},{"$f":"IF('Önc. Alan Sonuç'!B50=\"\",\"\",LEFT('Önc. Alan Sonuç'!B50,3)&REPT(\"*\",4)&RIGHT('Önc. Alan Sonuç'!B50,2))","v":""},{"$f":"IF('Önc. Alan Sonuç'!C50=\"\",\"\",IF(ISERR(FIND(\" \",'Önc. Alan Sonuç'!C50))=TRUE,LEFT('Önc. Alan Sonuç'!C50,2)&REPT(\"*\",3),LEFT('Önc. Alan Sonuç'!C50,2)&REPT(\"*\",3)&\" \"&MID('Önc. Alan Sonuç'!C50,FIND(\" \",'Önc. Alan Sonuç'!C50)+1,2)&REPT(\"*\",3)))","v":""},{"$f":"IF('Önc. Alan Sonuç'!D50=\"\",\"\",IF(ISERR(FIND(\" \",'Önc. Alan Sonuç'!D50))=TRUE,LEFT('Önc. Alan Sonuç'!D50,2)&REPT(\"*\",3),LEFT('Önc. Alan Sonuç'!D50,2)&REPT(\"*\",3)&\" \"&MID('Önc. Alan Sonuç'!D50,FIND(\" \",'Önc. Alan Sonuç'!D50)+1,2)&REPT(\"*\",3)))","v":""},{"$f":"IF('Önc. Alan Sonuç'!E50=\"\",\"\",'Önc. Alan Sonuç'!E50)","v":""},{"$f":"IF('Önc. Alan Sonuç'!F50=\"\",\"\",'Önc. Alan Sonuç'!F50)","v":""},{"$f":"IF('Önc. Alan Sonuç'!G50=\"\",\"\",'Önc. Alan Sonuç'!G50)","v":""},{"$f":"IF('Önc. Alan Sonuç'!H50=\"\",\"\",'Önc. Alan Sonuç'!H50)","v":""},{"$f":"IF('Önc. Alan Sonuç'!I50=\"\",\"\",'Önc. Alan Sonuç'!I50)","v":""},{"$f":"IF('Önc. Alan Sonuç'!J50=\"\",\"\",'Önc. Alan Sonuç'!J50)","v":""},{"$f":"IF('Önc. Alan Sonuç'!K50=\"\",\"\",'Önc. Alan Sonuç'!K50)","v":""},{"$f":"IF('Önc. Alan Sonuç'!L50=\"\",\"\",'Önc. Alan Sonuç'!L50)","v":""},{"$f":"IF('Önc. Alan Sonuç'!M50=\"\",\"\",'Önc. Alan Sonuç'!M50)","v":""},{"$f":"IF('Önc. Alan Sonuç'!N50=\"\",\"\",'Önc. Alan Sonuç'!N50)","v":""}]
[{"$f":"IF('Önc. Alan Sonuç'!A51=\"\",\"\",'Önc. Alan Sonuç'!A51)","v":""},{"$f":"IF('Önc. Alan Sonuç'!B51=\"\",\"\",LEFT('Önc. Alan Sonuç'!B51,3)&REPT(\"*\",4)&RIGHT('Önc. Alan Sonuç'!B51,2))","v":""},{"$f":"IF('Önc. Alan Sonuç'!C51=\"\",\"\",IF(ISERR(FIND(\" \",'Önc. Alan Sonuç'!C51))=TRUE,LEFT('Önc. Alan Sonuç'!C51,2)&REPT(\"*\",3),LEFT('Önc. Alan Sonuç'!C51,2)&REPT(\"*\",3)&\" \"&MID('Önc. Alan Sonuç'!C51,FIND(\" \",'Önc. Alan Sonuç'!C51)+1,2)&REPT(\"*\",3)))","v":""},{"$f":"IF('Önc. Alan Sonuç'!D51=\"\",\"\",IF(ISERR(FIND(\" \",'Önc. Alan Sonuç'!D51))=TRUE,LEFT('Önc. Alan Sonuç'!D51,2)&REPT(\"*\",3),LEFT('Önc. Alan Sonuç'!D51,2)&REPT(\"*\",3)&\" \"&MID('Önc. Alan Sonuç'!D51,FIND(\" \",'Önc. Alan Sonuç'!D51)+1,2)&REPT(\"*\",3)))","v":""},{"$f":"IF('Önc. Alan Sonuç'!E51=\"\",\"\",'Önc. Alan Sonuç'!E51)","v":""},{"$f":"IF('Önc. Alan Sonuç'!F51=\"\",\"\",'Önc. Alan Sonuç'!F51)","v":""},{"$f":"IF('Önc. Alan Sonuç'!G51=\"\",\"\",'Önc. Alan Sonuç'!G51)","v":""},{"$f":"IF('Önc. Alan Sonuç'!H51=\"\",\"\",'Önc. Alan Sonuç'!H51)","v":""},{"$f":"IF('Önc. Alan Sonuç'!I51=\"\",\"\",'Önc. Alan Sonuç'!I51)","v":""},{"$f":"IF('Önc. Alan Sonuç'!J51=\"\",\"\",'Önc. Alan Sonuç'!J51)","v":""},{"$f":"IF('Önc. Alan Sonuç'!K51=\"\",\"\",'Önc. Alan Sonuç'!K51)","v":""},{"$f":"IF('Önc. Alan Sonuç'!L51=\"\",\"\",'Önc. Alan Sonuç'!L51)","v":""},{"$f":"IF('Önc. Alan Sonuç'!M51=\"\",\"\",'Önc. Alan Sonuç'!M51)","v":""},{"$f":"IF('Önc. Alan Sonuç'!N51=\"\",\"\",'Önc. Alan Sonuç'!N51)","v":""}]
[{"$f":"IF('Önc. Alan Sonuç'!A52=\"\",\"\",'Önc. Alan Sonuç'!A52)","v":""},{"$f":"IF('Önc. Alan Sonuç'!B52=\"\",\"\",LEFT('Önc. Alan Sonuç'!B52,3)&REPT(\"*\",4)&RIGHT('Önc. Alan Sonuç'!B52,2))","v":""},{"$f":"IF('Önc. Alan Sonuç'!C52=\"\",\"\",IF(ISERR(FIND(\" \",'Önc. Alan Sonuç'!C52))=TRUE,LEFT('Önc. Alan Sonuç'!C52,2)&REPT(\"*\",3),LEFT('Önc. Alan Sonuç'!C52,2)&REPT(\"*\",3)&\" \"&MID('Önc. Alan Sonuç'!C52,FIND(\" \",'Önc. Alan Sonuç'!C52)+1,2)&REPT(\"*\",3)))","v":""},{"$f":"IF('Önc. Alan Sonuç'!D52=\"\",\"\",IF(ISERR(FIND(\" \",'Önc. Alan Sonuç'!D52))=TRUE,LEFT('Önc. Alan Sonuç'!D52,2)&REPT(\"*\",3),LEFT('Önc. Alan Sonuç'!D52,2)&REPT(\"*\",3)&\" \"&MID('Önc. Alan Sonuç'!D52,FIND(\" \",'Önc. Alan Sonuç'!D52)+1,2)&REPT(\"*\",3)))","v":""},{"$f":"IF('Önc. Alan Sonuç'!E52=\"\",\"\",'Önc. Alan Sonuç'!E52)","v":""},{"$f":"IF('Önc. Alan Sonuç'!F52=\"\",\"\",'Önc. Alan Sonuç'!F52)","v":""},{"$f":"IF('Önc. Alan Sonuç'!G52=\"\",\"\",'Önc. Alan Sonuç'!G52)","v":""},{"$f":"IF('Önc. Alan Sonuç'!H52=\"\",\"\",'Önc. Alan Sonuç'!H52)","v":""},{"$f":"IF('Önc. Alan Sonuç'!I52=\"\",\"\",'Önc. Alan Sonuç'!I52)","v":""},{"$f":"IF('Önc. Alan Sonuç'!J52=\"\",\"\",'Önc. Alan Sonuç'!J52)","v":""},{"$f":"IF('Önc. Alan Sonuç'!K52=\"\",\"\",'Önc. Alan Sonuç'!K52)","v":""},{"$f":"IF('Önc. Alan Sonuç'!L52=\"\",\"\",'Önc. Alan Sonuç'!L52)","v":""},{"$f":"IF('Önc. Alan Sonuç'!M52=\"\",\"\",'Önc. Alan Sonuç'!M52)","v":""},{"$f":"IF('Önc. Alan Sonuç'!N52=\"\",\"\",'Önc. Alan Sonuç'!N52)","v":""}]
[{"$f":"IF('Önc. Alan Sonuç'!A53=\"\",\"\",'Önc. Alan Sonuç'!A53)","v":""},{"$f":"IF('Önc. Alan Sonuç'!B53=\"\",\"\",LEFT('Önc. Alan Sonuç'!B53,3)&REPT(\"*\",4)&RIGHT('Önc. Alan Sonuç'!B53,2))","v":""},{"$f":"IF('Önc. Alan Sonuç'!C53=\"\",\"\",IF(ISERR(FIND(\" \",'Önc. Alan Sonuç'!C53))=TRUE,LEFT('Önc. Alan Sonuç'!C53,2)&REPT(\"*\",3),LEFT('Önc. Alan Sonuç'!C53,2)&REPT(\"*\",3)&\" \"&MID('Önc. Alan Sonuç'!C53,FIND(\" \",'Önc. Alan Sonuç'!C53)+1,2)&REPT(\"*\",3)))","v":""},{"$f":"IF('Önc. Alan Sonuç'!D53=\"\",\"\",IF(ISERR(FIND(\" \",'Önc. Alan Sonuç'!D53))=TRUE,LEFT('Önc. Alan Sonuç'!D53,2)&REPT(\"*\",3),LEFT('Önc. Alan Sonuç'!D53,2)&REPT(\"*\",3)&\" \"&MID('Önc. Alan Sonuç'!D53,FIND(\" \",'Önc. Alan Sonuç'!D53)+1,2)&REPT(\"*\",3)))","v":""},{"$f":"IF('Önc. Alan Sonuç'!E53=\"\",\"\",'Önc. Alan Sonuç'!E53)","v":""},{"$f":"IF('Önc. Alan Sonuç'!F53=\"\",\"\",'Önc. Alan Sonuç'!F53)","v":""},{"$f":"IF('Önc. Alan Sonuç'!G53=\"\",\"\",'Önc. Alan Sonuç'!G53)","v":""},{"$f":"IF('Önc. Alan Sonuç'!H53=\"\",\"\",'Önc. Alan Sonuç'!H53)","v":""},{"$f":"IF('Önc. Alan Sonuç'!I53=\"\",\"\",'Önc. Alan Sonuç'!I53)","v":""},{"$f":"IF('Önc. Alan Sonuç'!J53=\"\",\"\",'Önc. Alan Sonuç'!J53)","v":""},{"$f":"IF('Önc. Alan Sonuç'!K53=\"\",\"\",'Önc. Alan Sonuç'!K53)","v":""},{"$f":"IF('Önc. Alan Sonuç'!L53=\"\",\"\",'Önc. Alan Sonuç'!L53)","v":""},{"$f":"IF('Önc. Alan Sonuç'!M53=\"\",\"\",'Önc. Alan Sonuç'!M53)","v":""},{"$f":"IF('Önc. Alan Sonuç'!N53=\"\",\"\",'Önc. Alan Sonuç'!N53)","v":""}]
[{"$f":"IF('Önc. Alan Sonuç'!A54=\"\",\"\",'Önc. Alan Sonuç'!A54)","v":""},{"$f":"IF('Önc. Alan Sonuç'!B54=\"\",\"\",LEFT('Önc. Alan Sonuç'!B54,3)&REPT(\"*\",4)&RIGHT('Önc. Alan Sonuç'!B54,2))","v":""},{"$f":"IF('Önc. Alan Sonuç'!C54=\"\",\"\",IF(ISERR(FIND(\" \",'Önc. Alan Sonuç'!C54))=TRUE,LEFT('Önc. Alan Sonuç'!C54,2)&REPT(\"*\",3),LEFT('Önc. Alan Sonuç'!C54,2)&REPT(\"*\",3)&\" \"&MID('Önc. Alan Sonuç'!C54,FIND(\" \",'Önc. Alan Sonuç'!C54)+1,2)&REPT(\"*\",3)))","v":""},{"$f":"IF('Önc. Alan Sonuç'!D54=\"\",\"\",IF(ISERR(FIND(\" \",'Önc. Alan Sonuç'!D54))=TRUE,LEFT('Önc. Alan Sonuç'!D54,2)&REPT(\"*\",3),LEFT('Önc. Alan Sonuç'!D54,2)&REPT(\"*\",3)&\" \"&MID('Önc. Alan Sonuç'!D54,FIND(\" \",'Önc. Alan Sonuç'!D54)+1,2)&REPT(\"*\",3)))","v":""},{"$f":"IF('Önc. Alan Sonuç'!E54=\"\",\"\",'Önc. Alan Sonuç'!E54)","v":""},{"$f":"IF('Önc. Alan Sonuç'!F54=\"\",\"\",'Önc. Alan Sonuç'!F54)","v":""},{"$f":"IF('Önc. Alan Sonuç'!G54=\"\",\"\",'Önc. Alan Sonuç'!G54)","v":""},{"$f":"IF('Önc. Alan Sonuç'!H54=\"\",\"\",'Önc. Alan Sonuç'!H54)","v":""},{"$f":"IF('Önc. Alan Sonuç'!I54=\"\",\"\",'Önc. Alan Sonuç'!I54)","v":""},{"$f":"IF('Önc. Alan Sonuç'!J54=\"\",\"\",'Önc. Alan Sonuç'!J54)","v":""},{"$f":"IF('Önc. Alan Sonuç'!K54=\"\",\"\",'Önc. Alan Sonuç'!K54)","v":""},{"$f":"IF('Önc. Alan Sonuç'!L54=\"\",\"\",'Önc. Alan Sonuç'!L54)","v":""},{"$f":"IF('Önc. Alan Sonuç'!M54=\"\",\"\",'Önc. Alan Sonuç'!M54)","v":""},{"$f":"IF('Önc. Alan Sonuç'!N54=\"\",\"\",'Önc. Alan Sonuç'!N54)","v":""}]
[{"$f":"IF('Önc. Alan Sonuç'!A55=\"\",\"\",'Önc. Alan Sonuç'!A55)","v":""},{"$f":"IF('Önc. Alan Sonuç'!B55=\"\",\"\",LEFT('Önc. Alan Sonuç'!B55,3)&REPT(\"*\",4)&RIGHT('Önc. Alan Sonuç'!B55,2))","v":""},{"$f":"IF('Önc. Alan Sonuç'!C55=\"\",\"\",IF(ISERR(FIND(\" \",'Önc. Alan Sonuç'!C55))=TRUE,LEFT('Önc. Alan Sonuç'!C55,2)&REPT(\"*\",3),LEFT('Önc. Alan Sonuç'!C55,2)&REPT(\"*\",3)&\" \"&MID('Önc. Alan Sonuç'!C55,FIND(\" \",'Önc. Alan Sonuç'!C55)+1,2)&REPT(\"*\",3)))","v":""},{"$f":"IF('Önc. Alan Sonuç'!D55=\"\",\"\",IF(ISERR(FIND(\" \",'Önc. Alan Sonuç'!D55))=TRUE,LEFT('Önc. Alan Sonuç'!D55,2)&REPT(\"*\",3),LEFT('Önc. Alan Sonuç'!D55,2)&REPT(\"*\",3)&\" \"&MID('Önc. Alan Sonuç'!D55,FIND(\" \",'Önc. Alan Sonuç'!D55)+1,2)&REPT(\"*\",3)))","v":""},{"$f":"IF('Önc. Alan Sonuç'!E55=\"\",\"\",'Önc. Alan Sonuç'!E55)","v":""},{"$f":"IF('Önc. Alan Sonuç'!F55=\"\",\"\",'Önc. Alan Sonuç'!F55)","v":""},{"$f":"IF('Önc. Alan Sonuç'!G55=\"\",\"\",'Önc. Alan Sonuç'!G55)","v":""},{"$f":"IF('Önc. Alan Sonuç'!H55=\"\",\"\",'Önc. Alan Sonuç'!H55)","v":""},{"$f":"IF('Önc. Alan Sonuç'!I55=\"\",\"\",'Önc. Alan Sonuç'!I55)","v":""},{"$f":"IF('Önc. Alan Sonuç'!J55=\"\",\"\",'Önc. Alan Sonuç'!J55)","v":""},{"$f":"IF('Önc. Alan Sonuç'!K55=\"\",\"\",'Önc. Alan Sonuç'!K55)","v":""},{"$f":"IF('Önc. Alan Sonuç'!L55=\"\",\"\",'Önc. Alan Sonuç'!L55)","v":""},{"$f":"IF('Önc. Alan Sonuç'!M55=\"\",\"\",'Önc. Alan Sonuç'!M55)","v":""},{"$f":"IF('Önc. Alan Sonuç'!N55=\"\",\"\",'Önc. Alan Sonuç'!N55)","v":""}]
[{"$f":"IF('Önc. Alan Sonuç'!A56=\"\",\"\",'Önc. Alan Sonuç'!A56)","v":""},{"$f":"IF('Önc. Alan Sonuç'!B56=\"\",\"\",LEFT('Önc. Alan Sonuç'!B56,3)&REPT(\"*\",4)&RIGHT('Önc. Alan Sonuç'!B56,2))","v":""},{"$f":"IF('Önc. Alan Sonuç'!C56=\"\",\"\",IF(ISERR(FIND(\" \",'Önc. Alan Sonuç'!C56))=TRUE,LEFT('Önc. Alan Sonuç'!C56,2)&REPT(\"*\",3),LEFT('Önc. Alan Sonuç'!C56,2)&REPT(\"*\",3)&\" \"&MID('Önc. Alan Sonuç'!C56,FIND(\" \",'Önc. Alan Sonuç'!C56)+1,2)&REPT(\"*\",3)))","v":""},{"$f":"IF('Önc. Alan Sonuç'!D56=\"\",\"\",IF(ISERR(FIND(\" \",'Önc. Alan Sonuç'!D56))=TRUE,LEFT('Önc. Alan Sonuç'!D56,2)&REPT(\"*\",3),LEFT('Önc. Alan Sonuç'!D56,2)&REPT(\"*\",3)&\" \"&MID('Önc. Alan Sonuç'!D56,FIND(\" \",'Önc. Alan Sonuç'!D56)+1,2)&REPT(\"*\",3)))","v":""},{"$f":"IF('Önc. Alan Sonuç'!E56=\"\",\"\",'Önc. Alan Sonuç'!E56)","v":""},{"$f":"IF('Önc. Alan Sonuç'!F56=\"\",\"\",'Önc. Alan Sonuç'!F56)","v":""},{"$f":"IF('Önc. Alan Sonuç'!G56=\"\",\"\",'Önc. Alan Sonuç'!G56)","v":""},{"$f":"IF('Önc. Alan Sonuç'!H56=\"\",\"\",'Önc. Alan Sonuç'!H56)","v":""},{"$f":"IF('Önc. Alan Sonuç'!I56=\"\",\"\",'Önc. Alan Sonuç'!I56)","v":""},{"$f":"IF('Önc. Alan Sonuç'!J56=\"\",\"\",'Önc. Alan Sonuç'!J56)","v":""},{"$f":"IF('Önc. Alan Sonuç'!K56=\"\",\"\",'Önc. Alan Sonuç'!K56)","v":""},{"$f":"IF('Önc. Alan Sonuç'!L56=\"\",\"\",'Önc. Alan Sonuç'!L56)","v":""},{"$f":"IF('Önc. Alan Sonuç'!M56=\"\",\"\",'Önc. Alan Sonuç'!M56)","v":""},{"$f":"IF('Önc. Alan Sonuç'!N56=\"\",\"\",'Önc. Alan Sonuç'!N56)","v":""}]
[{"$f":"IF('Önc. Alan Sonuç'!A57=\"\",\"\",'Önc. Alan Sonuç'!A57)","v":""},{"$f":"IF('Önc. Alan Sonuç'!B57=\"\",\"\",LEFT('Önc. Alan Sonuç'!B57,3)&REPT(\"*\",4)&RIGHT('Önc. Alan Sonuç'!B57,2))","v":""},{"$f":"IF('Önc. Alan Sonuç'!C57=\"\",\"\",IF(ISERR(FIND(\" \",'Önc. Alan Sonuç'!C57))=TRUE,LEFT('Önc. Alan Sonuç'!C57,2)&REPT(\"*\",3),LEFT('Önc. Alan Sonuç'!C57,2)&REPT(\"*\",3)&\" \"&MID('Önc. Alan Sonuç'!C57,FIND(\" \",'Önc. Alan Sonuç'!C57)+1,2)&REPT(\"*\",3)))","v":""},{"$f":"IF('Önc. Alan Sonuç'!D57=\"\",\"\",IF(ISERR(FIND(\" \",'Önc. Alan Sonuç'!D57))=TRUE,LEFT('Önc. Alan Sonuç'!D57,2)&REPT(\"*\",3),LEFT('Önc. Alan Sonuç'!D57,2)&REPT(\"*\",3)&\" \"&MID('Önc. Alan Sonuç'!D57,FIND(\" \",'Önc. Alan Sonuç'!D57)+1,2)&REPT(\"*\",3)))","v":""},{"$f":"IF('Önc. Alan Sonuç'!E57=\"\",\"\",'Önc. Alan Sonuç'!E57)","v":""},{"$f":"IF('Önc. Alan Sonuç'!F57=\"\",\"\",'Önc. Alan Sonuç'!F57)","v":""},{"$f":"IF('Önc. Alan Sonuç'!G57=\"\",\"\",'Önc. Alan Sonuç'!G57)","v":""},{"$f":"IF('Önc. Alan Sonuç'!H57=\"\",\"\",'Önc. Alan Sonuç'!H57)","v":""},{"$f":"IF('Önc. Alan Sonuç'!I57=\"\",\"\",'Önc. Alan Sonuç'!I57)","v":""},{"$f":"IF('Önc. Alan Sonuç'!J57=\"\",\"\",'Önc. Alan Sonuç'!J57)","v":""},{"$f":"IF('Önc. Alan Sonuç'!K57=\"\",\"\",'Önc. Alan Sonuç'!K57)","v":""},{"$f":"IF('Önc. Alan Sonuç'!L57=\"\",\"\",'Önc. Alan Sonuç'!L57)","v":""},{"$f":"IF('Önc. Alan Sonuç'!M57=\"\",\"\",'Önc. Alan Sonuç'!M57)","v":""},{"$f":"IF('Önc. Alan Sonuç'!N57=\"\",\"\",'Önc. Alan Sonuç'!N57)","v":""}]
[{"$f":"IF('Önc. Alan Sonuç'!A58=\"\",\"\",'Önc. Alan Sonuç'!A58)","v":""},{"$f":"IF('Önc. Alan Sonuç'!B58=\"\",\"\",LEFT('Önc. Alan Sonuç'!B58,3)&REPT(\"*\",4)&RIGHT('Önc. Alan Sonuç'!B58,2))","v":""},{"$f":"IF('Önc. Alan Sonuç'!C58=\"\",\"\",IF(ISERR(FIND(\" \",'Önc. Alan Sonuç'!C58))=TRUE,LEFT('Önc. Alan Sonuç'!C58,2)&REPT(\"*\",3),LEFT('Önc. Alan Sonuç'!C58,2)&REPT(\"*\",3)&\" \"&MID('Önc. Alan Sonuç'!C58,FIND(\" \",'Önc. Alan Sonuç'!C58)+1,2)&REPT(\"*\",3)))","v":""},{"$f":"IF('Önc. Alan Sonuç'!D58=\"\",\"\",IF(ISERR(FIND(\" \",'Önc. Alan Sonuç'!D58))=TRUE,LEFT('Önc. Alan Sonuç'!D58,2)&REPT(\"*\",3),LEFT('Önc. Alan Sonuç'!D58,2)&REPT(\"*\",3)&\" \"&MID('Önc. Alan Sonuç'!D58,FIND(\" \",'Önc. Alan Sonuç'!D58)+1,2)&REPT(\"*\",3)))","v":""},{"$f":"IF('Önc. Alan Sonuç'!E58=\"\",\"\",'Önc. Alan Sonuç'!E58)","v":""},{"$f":"IF('Önc. Alan Sonuç'!F58=\"\",\"\",'Önc. Alan Sonuç'!F58)","v":""},{"$f":"IF('Önc. Alan Sonuç'!G58=\"\",\"\",'Önc. Alan Sonuç'!G58)","v":""},{"$f":"IF('Önc. Alan Sonuç'!H58=\"\",\"\",'Önc. Alan Sonuç'!H58)","v":""},{"$f":"IF('Önc. Alan Sonuç'!I58=\"\",\"\",'Önc. Alan Sonuç'!I58)","v":""},{"$f":"IF('Önc. Alan Sonuç'!J58=\"\",\"\",'Önc. Alan Sonuç'!J58)","v":""},{"$f":"IF('Önc. Alan Sonuç'!K58=\"\",\"\",'Önc. Alan Sonuç'!K58)","v":""},{"$f":"IF('Önc. Alan Sonuç'!L58=\"\",\"\",'Önc. Alan Sonuç'!L58)","v":""},{"$f":"IF('Önc. Alan Sonuç'!M58=\"\",\"\",'Önc. Alan Sonuç'!M58)","v":""},{"$f":"IF('Önc. Alan Sonuç'!N58=\"\",\"\",'Önc. Alan Sonuç'!N58)","v":""}]
[{"$f":"IF('Önc. Alan Sonuç'!A59=\"\",\"\",'Önc. Alan Sonuç'!A59)","v":""},{"$f":"IF('Önc. Alan Sonuç'!B59=\"\",\"\",LEFT('Önc. Alan Sonuç'!B59,3)&REPT(\"*\",4)&RIGHT('Önc. Alan Sonuç'!B59,2))","v":""},{"$f":"IF('Önc. Alan Sonuç'!C59=\"\",\"\",IF(ISERR(FIND(\" \",'Önc. Alan Sonuç'!C59))=TRUE,LEFT('Önc. Alan Sonuç'!C59,2)&REPT(\"*\",3),LEFT('Önc. Alan Sonuç'!C59,2)&REPT(\"*\",3)&\" \"&MID('Önc. Alan Sonuç'!C59,FIND(\" \",'Önc. Alan Sonuç'!C59)+1,2)&REPT(\"*\",3)))","v":""},{"$f":"IF('Önc. Alan Sonuç'!D59=\"\",\"\",IF(ISERR(FIND(\" \",'Önc. Alan Sonuç'!D59))=TRUE,LEFT('Önc. Alan Sonuç'!D59,2)&REPT(\"*\",3),LEFT('Önc. Alan Sonuç'!D59,2)&REPT(\"*\",3)&\" \"&MID('Önc. Alan Sonuç'!D59,FIND(\" \",'Önc. Alan Sonuç'!D59)+1,2)&REPT(\"*\",3)))","v":""},{"$f":"IF('Önc. Alan Sonuç'!E59=\"\",\"\",'Önc. Alan Sonuç'!E59)","v":""},{"$f":"IF('Önc. Alan Sonuç'!F59=\"\",\"\",'Önc. Alan Sonuç'!F59)","v":""},{"$f":"IF('Önc. Alan Sonuç'!G59=\"\",\"\",'Önc. Alan Sonuç'!G59)","v":""},{"$f":"IF('Önc. Alan Sonuç'!H59=\"\",\"\",'Önc. Alan Sonuç'!H59)","v":""},{"$f":"IF('Önc. Alan Sonuç'!I59=\"\",\"\",'Önc. Alan Sonuç'!I59)","v":""},{"$f":"IF('Önc. Alan Sonuç'!J59=\"\",\"\",'Önc. Alan Sonuç'!J59)","v":""},{"$f":"IF('Önc. Alan Sonuç'!K59=\"\",\"\",'Önc. Alan Sonuç'!K59)","v":""},{"$f":"IF('Önc. Alan Sonuç'!L59=\"\",\"\",'Önc. Alan Sonuç'!L59)","v":""},{"$f":"IF('Önc. Alan Sonuç'!M59=\"\",\"\",'Önc. Alan Sonuç'!M59)","v":""},{"$f":"IF('Önc. Alan Sonuç'!N59=\"\",\"\",'Önc. Alan Sonuç'!N59)","v":""}]
[{"$f":"IF('Önc. Alan Sonuç'!A60=\"\",\"\",'Önc. Alan Sonuç'!A60)","v":""},{"$f":"IF('Önc. Alan Sonuç'!B60=\"\",\"\",LEFT('Önc. Alan Sonuç'!B60,3)&REPT(\"*\",4)&RIGHT('Önc. Alan Sonuç'!B60,2))","v":""},{"$f":"IF('Önc. Alan Sonuç'!C60=\"\",\"\",IF(ISERR(FIND(\" \",'Önc. Alan Sonuç'!C60))=TRUE,LEFT('Önc. Alan Sonuç'!C60,2)&REPT(\"*\",3),LEFT('Önc. Alan Sonuç'!C60,2)&REPT(\"*\",3)&\" \"&MID('Önc. Alan Sonuç'!C60,FIND(\" \",'Önc. Alan Sonuç'!C60)+1,2)&REPT(\"*\",3)))","v":""},{"$f":"IF('Önc. Alan Sonuç'!D60=\"\",\"\",IF(ISERR(FIND(\" \",'Önc. Alan Sonuç'!D60))=TRUE,LEFT('Önc. Alan Sonuç'!D60,2)&REPT(\"*\",3),LEFT('Önc. Alan Sonuç'!D60,2)&REPT(\"*\",3)&\" \"&MID('Önc. Alan Sonuç'!D60,FIND(\" \",'Önc. Alan Sonuç'!D60)+1,2)&REPT(\"*\",3)))","v":""},{"$f":"IF('Önc. Alan Sonuç'!E60=\"\",\"\",'Önc. Alan Sonuç'!E60)","v":""},{"$f":"IF('Önc. Alan Sonuç'!F60=\"\",\"\",'Önc. Alan Sonuç'!F60)","v":""},{"$f":"IF('Önc. Alan Sonuç'!G60=\"\",\"\",'Önc. Alan Sonuç'!G60)","v":""},{"$f":"IF('Önc. Alan Sonuç'!H60=\"\",\"\",'Önc. Alan Sonuç'!H60)","v":""},{"$f":"IF('Önc. Alan Sonuç'!I60=\"\",\"\",'Önc. Alan Sonuç'!I60)","v":""},{"$f":"IF('Önc. Alan Sonuç'!J60=\"\",\"\",'Önc. Alan Sonuç'!J60)","v":""},{"$f":"IF('Önc. Alan Sonuç'!K60=\"\",\"\",'Önc. Alan Sonuç'!K60)","v":""},{"$f":"IF('Önc. Alan Sonuç'!L60=\"\",\"\",'Önc. Alan Sonuç'!L60)","v":""},{"$f":"IF('Önc. Alan Sonuç'!M60=\"\",\"\",'Önc. Alan Sonuç'!M60)","v":""},{"$f":"IF('Önc. Alan Sonuç'!N60=\"\",\"\",'Önc. Alan Sonuç'!N60)","v":""}]
[{"$f":"IF('Önc. Alan Sonuç'!A61=\"\",\"\",'Önc. Alan Sonuç'!A61)","v":""},{"$f":"IF('Önc. Alan Sonuç'!B61=\"\",\"\",LEFT('Önc. Alan Sonuç'!B61,3)&REPT(\"*\",4)&RIGHT('Önc. Alan Sonuç'!B61,2))","v":""},{"$f":"IF('Önc. Alan Sonuç'!C61=\"\",\"\",IF(ISERR(FIND(\" \",'Önc. Alan Sonuç'!C61))=TRUE,LEFT('Önc. Alan Sonuç'!C61,2)&REPT(\"*\",3),LEFT('Önc. Alan Sonuç'!C61,2)&REPT(\"*\",3)&\" \"&MID('Önc. Alan Sonuç'!C61,FIND(\" \",'Önc. Alan Sonuç'!C61)+1,2)&REPT(\"*\",3)))","v":""},{"$f":"IF('Önc. Alan Sonuç'!D61=\"\",\"\",IF(ISERR(FIND(\" \",'Önc. Alan Sonuç'!D61))=TRUE,LEFT('Önc. Alan Sonuç'!D61,2)&REPT(\"*\",3),LEFT('Önc. Alan Sonuç'!D61,2)&REPT(\"*\",3)&\" \"&MID('Önc. Alan Sonuç'!D61,FIND(\" \",'Önc. Alan Sonuç'!D61)+1,2)&REPT(\"*\",3)))","v":""},{"$f":"IF('Önc. Alan Sonuç'!E61=\"\",\"\",'Önc. Alan Sonuç'!E61)","v":""},{"$f":"IF('Önc. Alan Sonuç'!F61=\"\",\"\",'Önc. Alan Sonuç'!F61)","v":""},{"$f":"IF('Önc. Alan Sonuç'!G61=\"\",\"\",'Önc. Alan Sonuç'!G61)","v":""},{"$f":"IF('Önc. Alan Sonuç'!H61=\"\",\"\",'Önc. Alan Sonuç'!H61)","v":""},{"$f":"IF('Önc. Alan Sonuç'!I61=\"\",\"\",'Önc. Alan Sonuç'!I61)","v":""},{"$f":"IF('Önc. Alan Sonuç'!J61=\"\",\"\",'Önc. Alan Sonuç'!J61)","v":""},{"$f":"IF('Önc. Alan Sonuç'!K61=\"\",\"\",'Önc. Alan Sonuç'!K61)","v":""},{"$f":"IF('Önc. Alan Sonuç'!L61=\"\",\"\",'Önc. Alan Sonuç'!L61)","v":""},{"$f":"IF('Önc. Alan Sonuç'!M61=\"\",\"\",'Önc. Alan Sonuç'!M61)","v":""},{"$f":"IF('Önc. Alan Sonuç'!N61=\"\",\"\",'Önc. Alan Sonuç'!N61)","v":""}]
[{"$f":"IF('Önc. Alan Sonuç'!A62=\"\",\"\",'Önc. Alan Sonuç'!A62)","v":""},{"$f":"IF('Önc. Alan Sonuç'!B62=\"\",\"\",LEFT('Önc. Alan Sonuç'!B62,3)&REPT(\"*\",4)&RIGHT('Önc. Alan Sonuç'!B62,2))","v":""},{"$f":"IF('Önc. Alan Sonuç'!C62=\"\",\"\",IF(ISERR(FIND(\" \",'Önc. Alan Sonuç'!C62))=TRUE,LEFT('Önc. Alan Sonuç'!C62,2)&REPT(\"*\",3),LEFT('Önc. Alan Sonuç'!C62,2)&REPT(\"*\",3)&\" \"&MID('Önc. Alan Sonuç'!C62,FIND(\" \",'Önc. Alan Sonuç'!C62)+1,2)&REPT(\"*\",3)))","v":""},{"$f":"IF('Önc. Alan Sonuç'!D62=\"\",\"\",IF(ISERR(FIND(\" \",'Önc. Alan Sonuç'!D62))=TRUE,LEFT('Önc. Alan Sonuç'!D62,2)&REPT(\"*\",3),LEFT('Önc. Alan Sonuç'!D62,2)&REPT(\"*\",3)&\" \"&MID('Önc. Alan Sonuç'!D62,FIND(\" \",'Önc. Alan Sonuç'!D62)+1,2)&REPT(\"*\",3)))","v":""},{"$f":"IF('Önc. Alan Sonuç'!E62=\"\",\"\",'Önc. Alan Sonuç'!E62)","v":""},{"$f":"IF('Önc. Alan Sonuç'!F62=\"\",\"\",'Önc. Alan Sonuç'!F62)","v":""},{"$f":"IF('Önc. Alan Sonuç'!G62=\"\",\"\",'Önc. Alan Sonuç'!G62)","v":""},{"$f":"IF('Önc. Alan Sonuç'!H62=\"\",\"\",'Önc. Alan Sonuç'!H62)","v":""},{"$f":"IF('Önc. Alan Sonuç'!I62=\"\",\"\",'Önc. Alan Sonuç'!I62)","v":""},{"$f":"IF('Önc. Alan Sonuç'!J62=\"\",\"\",'Önc. Alan Sonuç'!J62)","v":""},{"$f":"IF('Önc. Alan Sonuç'!K62=\"\",\"\",'Önc. Alan Sonuç'!K62)","v":""},{"$f":"IF('Önc. Alan Sonuç'!L62=\"\",\"\",'Önc. Alan Sonuç'!L62)","v":""},{"$f":"IF('Önc. Alan Sonuç'!M62=\"\",\"\",'Önc. Alan Sonuç'!M62)","v":""},{"$f":"IF('Önc. Alan Sonuç'!N62=\"\",\"\",'Önc. Alan Sonuç'!N62)","v":""}]
[{"$f":"IF('Önc. Alan Sonuç'!A63=\"\",\"\",'Önc. Alan Sonuç'!A63)","v":""},{"$f":"IF('Önc. Alan Sonuç'!B63=\"\",\"\",LEFT('Önc. Alan Sonuç'!B63,3)&REPT(\"*\",4)&RIGHT('Önc. Alan Sonuç'!B63,2))","v":""},{"$f":"IF('Önc. Alan Sonuç'!C63=\"\",\"\",IF(ISERR(FIND(\" \",'Önc. Alan Sonuç'!C63))=TRUE,LEFT('Önc. Alan Sonuç'!C63,2)&REPT(\"*\",3),LEFT('Önc. Alan Sonuç'!C63,2)&REPT(\"*\",3)&\" \"&MID('Önc. Alan Sonuç'!C63,FIND(\" \",'Önc. Alan Sonuç'!C63)+1,2)&REPT(\"*\",3)))","v":""},{"$f":"IF('Önc. Alan Sonuç'!D63=\"\",\"\",IF(ISERR(FIND(\" \",'Önc. Alan Sonuç'!D63))=TRUE,LEFT('Önc. Alan Sonuç'!D63,2)&REPT(\"*\",3),LEFT('Önc. Alan Sonuç'!D63,2)&REPT(\"*\",3)&\" \"&MID('Önc. Alan Sonuç'!D63,FIND(\" \",'Önc. Alan Sonuç'!D63)+1,2)&REPT(\"*\",3)))","v":""},{"$f":"IF('Önc. Alan Sonuç'!E63=\"\",\"\",'Önc. Alan Sonuç'!E63)","v":""},{"$f":"IF('Önc. Alan Sonuç'!F63=\"\",\"\",'Önc. Alan Sonuç'!F63)","v":""},{"$f":"IF('Önc. Alan Sonuç'!G63=\"\",\"\",'Önc. Alan Sonuç'!G63)","v":""},{"$f":"IF('Önc. Alan Sonuç'!H63=\"\",\"\",'Önc. Alan Sonuç'!H63)","v":""},{"$f":"IF('Önc. Alan Sonuç'!I63=\"\",\"\",'Önc. Alan Sonuç'!I63)","v":""},{"$f":"IF('Önc. Alan Sonuç'!J63=\"\",\"\",'Önc. Alan Sonuç'!J63)","v":""},{"$f":"IF('Önc. Alan Sonuç'!K63=\"\",\"\",'Önc. Alan Sonuç'!K63)","v":""},{"$f":"IF('Önc. Alan Sonuç'!L63=\"\",\"\",'Önc. Alan Sonuç'!L63)","v":""},{"$f":"IF('Önc. Alan Sonuç'!M63=\"\",\"\",'Önc. Alan Sonuç'!M63)","v":""},{"$f":"IF('Önc. Alan Sonuç'!N63=\"\",\"\",'Önc. Alan Sonuç'!N63)","v":""}]
[{"$f":"IF('Önc. Alan Sonuç'!A64=\"\",\"\",'Önc. Alan Sonuç'!A64)","v":""},{"$f":"IF('Önc. Alan Sonuç'!B64=\"\",\"\",LEFT('Önc. Alan Sonuç'!B64,3)&REPT(\"*\",4)&RIGHT('Önc. Alan Sonuç'!B64,2))","v":""},{"$f":"IF('Önc. Alan Sonuç'!C64=\"\",\"\",IF(ISERR(FIND(\" \",'Önc. Alan Sonuç'!C64))=TRUE,LEFT('Önc. Alan Sonuç'!C64,2)&REPT(\"*\",3),LEFT('Önc. Alan Sonuç'!C64,2)&REPT(\"*\",3)&\" \"&MID('Önc. Alan Sonuç'!C64,FIND(\" \",'Önc. Alan Sonuç'!C64)+1,2)&REPT(\"*\",3)))","v":""},{"$f":"IF('Önc. Alan Sonuç'!D64=\"\",\"\",IF(ISERR(FIND(\" \",'Önc. Alan Sonuç'!D64))=TRUE,LEFT('Önc. Alan Sonuç'!D64,2)&REPT(\"*\",3),LEFT('Önc. Alan Sonuç'!D64,2)&REPT(\"*\",3)&\" \"&MID('Önc. Alan Sonuç'!D64,FIND(\" \",'Önc. Alan Sonuç'!D64)+1,2)&REPT(\"*\",3)))","v":""},{"$f":"IF('Önc. Alan Sonuç'!E64=\"\",\"\",'Önc. Alan Sonuç'!E64)","v":""},{"$f":"IF('Önc. Alan Sonuç'!F64=\"\",\"\",'Önc. Alan Sonuç'!F64)","v":""},{"$f":"IF('Önc. Alan Sonuç'!G64=\"\",\"\",'Önc. Alan Sonuç'!G64)","v":""},{"$f":"IF('Önc. Alan Sonuç'!H64=\"\",\"\",'Önc. Alan Sonuç'!H64)","v":""},{"$f":"IF('Önc. Alan Sonuç'!I64=\"\",\"\",'Önc. Alan Sonuç'!I64)","v":""},{"$f":"IF('Önc. Alan Sonuç'!J64=\"\",\"\",'Önc. Alan Sonuç'!J64)","v":""},{"$f":"IF('Önc. Alan Sonuç'!K64=\"\",\"\",'Önc. Alan Sonuç'!K64)","v":""},{"$f":"IF('Önc. Alan Sonuç'!L64=\"\",\"\",'Önc. Alan Sonuç'!L64)","v":""},{"$f":"IF('Önc. Alan Sonuç'!M64=\"\",\"\",'Önc. Alan Sonuç'!M64)","v":""},{"$f":"IF('Önc. Alan Sonuç'!N64=\"\",\"\",'Önc. Alan Sonuç'!N64)","v":""}]
[{"$f":"IF('Önc. Alan Sonuç'!A65=\"\",\"\",'Önc. Alan Sonuç'!A65)","v":""},{"$f":"IF('Önc. Alan Sonuç'!B65=\"\",\"\",LEFT('Önc. Alan Sonuç'!B65,3)&REPT(\"*\",4)&RIGHT('Önc. Alan Sonuç'!B65,2))","v":""},{"$f":"IF('Önc. Alan Sonuç'!C65=\"\",\"\",IF(ISERR(FIND(\" \",'Önc. Alan Sonuç'!C65))=TRUE,LEFT('Önc. Alan Sonuç'!C65,2)&REPT(\"*\",3),LEFT('Önc. Alan Sonuç'!C65,2)&REPT(\"*\",3)&\" \"&MID('Önc. Alan Sonuç'!C65,FIND(\" \",'Önc. Alan Sonuç'!C65)+1,2)&REPT(\"*\",3)))","v":""},{"$f":"IF('Önc. Alan Sonuç'!D65=\"\",\"\",IF(ISERR(FIND(\" \",'Önc. Alan Sonuç'!D65))=TRUE,LEFT('Önc. Alan Sonuç'!D65,2)&REPT(\"*\",3),LEFT('Önc. Alan Sonuç'!D65,2)&REPT(\"*\",3)&\" \"&MID('Önc. Alan Sonuç'!D65,FIND(\" \",'Önc. Alan Sonuç'!D65)+1,2)&REPT(\"*\",3)))","v":""},{"$f":"IF('Önc. Alan Sonuç'!E65=\"\",\"\",'Önc. Alan Sonuç'!E65)","v":""},{"$f":"IF('Önc. Alan Sonuç'!F65=\"\",\"\",'Önc. Alan Sonuç'!F65)","v":""},{"$f":"IF('Önc. Alan Sonuç'!G65=\"\",\"\",'Önc. Alan Sonuç'!G65)","v":""},{"$f":"IF('Önc. Alan Sonuç'!H65=\"\",\"\",'Önc. Alan Sonuç'!H65)","v":""},{"$f":"IF('Önc. Alan Sonuç'!I65=\"\",\"\",'Önc. Alan Sonuç'!I65)","v":""},{"$f":"IF('Önc. Alan Sonuç'!J65=\"\",\"\",'Önc. Alan Sonuç'!J65)","v":""},{"$f":"IF('Önc. Alan Sonuç'!K65=\"\",\"\",'Önc. Alan Sonuç'!K65)","v":""},{"$f":"IF('Önc. Alan Sonuç'!L65=\"\",\"\",'Önc. Alan Sonuç'!L65)","v":""},{"$f":"IF('Önc. Alan Sonuç'!M65=\"\",\"\",'Önc. Alan Sonuç'!M65)","v":""},{"$f":"IF('Önc. Alan Sonuç'!N65=\"\",\"\",'Önc. Alan Sonuç'!N65)","v":""}]
[{"$f":"IF('Önc. Alan Sonuç'!A66=\"\",\"\",'Önc. Alan Sonuç'!A66)","v":""},{"$f":"IF('Önc. Alan Sonuç'!B66=\"\",\"\",LEFT('Önc. Alan Sonuç'!B66,3)&REPT(\"*\",4)&RIGHT('Önc. Alan Sonuç'!B66,2))","v":""},{"$f":"IF('Önc. Alan Sonuç'!C66=\"\",\"\",IF(ISERR(FIND(\" \",'Önc. Alan Sonuç'!C66))=TRUE,LEFT('Önc. Alan Sonuç'!C66,2)&REPT(\"*\",3),LEFT('Önc. Alan Sonuç'!C66,2)&REPT(\"*\",3)&\" \"&MID('Önc. Alan Sonuç'!C66,FIND(\" \",'Önc. Alan Sonuç'!C66)+1,2)&REPT(\"*\",3)))","v":""},{"$f":"IF('Önc. Alan Sonuç'!D66=\"\",\"\",IF(ISERR(FIND(\" \",'Önc. Alan Sonuç'!D66))=TRUE,LEFT('Önc. Alan Sonuç'!D66,2)&REPT(\"*\",3),LEFT('Önc. Alan Sonuç'!D66,2)&REPT(\"*\",3)&\" \"&MID('Önc. Alan Sonuç'!D66,FIND(\" \",'Önc. Alan Sonuç'!D66)+1,2)&REPT(\"*\",3)))","v":""},{"$f":"IF('Önc. Alan Sonuç'!E66=\"\",\"\",'Önc. Alan Sonuç'!E66)","v":""},{"$f":"IF('Önc. Alan Sonuç'!F66=\"\",\"\",'Önc. Alan Sonuç'!F66)","v":""},{"$f":"IF('Önc. Alan Sonuç'!G66=\"\",\"\",'Önc. Alan Sonuç'!G66)","v":""},{"$f":"IF('Önc. Alan Sonuç'!H66=\"\",\"\",'Önc. Alan Sonuç'!H66)","v":""},{"$f":"IF('Önc. Alan Sonuç'!I66=\"\",\"\",'Önc. Alan Sonuç'!I66)","v":""},{"$f":"IF('Önc. Alan Sonuç'!J66=\"\",\"\",'Önc. Alan Sonuç'!J66)","v":""},{"$f":"IF('Önc. Alan Sonuç'!K66=\"\",\"\",'Önc. Alan Sonuç'!K66)","v":""},{"$f":"IF('Önc. Alan Sonuç'!L66=\"\",\"\",'Önc. Alan Sonuç'!L66)","v":""},{"$f":"IF('Önc. Alan Sonuç'!M66=\"\",\"\",'Önc. Alan Sonuç'!M66)","v":""},{"$f":"IF('Önc. Alan Sonuç'!N66=\"\",\"\",'Önc. Alan Sonuç'!N66)","v":""}]
[{"$f":"IF('Önc. Alan Sonuç'!A67=\"\",\"\",'Önc. Alan Sonuç'!A67)","v":""},{"$f":"IF('Önc. Alan Sonuç'!B67=\"\",\"\",LEFT('Önc. Alan Sonuç'!B67,3)&REPT(\"*\",4)&RIGHT('Önc. Alan Sonuç'!B67,2))","v":""},{"$f":"IF('Önc. Alan Sonuç'!C67=\"\",\"\",IF(ISERR(FIND(\" \",'Önc. Alan Sonuç'!C67))=TRUE,LEFT('Önc. Alan Sonuç'!C67,2)&REPT(\"*\",3),LEFT('Önc. Alan Sonuç'!C67,2)&REPT(\"*\",3)&\" \"&MID('Önc. Alan Sonuç'!C67,FIND(\" \",'Önc. Alan Sonuç'!C67)+1,2)&REPT(\"*\",3)))","v":""},{"$f":"IF('Önc. Alan Sonuç'!D67=\"\",\"\",IF(ISERR(FIND(\" \",'Önc. Alan Sonuç'!D67))=TRUE,LEFT('Önc. Alan Sonuç'!D67,2)&REPT(\"*\",3),LEFT('Önc. Alan Sonuç'!D67,2)&REPT(\"*\",3)&\" \"&MID('Önc. Alan Sonuç'!D67,FIND(\" \",'Önc. Alan Sonuç'!D67)+1,2)&REPT(\"*\",3)))","v":""},{"$f":"IF('Önc. Alan Sonuç'!E67=\"\",\"\",'Önc. Alan Sonuç'!E67)","v":""},{"$f":"IF('Önc. Alan Sonuç'!F67=\"\",\"\",'Önc. Alan Sonuç'!F67)","v":""},{"$f":"IF('Önc. Alan Sonuç'!G67=\"\",\"\",'Önc. Alan Sonuç'!G67)","v":""},{"$f":"IF('Önc. Alan Sonuç'!H67=\"\",\"\",'Önc. Alan Sonuç'!H67)","v":""},{"$f":"IF('Önc. Alan Sonuç'!I67=\"\",\"\",'Önc. Alan Sonuç'!I67)","v":""},{"$f":"IF('Önc. Alan Sonuç'!J67=\"\",\"\",'Önc. Alan Sonuç'!J67)","v":""},{"$f":"IF('Önc. Alan Sonuç'!K67=\"\",\"\",'Önc. Alan Sonuç'!K67)","v":""},{"$f":"IF('Önc. Alan Sonuç'!L67=\"\",\"\",'Önc. Alan Sonuç'!L67)","v":""},{"$f":"IF('Önc. Alan Sonuç'!M67=\"\",\"\",'Önc. Alan Sonuç'!M67)","v":""},{"$f":"IF('Önc. Alan Sonuç'!N67=\"\",\"\",'Önc. Alan Sonuç'!N67)","v":""}]
[{"$f":"IF('Önc. Alan Sonuç'!A68=\"\",\"\",'Önc. Alan Sonuç'!A68)","v":""},{"$f":"IF('Önc. Alan Sonuç'!B68=\"\",\"\",LEFT('Önc. Alan Sonuç'!B68,3)&REPT(\"*\",4)&RIGHT('Önc. Alan Sonuç'!B68,2))","v":""},{"$f":"IF('Önc. Alan Sonuç'!C68=\"\",\"\",IF(ISERR(FIND(\" \",'Önc. Alan Sonuç'!C68))=TRUE,LEFT('Önc. Alan Sonuç'!C68,2)&REPT(\"*\",3),LEFT('Önc. Alan Sonuç'!C68,2)&REPT(\"*\",3)&\" \"&MID('Önc. Alan Sonuç'!C68,FIND(\" \",'Önc. Alan Sonuç'!C68)+1,2)&REPT(\"*\",3)))","v":""},{"$f":"IF('Önc. Alan Sonuç'!D68=\"\",\"\",IF(ISERR(FIND(\" \",'Önc. Alan Sonuç'!D68))=TRUE,LEFT('Önc. Alan Sonuç'!D68,2)&REPT(\"*\",3),LEFT('Önc. Alan Sonuç'!D68,2)&REPT(\"*\",3)&\" \"&MID('Önc. Alan Sonuç'!D68,FIND(\" \",'Önc. Alan Sonuç'!D68)+1,2)&REPT(\"*\",3)))","v":""},{"$f":"IF('Önc. Alan Sonuç'!E68=\"\",\"\",'Önc. Alan Sonuç'!E68)","v":""},{"$f":"IF('Önc. Alan Sonuç'!F68=\"\",\"\",'Önc. Alan Sonuç'!F68)","v":""},{"$f":"IF('Önc. Alan Sonuç'!G68=\"\",\"\",'Önc. Alan Sonuç'!G68)","v":""},{"$f":"IF('Önc. Alan Sonuç'!H68=\"\",\"\",'Önc. Alan Sonuç'!H68)","v":""},{"$f":"IF('Önc. Alan Sonuç'!I68=\"\",\"\",'Önc. Alan Sonuç'!I68)","v":""},{"$f":"IF('Önc. Alan Sonuç'!J68=\"\",\"\",'Önc. Alan Sonuç'!J68)","v":""},{"$f":"IF('Önc. Alan Sonuç'!K68=\"\",\"\",'Önc. Alan Sonuç'!K68)","v":""},{"$f":"IF('Önc. Alan Sonuç'!L68=\"\",\"\",'Önc. Alan Sonuç'!L68)","v":""},{"$f":"IF('Önc. Alan Sonuç'!M68=\"\",\"\",'Önc. Alan Sonuç'!M68)","v":""},{"$f":"IF('Önc. Alan Sonuç'!N68=\"\",\"\",'Önc. Alan Sonuç'!N68)","v":""}]
[{"$f":"IF('Önc. Alan Sonuç'!A69=\"\",\"\",'Önc. Alan Sonuç'!A69)","v":""},{"$f":"IF('Önc. Alan Sonuç'!B69=\"\",\"\",LEFT('Önc. Alan Sonuç'!B69,3)&REPT(\"*\",4)&RIGHT('Önc. Alan Sonuç'!B69,2))","v":""},{"$f":"IF('Önc. Alan Sonuç'!C69=\"\",\"\",IF(ISERR(FIND(\" \",'Önc. Alan Sonuç'!C69))=TRUE,LEFT('Önc. Alan Sonuç'!C69,2)&REPT(\"*\",3),LEFT('Önc. Alan Sonuç'!C69,2)&REPT(\"*\",3)&\" \"&MID('Önc. Alan Sonuç'!C69,FIND(\" \",'Önc. Alan Sonuç'!C69)+1,2)&REPT(\"*\",3)))","v":""},{"$f":"IF('Önc. Alan Sonuç'!D69=\"\",\"\",IF(ISERR(FIND(\" \",'Önc. Alan Sonuç'!D69))=TRUE,LEFT('Önc. Alan Sonuç'!D69,2)&REPT(\"*\",3),LEFT('Önc. Alan Sonuç'!D69,2)&REPT(\"*\",3)&\" \"&MID('Önc. Alan Sonuç'!D69,FIND(\" \",'Önc. Alan Sonuç'!D69)+1,2)&REPT(\"*\",3)))","v":""},{"$f":"IF('Önc. Alan Sonuç'!E69=\"\",\"\",'Önc. Alan Sonuç'!E69)","v":""},{"$f":"IF('Önc. Alan Sonuç'!F69=\"\",\"\",'Önc. Alan Sonuç'!F69)","v":""},{"$f":"IF('Önc. Alan Sonuç'!G69=\"\",\"\",'Önc. Alan Sonuç'!G69)","v":""},{"$f":"IF('Önc. Alan Sonuç'!H69=\"\",\"\",'Önc. Alan Sonuç'!H69)","v":""},{"$f":"IF('Önc. Alan Sonuç'!I69=\"\",\"\",'Önc. Alan Sonuç'!I69)","v":""},{"$f":"IF('Önc. Alan Sonuç'!J69=\"\",\"\",'Önc. Alan Sonuç'!J69)","v":""},{"$f":"IF('Önc. Alan Sonuç'!K69=\"\",\"\",'Önc. Alan Sonuç'!K69)","v":""},{"$f":"IF('Önc. Alan Sonuç'!L69=\"\",\"\",'Önc. Alan Sonuç'!L69)","v":""},{"$f":"IF('Önc. Alan Sonuç'!M69=\"\",\"\",'Önc. Alan Sonuç'!M69)","v":""},{"$f":"IF('Önc. Alan Sonuç'!N69=\"\",\"\",'Önc. Alan Sonuç'!N69)","v":""}]
[{"$f":"IF('Önc. Alan Sonuç'!A70=\"\",\"\",'Önc. Alan Sonuç'!A70)","v":""},{"$f":"IF('Önc. Alan Sonuç'!B70=\"\",\"\",LEFT('Önc. Alan Sonuç'!B70,3)&REPT(\"*\",4)&RIGHT('Önc. Alan Sonuç'!B70,2))","v":""},{"$f":"IF('Önc. Alan Sonuç'!C70=\"\",\"\",IF(ISERR(FIND(\" \",'Önc. Alan Sonuç'!C70))=TRUE,LEFT('Önc. Alan Sonuç'!C70,2)&REPT(\"*\",3),LEFT('Önc. Alan Sonuç'!C70,2)&REPT(\"*\",3)&\" \"&MID('Önc. Alan Sonuç'!C70,FIND(\" \",'Önc. Alan Sonuç'!C70)+1,2)&REPT(\"*\",3)))","v":""},{"$f":"IF('Önc. Alan Sonuç'!D70=\"\",\"\",IF(ISERR(FIND(\" \",'Önc. Alan Sonuç'!D70))=TRUE,LEFT('Önc. Alan Sonuç'!D70,2)&REPT(\"*\",3),LEFT('Önc. Alan Sonuç'!D70,2)&REPT(\"*\",3)&\" \"&MID('Önc. Alan Sonuç'!D70,FIND(\" \",'Önc. Alan Sonuç'!D70)+1,2)&REPT(\"*\",3)))","v":""},{"$f":"IF('Önc. Alan Sonuç'!E70=\"\",\"\",'Önc. Alan Sonuç'!E70)","v":""},{"$f":"IF('Önc. Alan Sonuç'!F70=\"\",\"\",'Önc. Alan Sonuç'!F70)","v":""},{"$f":"IF('Önc. Alan Sonuç'!G70=\"\",\"\",'Önc. Alan Sonuç'!G70)","v":""},{"$f":"IF('Önc. Alan Sonuç'!H70=\"\",\"\",'Önc. Alan Sonuç'!H70)","v":""},{"$f":"IF('Önc. Alan Sonuç'!I70=\"\",\"\",'Önc. Alan Sonuç'!I70)","v":""},{"$f":"IF('Önc. Alan Sonuç'!J70=\"\",\"\",'Önc. Alan Sonuç'!J70)","v":""},{"$f":"IF('Önc. Alan Sonuç'!K70=\"\",\"\",'Önc. Alan Sonuç'!K70)","v":""},{"$f":"IF('Önc. Alan Sonuç'!L70=\"\",\"\",'Önc. Alan Sonuç'!L70)","v":""},{"$f":"IF('Önc. Alan Sonuç'!M70=\"\",\"\",'Önc. Alan Sonuç'!M70)","v":""},{"$f":"IF('Önc. Alan Sonuç'!N70=\"\",\"\",'Önc. Alan Sonuç'!N70)","v":""}]
[{"$f":"IF('Önc. Alan Sonuç'!A71=\"\",\"\",'Önc. Alan Sonuç'!A71)","v":""},{"$f":"IF('Önc. Alan Sonuç'!B71=\"\",\"\",LEFT('Önc. Alan Sonuç'!B71,3)&REPT(\"*\",4)&RIGHT('Önc. Alan Sonuç'!B71,2))","v":""},{"$f":"IF('Önc. Alan Sonuç'!C71=\"\",\"\",IF(ISERR(FIND(\" \",'Önc. Alan Sonuç'!C71))=TRUE,LEFT('Önc. Alan Sonuç'!C71,2)&REPT(\"*\",3),LEFT('Önc. Alan Sonuç'!C71,2)&REPT(\"*\",3)&\" \"&MID('Önc. Alan Sonuç'!C71,FIND(\" \",'Önc. Alan Sonuç'!C71)+1,2)&REPT(\"*\",3)))","v":""},{"$f":"IF('Önc. Alan Sonuç'!D71=\"\",\"\",IF(ISERR(FIND(\" \",'Önc. Alan Sonuç'!D71))=TRUE,LEFT('Önc. Alan Sonuç'!D71,2)&REPT(\"*\",3),LEFT('Önc. Alan Sonuç'!D71,2)&REPT(\"*\",3)&\" \"&MID('Önc. Alan Sonuç'!D71,FIND(\" \",'Önc. Alan Sonuç'!D71)+1,2)&REPT(\"*\",3)))","v":""},{"$f":"IF('Önc. Alan Sonuç'!E71=\"\",\"\",'Önc. Alan Sonuç'!E71)","v":""},{"$f":"IF('Önc. Alan Sonuç'!F71=\"\",\"\",'Önc. Alan Sonuç'!F71)","v":""},{"$f":"IF('Önc. Alan Sonuç'!G71=\"\",\"\",'Önc. Alan Sonuç'!G71)","v":""},{"$f":"IF('Önc. Alan Sonuç'!H71=\"\",\"\",'Önc. Alan Sonuç'!H71)","v":""},{"$f":"IF('Önc. Alan Sonuç'!I71=\"\",\"\",'Önc. Alan Sonuç'!I71)","v":""},{"$f":"IF('Önc. Alan Sonuç'!J71=\"\",\"\",'Önc. Alan Sonuç'!J71)","v":""},{"$f":"IF('Önc. Alan Sonuç'!K71=\"\",\"\",'Önc. Alan Sonuç'!K71)","v":""},{"$f":"IF('Önc. Alan Sonuç'!L71=\"\",\"\",'Önc. Alan Sonuç'!L71)","v":""},{"$f":"IF('Önc. Alan Sonuç'!M71=\"\",\"\",'Önc. Alan Sonuç'!M71)","v":""},{"$f":"IF('Önc. Alan Sonuç'!N71=\"\",\"\",'Önc. Alan Sonuç'!N71)","v":""}]
[{"$f":"IF('Önc. Alan Sonuç'!A72=\"\",\"\",'Önc. Alan Sonuç'!A72)","v":""},{"$f":"IF('Önc. Alan Sonuç'!B72=\"\",\"\",LEFT('Önc. Alan Sonuç'!B72,3)&REPT(\"*\",4)&RIGHT('Önc. Alan Sonuç'!B72,2))","v":""},{"$f":"IF('Önc. Alan Sonuç'!C72=\"\",\"\",IF(ISERR(FIND(\" \",'Önc. Alan Sonuç'!C72))=TRUE,LEFT('Önc. Alan Sonuç'!C72,2)&REPT(\"*\",3),LEFT('Önc. Alan Sonuç'!C72,2)&REPT(\"*\",3)&\" \"&MID('Önc. Alan Sonuç'!C72,FIND(\" \",'Önc. Alan Sonuç'!C72)+1,2)&REPT(\"*\",3)))","v":""},{"$f":"IF('Önc. Alan Sonuç'!D72=\"\",\"\",IF(ISERR(FIND(\" \",'Önc. Alan Sonuç'!D72))=TRUE,LEFT('Önc. Alan Sonuç'!D72,2)&REPT(\"*\",3),LEFT('Önc. Alan Sonuç'!D72,2)&REPT(\"*\",3)&\" \"&MID('Önc. Alan Sonuç'!D72,FIND(\" \",'Önc. Alan Sonuç'!D72)+1,2)&REPT(\"*\",3)))","v":""},{"$f":"IF('Önc. Alan Sonuç'!E72=\"\",\"\",'Önc. Alan Sonuç'!E72)","v":""},{"$f":"IF('Önc. Alan Sonuç'!F72=\"\",\"\",'Önc. Alan Sonuç'!F72)","v":""},{"$f":"IF('Önc. Alan Sonuç'!G72=\"\",\"\",'Önc. Alan Sonuç'!G72)","v":""},{"$f":"IF('Önc. Alan Sonuç'!H72=\"\",\"\",'Önc. Alan Sonuç'!H72)","v":""},{"$f":"IF('Önc. Alan Sonuç'!I72=\"\",\"\",'Önc. Alan Sonuç'!I72)","v":""},{"$f":"IF('Önc. Alan Sonuç'!J72=\"\",\"\",'Önc. Alan Sonuç'!J72)","v":""},{"$f":"IF('Önc. Alan Sonuç'!K72=\"\",\"\",'Önc. Alan Sonuç'!K72)","v":""},{"$f":"IF('Önc. Alan Sonuç'!L72=\"\",\"\",'Önc. Alan Sonuç'!L72)","v":""},{"$f":"IF('Önc. Alan Sonuç'!M72=\"\",\"\",'Önc. Alan Sonuç'!M72)","v":""},{"$f":"IF('Önc. Alan Sonuç'!N72=\"\",\"\",'Önc. Alan Sonuç'!N72)","v":""}]
[{"$f":"IF('Önc. Alan Sonuç'!A73=\"\",\"\",'Önc. Alan Sonuç'!A73)","v":""},{"$f":"IF('Önc. Alan Sonuç'!B73=\"\",\"\",LEFT('Önc. Alan Sonuç'!B73,3)&REPT(\"*\",4)&RIGHT('Önc. Alan Sonuç'!B73,2))","v":""},{"$f":"IF('Önc. Alan Sonuç'!C73=\"\",\"\",IF(ISERR(FIND(\" \",'Önc. Alan Sonuç'!C73))=TRUE,LEFT('Önc. Alan Sonuç'!C73,2)&REPT(\"*\",3),LEFT('Önc. Alan Sonuç'!C73,2)&REPT(\"*\",3)&\" \"&MID('Önc. Alan Sonuç'!C73,FIND(\" \",'Önc. Alan Sonuç'!C73)+1,2)&REPT(\"*\",3)))","v":""},{"$f":"IF('Önc. Alan Sonuç'!D73=\"\",\"\",IF(ISERR(FIND(\" \",'Önc. Alan Sonuç'!D73))=TRUE,LEFT('Önc. Alan Sonuç'!D73,2)&REPT(\"*\",3),LEFT('Önc. Alan Sonuç'!D73,2)&REPT(\"*\",3)&\" \"&MID('Önc. Alan Sonuç'!D73,FIND(\" \",'Önc. Alan Sonuç'!D73)+1,2)&REPT(\"*\",3)))","v":""},{"$f":"IF('Önc. Alan Sonuç'!E73=\"\",\"\",'Önc. Alan Sonuç'!E73)","v":""},{"$f":"IF('Önc. Alan Sonuç'!F73=\"\",\"\",'Önc. Alan Sonuç'!F73)","v":""},{"$f":"IF('Önc. Alan Sonuç'!G73=\"\",\"\",'Önc. Alan Sonuç'!G73)","v":""},{"$f":"IF('Önc. Alan Sonuç'!H73=\"\",\"\",'Önc. Alan Sonuç'!H73)","v":""},{"$f":"IF('Önc. Alan Sonuç'!I73=\"\",\"\",'Önc. Alan Sonuç'!I73)","v":""},{"$f":"IF('Önc. Alan Sonuç'!J73=\"\",\"\",'Önc. Alan Sonuç'!J73)","v":""},{"$f":"IF('Önc. Alan Sonuç'!K73=\"\",\"\",'Önc. Alan Sonuç'!K73)","v":""},{"$f":"IF('Önc. Alan Sonuç'!L73=\"\",\"\",'Önc. Alan Sonuç'!L73)","v":""},{"$f":"IF('Önc. Alan Sonuç'!M73=\"\",\"\",'Önc. Alan Sonuç'!M73)","v":""},{"$f":"IF('Önc. Alan Sonuç'!N73=\"\",\"\",'Önc. Alan Sonuç'!N73)","v":""}]
[{"$f":"IF('Önc. Alan Sonuç'!A74=\"\",\"\",'Önc. Alan Sonuç'!A74)","v":""},{"$f":"IF('Önc. Alan Sonuç'!B74=\"\",\"\",LEFT('Önc. Alan Sonuç'!B74,3)&REPT(\"*\",4)&RIGHT('Önc. Alan Sonuç'!B74,2))","v":""},{"$f":"IF('Önc. Alan Sonuç'!C74=\"\",\"\",IF(ISERR(FIND(\" \",'Önc. Alan Sonuç'!C74))=TRUE,LEFT('Önc. Alan Sonuç'!C74,2)&REPT(\"*\",3),LEFT('Önc. Alan Sonuç'!C74,2)&REPT(\"*\",3)&\" \"&MID('Önc. Alan Sonuç'!C74,FIND(\" \",'Önc. Alan Sonuç'!C74)+1,2)&REPT(\"*\",3)))","v":""},{"$f":"IF('Önc. Alan Sonuç'!D74=\"\",\"\",IF(ISERR(FIND(\" \",'Önc. Alan Sonuç'!D74))=TRUE,LEFT('Önc. Alan Sonuç'!D74,2)&REPT(\"*\",3),LEFT('Önc. Alan Sonuç'!D74,2)&REPT(\"*\",3)&\" \"&MID('Önc. Alan Sonuç'!D74,FIND(\" \",'Önc. Alan Sonuç'!D74)+1,2)&REPT(\"*\",3)))","v":""},{"$f":"IF('Önc. Alan Sonuç'!E74=\"\",\"\",'Önc. Alan Sonuç'!E74)","v":""},{"$f":"IF('Önc. Alan Sonuç'!F74=\"\",\"\",'Önc. Alan Sonuç'!F74)","v":""},{"$f":"IF('Önc. Alan Sonuç'!G74=\"\",\"\",'Önc. Alan Sonuç'!G74)","v":""},{"$f":"IF('Önc. Alan Sonuç'!H74=\"\",\"\",'Önc. Alan Sonuç'!H74)","v":""},{"$f":"IF('Önc. Alan Sonuç'!I74=\"\",\"\",'Önc. Alan Sonuç'!I74)","v":""},{"$f":"IF('Önc. Alan Sonuç'!J74=\"\",\"\",'Önc. Alan Sonuç'!J74)","v":""},{"$f":"IF('Önc. Alan Sonuç'!K74=\"\",\"\",'Önc. Alan Sonuç'!K74)","v":""},{"$f":"IF('Önc. Alan Sonuç'!L74=\"\",\"\",'Önc. Alan Sonuç'!L74)","v":""},{"$f":"IF('Önc. Alan Sonuç'!M74=\"\",\"\",'Önc. Alan Sonuç'!M74)","v":""},{"$f":"IF('Önc. Alan Sonuç'!N74=\"\",\"\",'Önc. Alan Sonuç'!N74)","v":""}]
[{"$f":"IF('Önc. Alan Sonuç'!A75=\"\",\"\",'Önc. Alan Sonuç'!A75)","v":""},{"$f":"IF('Önc. Alan Sonuç'!B75=\"\",\"\",LEFT('Önc. Alan Sonuç'!B75,3)&REPT(\"*\",4)&RIGHT('Önc. Alan Sonuç'!B75,2))","v":""},{"$f":"IF('Önc. Alan Sonuç'!C75=\"\",\"\",IF(ISERR(FIND(\" \",'Önc. Alan Sonuç'!C75))=TRUE,LEFT('Önc. Alan Sonuç'!C75,2)&REPT(\"*\",3),LEFT('Önc. Alan Sonuç'!C75,2)&REPT(\"*\",3)&\" \"&MID('Önc. Alan Sonuç'!C75,FIND(\" \",'Önc. Alan Sonuç'!C75)+1,2)&REPT(\"*\",3)))","v":""},{"$f":"IF('Önc. Alan Sonuç'!D75=\"\",\"\",IF(ISERR(FIND(\" \",'Önc. Alan Sonuç'!D75))=TRUE,LEFT('Önc. Alan Sonuç'!D75,2)&REPT(\"*\",3),LEFT('Önc. Alan Sonuç'!D75,2)&REPT(\"*\",3)&\" \"&MID('Önc. Alan Sonuç'!D75,FIND(\" \",'Önc. Alan Sonuç'!D75)+1,2)&REPT(\"*\",3)))","v":""},{"$f":"IF('Önc. Alan Sonuç'!E75=\"\",\"\",'Önc. Alan Sonuç'!E75)","v":""},{"$f":"IF('Önc. Alan Sonuç'!F75=\"\",\"\",'Önc. Alan Sonuç'!F75)","v":""},{"$f":"IF('Önc. Alan Sonuç'!G75=\"\",\"\",'Önc. Alan Sonuç'!G75)","v":""},{"$f":"IF('Önc. Alan Sonuç'!H75=\"\",\"\",'Önc. Alan Sonuç'!H75)","v":""},{"$f":"IF('Önc. Alan Sonuç'!I75=\"\",\"\",'Önc. Alan Sonuç'!I75)","v":""},{"$f":"IF('Önc. Alan Sonuç'!J75=\"\",\"\",'Önc. Alan Sonuç'!J75)","v":""},{"$f":"IF('Önc. Alan Sonuç'!K75=\"\",\"\",'Önc. Alan Sonuç'!K75)","v":""},{"$f":"IF('Önc. Alan Sonuç'!L75=\"\",\"\",'Önc. Alan Sonuç'!L75)","v":""},{"$f":"IF('Önc. Alan Sonuç'!M75=\"\",\"\",'Önc. Alan Sonuç'!M75)","v":""},{"$f":"IF('Önc. Alan Sonuç'!N75=\"\",\"\",'Önc. Alan Sonuç'!N75)","v":""}]
[{"$f":"IF('Önc. Alan Sonuç'!A76=\"\",\"\",'Önc. Alan Sonuç'!A76)","v":""},{"$f":"IF('Önc. Alan Sonuç'!B76=\"\",\"\",LEFT('Önc. Alan Sonuç'!B76,3)&REPT(\"*\",4)&RIGHT('Önc. Alan Sonuç'!B76,2))","v":""},{"$f":"IF('Önc. Alan Sonuç'!C76=\"\",\"\",IF(ISERR(FIND(\" \",'Önc. Alan Sonuç'!C76))=TRUE,LEFT('Önc. Alan Sonuç'!C76,2)&REPT(\"*\",3),LEFT('Önc. Alan Sonuç'!C76,2)&REPT(\"*\",3)&\" \"&MID('Önc. Alan Sonuç'!C76,FIND(\" \",'Önc. Alan Sonuç'!C76)+1,2)&REPT(\"*\",3)))","v":""},{"$f":"IF('Önc. Alan Sonuç'!D76=\"\",\"\",IF(ISERR(FIND(\" \",'Önc. Alan Sonuç'!D76))=TRUE,LEFT('Önc. Alan Sonuç'!D76,2)&REPT(\"*\",3),LEFT('Önc. Alan Sonuç'!D76,2)&REPT(\"*\",3)&\" \"&MID('Önc. Alan Sonuç'!D76,FIND(\" \",'Önc. Alan Sonuç'!D76)+1,2)&REPT(\"*\",3)))","v":""},{"$f":"IF('Önc. Alan Sonuç'!E76=\"\",\"\",'Önc. Alan Sonuç'!E76)","v":""},{"$f":"IF('Önc. Alan Sonuç'!F76=\"\",\"\",'Önc. Alan Sonuç'!F76)","v":""},{"$f":"IF('Önc. Alan Sonuç'!G76=\"\",\"\",'Önc. Alan Sonuç'!G76)","v":""},{"$f":"IF('Önc. Alan Sonuç'!H76=\"\",\"\",'Önc. Alan Sonuç'!H76)","v":""},{"$f":"IF('Önc. Alan Sonuç'!I76=\"\",\"\",'Önc. Alan Sonuç'!I76)","v":""},{"$f":"IF('Önc. Alan Sonuç'!J76=\"\",\"\",'Önc. Alan Sonuç'!J76)","v":""},{"$f":"IF('Önc. Alan Sonuç'!K76=\"\",\"\",'Önc. Alan Sonuç'!K76)","v":""},{"$f":"IF('Önc. Alan Sonuç'!L76=\"\",\"\",'Önc. Alan Sonuç'!L76)","v":""},{"$f":"IF('Önc. Alan Sonuç'!M76=\"\",\"\",'Önc. Alan Sonuç'!M76)","v":""},{"$f":"IF('Önc. Alan Sonuç'!N76=\"\",\"\",'Önc. Alan Sonuç'!N76)","v":""}]
[{"$f":"IF('Önc. Alan Sonuç'!A77=\"\",\"\",'Önc. Alan Sonuç'!A77)","v":""},{"$f":"IF('Önc. Alan Sonuç'!B77=\"\",\"\",LEFT('Önc. Alan Sonuç'!B77,3)&REPT(\"*\",4)&RIGHT('Önc. Alan Sonuç'!B77,2))","v":""},{"$f":"IF('Önc. Alan Sonuç'!C77=\"\",\"\",IF(ISERR(FIND(\" \",'Önc. Alan Sonuç'!C77))=TRUE,LEFT('Önc. Alan Sonuç'!C77,2)&REPT(\"*\",3),LEFT('Önc. Alan Sonuç'!C77,2)&REPT(\"*\",3)&\" \"&MID('Önc. Alan Sonuç'!C77,FIND(\" \",'Önc. Alan Sonuç'!C77)+1,2)&REPT(\"*\",3)))","v":""},{"$f":"IF('Önc. Alan Sonuç'!D77=\"\",\"\",IF(ISERR(FIND(\" \",'Önc. Alan Sonuç'!D77))=TRUE,LEFT('Önc. Alan Sonuç'!D77,2)&REPT(\"*\",3),LEFT('Önc. Alan Sonuç'!D77,2)&REPT(\"*\",3)&\" \"&MID('Önc. Alan Sonuç'!D77,FIND(\" \",'Önc. Alan Sonuç'!D77)+1,2)&REPT(\"*\",3)))","v":""},{"$f":"IF('Önc. Alan Sonuç'!E77=\"\",\"\",'Önc. Alan Sonuç'!E77)","v":""},{"$f":"IF('Önc. Alan Sonuç'!F77=\"\",\"\",'Önc. Alan Sonuç'!F77)","v":""},{"$f":"IF('Önc. Alan Sonuç'!G77=\"\",\"\",'Önc. Alan Sonuç'!G77)","v":""},{"$f":"IF('Önc. Alan Sonuç'!H77=\"\",\"\",'Önc. Alan Sonuç'!H77)","v":""},{"$f":"IF('Önc. Alan Sonuç'!I77=\"\",\"\",'Önc. Alan Sonuç'!I77)","v":""},{"$f":"IF('Önc. Alan Sonuç'!J77=\"\",\"\",'Önc. Alan Sonuç'!J77)","v":""},{"$f":"IF('Önc. Alan Sonuç'!K77=\"\",\"\",'Önc. Alan Sonuç'!K77)","v":""},{"$f":"IF('Önc. Alan Sonuç'!L77=\"\",\"\",'Önc. Alan Sonuç'!L77)","v":""},{"$f":"IF('Önc. Alan Sonuç'!M77=\"\",\"\",'Önc. Alan Sonuç'!M77)","v":""},{"$f":"IF('Önc. Alan Sonuç'!N77=\"\",\"\",'Önc. Alan Sonuç'!N77)","v":""}]
[{"$f":"IF('Önc. Alan Sonuç'!A78=\"\",\"\",'Önc. Alan Sonuç'!A78)","v":""},{"$f":"IF('Önc. Alan Sonuç'!B78=\"\",\"\",LEFT('Önc. Alan Sonuç'!B78,3)&REPT(\"*\",4)&RIGHT('Önc. Alan Sonuç'!B78,2))","v":""},{"$f":"IF('Önc. Alan Sonuç'!C78=\"\",\"\",IF(ISERR(FIND(\" \",'Önc. Alan Sonuç'!C78))=TRUE,LEFT('Önc. Alan Sonuç'!C78,2)&REPT(\"*\",3),LEFT('Önc. Alan Sonuç'!C78,2)&REPT(\"*\",3)&\" \"&MID('Önc. Alan Sonuç'!C78,FIND(\" \",'Önc. Alan Sonuç'!C78)+1,2)&REPT(\"*\",3)))","v":""},{"$f":"IF('Önc. Alan Sonuç'!D78=\"\",\"\",IF(ISERR(FIND(\" \",'Önc. Alan Sonuç'!D78))=TRUE,LEFT('Önc. Alan Sonuç'!D78,2)&REPT(\"*\",3),LEFT('Önc. Alan Sonuç'!D78,2)&REPT(\"*\",3)&\" \"&MID('Önc. Alan Sonuç'!D78,FIND(\" \",'Önc. Alan Sonuç'!D78)+1,2)&REPT(\"*\",3)))","v":""},{"$f":"IF('Önc. Alan Sonuç'!E78=\"\",\"\",'Önc. Alan Sonuç'!E78)","v":""},{"$f":"IF('Önc. Alan Sonuç'!F78=\"\",\"\",'Önc. Alan Sonuç'!F78)","v":""},{"$f":"IF('Önc. Alan Sonuç'!G78=\"\",\"\",'Önc. Alan Sonuç'!G78)","v":""},{"$f":"IF('Önc. Alan Sonuç'!H78=\"\",\"\",'Önc. Alan Sonuç'!H78)","v":""},{"$f":"IF('Önc. Alan Sonuç'!I78=\"\",\"\",'Önc. Alan Sonuç'!I78)","v":""},{"$f":"IF('Önc. Alan Sonuç'!J78=\"\",\"\",'Önc. Alan Sonuç'!J78)","v":""},{"$f":"IF('Önc. Alan Sonuç'!K78=\"\",\"\",'Önc. Alan Sonuç'!K78)","v":""},{"$f":"IF('Önc. Alan Sonuç'!L78=\"\",\"\",'Önc. Alan Sonuç'!L78)","v":""},{"$f":"IF('Önc. Alan Sonuç'!M78=\"\",\"\",'Önc. Alan Sonuç'!M78)","v":""},{"$f":"IF('Önc. Alan Sonuç'!N78=\"\",\"\",'Önc. Alan Sonuç'!N78)","v":""}]
[{"$f":"IF('Önc. Alan Sonuç'!A79=\"\",\"\",'Önc. Alan Sonuç'!A79)","v":""},{"$f":"IF('Önc. Alan Sonuç'!B79=\"\",\"\",LEFT('Önc. Alan Sonuç'!B79,3)&REPT(\"*\",4)&RIGHT('Önc. Alan Sonuç'!B79,2))","v":""},{"$f":"IF('Önc. Alan Sonuç'!C79=\"\",\"\",IF(ISERR(FIND(\" \",'Önc. Alan Sonuç'!C79))=TRUE,LEFT('Önc. Alan Sonuç'!C79,2)&REPT(\"*\",3),LEFT('Önc. Alan Sonuç'!C79,2)&REPT(\"*\",3)&\" \"&MID('Önc. Alan Sonuç'!C79,FIND(\" \",'Önc. Alan Sonuç'!C79)+1,2)&REPT(\"*\",3)))","v":""},{"$f":"IF('Önc. Alan Sonuç'!D79=\"\",\"\",IF(ISERR(FIND(\" \",'Önc. Alan Sonuç'!D79))=TRUE,LEFT('Önc. Alan Sonuç'!D79,2)&REPT(\"*\",3),LEFT('Önc. Alan Sonuç'!D79,2)&REPT(\"*\",3)&\" \"&MID('Önc. Alan Sonuç'!D79,FIND(\" \",'Önc. Alan Sonuç'!D79)+1,2)&REPT(\"*\",3)))","v":""},{"$f":"IF('Önc. Alan Sonuç'!E79=\"\",\"\",'Önc. Alan Sonuç'!E79)","v":""},{"$f":"IF('Önc. Alan Sonuç'!F79=\"\",\"\",'Önc. Alan Sonuç'!F79)","v":""},{"$f":"IF('Önc. Alan Sonuç'!G79=\"\",\"\",'Önc. Alan Sonuç'!G79)","v":""},{"$f":"IF('Önc. Alan Sonuç'!H79=\"\",\"\",'Önc. Alan Sonuç'!H79)","v":""},{"$f":"IF('Önc. Alan Sonuç'!I79=\"\",\"\",'Önc. Alan Sonuç'!I79)","v":""},{"$f":"IF('Önc. Alan Sonuç'!J79=\"\",\"\",'Önc. Alan Sonuç'!J79)","v":""},{"$f":"IF('Önc. Alan Sonuç'!K79=\"\",\"\",'Önc. Alan Sonuç'!K79)","v":""},{"$f":"IF('Önc. Alan Sonuç'!L79=\"\",\"\",'Önc. Alan Sonuç'!L79)","v":""},{"$f":"IF('Önc. Alan Sonuç'!M79=\"\",\"\",'Önc. Alan Sonuç'!M79)","v":""},{"$f":"IF('Önc. Alan Sonuç'!N79=\"\",\"\",'Önc. Alan Sonuç'!N79)","v":""}]
[{"$f":"IF('Önc. Alan Sonuç'!A80=\"\",\"\",'Önc. Alan Sonuç'!A80)","v":""},{"$f":"IF('Önc. Alan Sonuç'!B80=\"\",\"\",LEFT('Önc. Alan Sonuç'!B80,3)&REPT(\"*\",4)&RIGHT('Önc. Alan Sonuç'!B80,2))","v":""},{"$f":"IF('Önc. Alan Sonuç'!C80=\"\",\"\",IF(ISERR(FIND(\" \",'Önc. Alan Sonuç'!C80))=TRUE,LEFT('Önc. Alan Sonuç'!C80,2)&REPT(\"*\",3),LEFT('Önc. Alan Sonuç'!C80,2)&REPT(\"*\",3)&\" \"&MID('Önc. Alan Sonuç'!C80,FIND(\" \",'Önc. Alan Sonuç'!C80)+1,2)&REPT(\"*\",3)))","v":""},{"$f":"IF('Önc. Alan Sonuç'!D80=\"\",\"\",IF(ISERR(FIND(\" \",'Önc. Alan Sonuç'!D80))=TRUE,LEFT('Önc. Alan Sonuç'!D80,2)&REPT(\"*\",3),LEFT('Önc. Alan Sonuç'!D80,2)&REPT(\"*\",3)&\" \"&MID('Önc. Alan Sonuç'!D80,FIND(\" \",'Önc. Alan Sonuç'!D80)+1,2)&REPT(\"*\",3)))","v":""},{"$f":"IF('Önc. Alan Sonuç'!E80=\"\",\"\",'Önc. Alan Sonuç'!E80)","v":""},{"$f":"IF('Önc. Alan Sonuç'!F80=\"\",\"\",'Önc. Alan Sonuç'!F80)","v":""},{"$f":"IF('Önc. Alan Sonuç'!G80=\"\",\"\",'Önc. Alan Sonuç'!G80)","v":""},{"$f":"IF('Önc. Alan Sonuç'!H80=\"\",\"\",'Önc. Alan Sonuç'!H80)","v":""},{"$f":"IF('Önc. Alan Sonuç'!I80=\"\",\"\",'Önc. Alan Sonuç'!I80)","v":""},{"$f":"IF('Önc. Alan Sonuç'!J80=\"\",\"\",'Önc. Alan Sonuç'!J80)","v":""},{"$f":"IF('Önc. Alan Sonuç'!K80=\"\",\"\",'Önc. Alan Sonuç'!K80)","v":""},{"$f":"IF('Önc. Alan Sonuç'!L80=\"\",\"\",'Önc. Alan Sonuç'!L80)","v":""},{"$f":"IF('Önc. Alan Sonuç'!M80=\"\",\"\",'Önc. Alan Sonuç'!M80)","v":""},{"$f":"IF('Önc. Alan Sonuç'!N80=\"\",\"\",'Önc. Alan Sonuç'!N80)","v":""}]
[{"$f":"IF('Önc. Alan Sonuç'!A81=\"\",\"\",'Önc. Alan Sonuç'!A81)","v":""},{"$f":"IF('Önc. Alan Sonuç'!B81=\"\",\"\",LEFT('Önc. Alan Sonuç'!B81,3)&REPT(\"*\",4)&RIGHT('Önc. Alan Sonuç'!B81,2))","v":""},{"$f":"IF('Önc. Alan Sonuç'!C81=\"\",\"\",IF(ISERR(FIND(\" \",'Önc. Alan Sonuç'!C81))=TRUE,LEFT('Önc. Alan Sonuç'!C81,2)&REPT(\"*\",3),LEFT('Önc. Alan Sonuç'!C81,2)&REPT(\"*\",3)&\" \"&MID('Önc. Alan Sonuç'!C81,FIND(\" \",'Önc. Alan Sonuç'!C81)+1,2)&REPT(\"*\",3)))","v":""},{"$f":"IF('Önc. Alan Sonuç'!D81=\"\",\"\",IF(ISERR(FIND(\" \",'Önc. Alan Sonuç'!D81))=TRUE,LEFT('Önc. Alan Sonuç'!D81,2)&REPT(\"*\",3),LEFT('Önc. Alan Sonuç'!D81,2)&REPT(\"*\",3)&\" \"&MID('Önc. Alan Sonuç'!D81,FIND(\" \",'Önc. Alan Sonuç'!D81)+1,2)&REPT(\"*\",3)))","v":""},{"$f":"IF('Önc. Alan Sonuç'!E81=\"\",\"\",'Önc. Alan Sonuç'!E81)","v":""},{"$f":"IF('Önc. Alan Sonuç'!F81=\"\",\"\",'Önc. Alan Sonuç'!F81)","v":""},{"$f":"IF('Önc. Alan Sonuç'!G81=\"\",\"\",'Önc. Alan Sonuç'!G81)","v":""},{"$f":"IF('Önc. Alan Sonuç'!H81=\"\",\"\",'Önc. Alan Sonuç'!H81)","v":""},{"$f":"IF('Önc. Alan Sonuç'!I81=\"\",\"\",'Önc. Alan Sonuç'!I81)","v":""},{"$f":"IF('Önc. Alan Sonuç'!J81=\"\",\"\",'Önc. Alan Sonuç'!J81)","v":""},{"$f":"IF('Önc. Alan Sonuç'!K81=\"\",\"\",'Önc. Alan Sonuç'!K81)","v":""},{"$f":"IF('Önc. Alan Sonuç'!L81=\"\",\"\",'Önc. Alan Sonuç'!L81)","v":""},{"$f":"IF('Önc. Alan Sonuç'!M81=\"\",\"\",'Önc. Alan Sonuç'!M81)","v":""},{"$f":"IF('Önc. Alan Sonuç'!N81=\"\",\"\",'Önc. Alan Sonuç'!N81)","v":""}]
[{"$f":"IF('Önc. Alan Sonuç'!A82=\"\",\"\",'Önc. Alan Sonuç'!A82)","v":""},{"$f":"IF('Önc. Alan Sonuç'!B82=\"\",\"\",LEFT('Önc. Alan Sonuç'!B82,3)&REPT(\"*\",4)&RIGHT('Önc. Alan Sonuç'!B82,2))","v":""},{"$f":"IF('Önc. Alan Sonuç'!C82=\"\",\"\",IF(ISERR(FIND(\" \",'Önc. Alan Sonuç'!C82))=TRUE,LEFT('Önc. Alan Sonuç'!C82,2)&REPT(\"*\",3),LEFT('Önc. Alan Sonuç'!C82,2)&REPT(\"*\",3)&\" \"&MID('Önc. Alan Sonuç'!C82,FIND(\" \",'Önc. Alan Sonuç'!C82)+1,2)&REPT(\"*\",3)))","v":""},{"$f":"IF('Önc. Alan Sonuç'!D82=\"\",\"\",IF(ISERR(FIND(\" \",'Önc. Alan Sonuç'!D82))=TRUE,LEFT('Önc. Alan Sonuç'!D82,2)&REPT(\"*\",3),LEFT('Önc. Alan Sonuç'!D82,2)&REPT(\"*\",3)&\" \"&MID('Önc. Alan Sonuç'!D82,FIND(\" \",'Önc. Alan Sonuç'!D82)+1,2)&REPT(\"*\",3)))","v":""},{"$f":"IF('Önc. Alan Sonuç'!E82=\"\",\"\",'Önc. Alan Sonuç'!E82)","v":""},{"$f":"IF('Önc. Alan Sonuç'!F82=\"\",\"\",'Önc. Alan Sonuç'!F82)","v":""},{"$f":"IF('Önc. Alan Sonuç'!G82=\"\",\"\",'Önc. Alan Sonuç'!G82)","v":""},{"$f":"IF('Önc. Alan Sonuç'!H82=\"\",\"\",'Önc. Alan Sonuç'!H82)","v":""},{"$f":"IF('Önc. Alan Sonuç'!I82=\"\",\"\",'Önc. Alan Sonuç'!I82)","v":""},{"$f":"IF('Önc. Alan Sonuç'!J82=\"\",\"\",'Önc. Alan Sonuç'!J82)","v":""},{"$f":"IF('Önc. Alan Sonuç'!K82=\"\",\"\",'Önc. Alan Sonuç'!K82)","v":""},{"$f":"IF('Önc. Alan Sonuç'!L82=\"\",\"\",'Önc. Alan Sonuç'!L82)","v":""},{"$f":"IF('Önc. Alan Sonuç'!M82=\"\",\"\",'Önc. Alan Sonuç'!M82)","v":""},{"$f":"IF('Önc. Alan Sonuç'!N82=\"\",\"\",'Önc. Alan Sonuç'!N82)","v":""}]
[{"$f":"IF('Önc. Alan Sonuç'!A83=\"\",\"\",'Önc. Alan Sonuç'!A83)","v":""},{"$f":"IF('Önc. Alan Sonuç'!B83=\"\",\"\",LEFT('Önc. Alan Sonuç'!B83,3)&REPT(\"*\",4)&RIGHT('Önc. Alan Sonuç'!B83,2))","v":""},{"$f":"IF('Önc. Alan Sonuç'!C83=\"\",\"\",IF(ISERR(FIND(\" \",'Önc. Alan Sonuç'!C83))=TRUE,LEFT('Önc. Alan Sonuç'!C83,2)&REPT(\"*\",3),LEFT('Önc. Alan Sonuç'!C83,2)&REPT(\"*\",3)&\" \"&MID('Önc. Alan Sonuç'!C83,FIND(\" \",'Önc. Alan Sonuç'!C83)+1,2)&REPT(\"*\",3)))","v":""},{"$f":"IF('Önc. Alan Sonuç'!D83=\"\",\"\",IF(ISERR(FIND(\" \",'Önc. Alan Sonuç'!D83))=TRUE,LEFT('Önc. Alan Sonuç'!D83,2)&REPT(\"*\",3),LEFT('Önc. Alan Sonuç'!D83,2)&REPT(\"*\",3)&\" \"&MID('Önc. Alan Sonuç'!D83,FIND(\" \",'Önc. Alan Sonuç'!D83)+1,2)&REPT(\"*\",3)))","v":""},{"$f":"IF('Önc. Alan Sonuç'!E83=\"\",\"\",'Önc. Alan Sonuç'!E83)","v":""},{"$f":"IF('Önc. Alan Sonuç'!F83=\"\",\"\",'Önc. Alan Sonuç'!F83)","v":""},{"$f":"IF('Önc. Alan Sonuç'!G83=\"\",\"\",'Önc. Alan Sonuç'!G83)","v":""},{"$f":"IF('Önc. Alan Sonuç'!H83=\"\",\"\",'Önc. Alan Sonuç'!H83)","v":""},{"$f":"IF('Önc. Alan Sonuç'!I83=\"\",\"\",'Önc. Alan Sonuç'!I83)","v":""},{"$f":"IF('Önc. Alan Sonuç'!J83=\"\",\"\",'Önc. Alan Sonuç'!J83)","v":""},{"$f":"IF('Önc. Alan Sonuç'!K83=\"\",\"\",'Önc. Alan Sonuç'!K83)","v":""},{"$f":"IF('Önc. Alan Sonuç'!L83=\"\",\"\",'Önc. Alan Sonuç'!L83)","v":""},{"$f":"IF('Önc. Alan Sonuç'!M83=\"\",\"\",'Önc. Alan Sonuç'!M83)","v":""},{"$f":"IF('Önc. Alan Sonuç'!N83=\"\",\"\",'Önc. Alan Sonuç'!N83)","v":""}]
[{"$f":"IF('Önc. Alan Sonuç'!A84=\"\",\"\",'Önc. Alan Sonuç'!A84)","v":""},{"$f":"IF('Önc. Alan Sonuç'!B84=\"\",\"\",LEFT('Önc. Alan Sonuç'!B84,3)&REPT(\"*\",4)&RIGHT('Önc. Alan Sonuç'!B84,2))","v":""},{"$f":"IF('Önc. Alan Sonuç'!C84=\"\",\"\",IF(ISERR(FIND(\" \",'Önc. Alan Sonuç'!C84))=TRUE,LEFT('Önc. Alan Sonuç'!C84,2)&REPT(\"*\",3),LEFT('Önc. Alan Sonuç'!C84,2)&REPT(\"*\",3)&\" \"&MID('Önc. Alan Sonuç'!C84,FIND(\" \",'Önc. Alan Sonuç'!C84)+1,2)&REPT(\"*\",3)))","v":""},{"$f":"IF('Önc. Alan Sonuç'!D84=\"\",\"\",IF(ISERR(FIND(\" \",'Önc. Alan Sonuç'!D84))=TRUE,LEFT('Önc. Alan Sonuç'!D84,2)&REPT(\"*\",3),LEFT('Önc. Alan Sonuç'!D84,2)&REPT(\"*\",3)&\" \"&MID('Önc. Alan Sonuç'!D84,FIND(\" \",'Önc. Alan Sonuç'!D84)+1,2)&REPT(\"*\",3)))","v":""},{"$f":"IF('Önc. Alan Sonuç'!E84=\"\",\"\",'Önc. Alan Sonuç'!E84)","v":""},{"$f":"IF('Önc. Alan Sonuç'!F84=\"\",\"\",'Önc. Alan Sonuç'!F84)","v":""},{"$f":"IF('Önc. Alan Sonuç'!G84=\"\",\"\",'Önc. Alan Sonuç'!G84)","v":""},{"$f":"IF('Önc. Alan Sonuç'!H84=\"\",\"\",'Önc. Alan Sonuç'!H84)","v":""},{"$f":"IF('Önc. Alan Sonuç'!I84=\"\",\"\",'Önc. Alan Sonuç'!I84)","v":""},{"$f":"IF('Önc. Alan Sonuç'!J84=\"\",\"\",'Önc. Alan Sonuç'!J84)","v":""},{"$f":"IF('Önc. Alan Sonuç'!K84=\"\",\"\",'Önc. Alan Sonuç'!K84)","v":""},{"$f":"IF('Önc. Alan Sonuç'!L84=\"\",\"\",'Önc. Alan Sonuç'!L84)","v":""},{"$f":"IF('Önc. Alan Sonuç'!M84=\"\",\"\",'Önc. Alan Sonuç'!M84)","v":""},{"$f":"IF('Önc. Alan Sonuç'!N84=\"\",\"\",'Önc. Alan Sonuç'!N84)","v":""}]
[{"$f":"IF('Önc. Alan Sonuç'!A85=\"\",\"\",'Önc. Alan Sonuç'!A85)","v":""},{"$f":"IF('Önc. Alan Sonuç'!B85=\"\",\"\",LEFT('Önc. Alan Sonuç'!B85,3)&REPT(\"*\",4)&RIGHT('Önc. Alan Sonuç'!B85,2))","v":""},{"$f":"IF('Önc. Alan Sonuç'!C85=\"\",\"\",IF(ISERR(FIND(\" \",'Önc. Alan Sonuç'!C85))=TRUE,LEFT('Önc. Alan Sonuç'!C85,2)&REPT(\"*\",3),LEFT('Önc. Alan Sonuç'!C85,2)&REPT(\"*\",3)&\" \"&MID('Önc. Alan Sonuç'!C85,FIND(\" \",'Önc. Alan Sonuç'!C85)+1,2)&REPT(\"*\",3)))","v":""},{"$f":"IF('Önc. Alan Sonuç'!D85=\"\",\"\",IF(ISERR(FIND(\" \",'Önc. Alan Sonuç'!D85))=TRUE,LEFT('Önc. Alan Sonuç'!D85,2)&REPT(\"*\",3),LEFT('Önc. Alan Sonuç'!D85,2)&REPT(\"*\",3)&\" \"&MID('Önc. Alan Sonuç'!D85,FIND(\" \",'Önc. Alan Sonuç'!D85)+1,2)&REPT(\"*\",3)))","v":""},{"$f":"IF('Önc. Alan Sonuç'!E85=\"\",\"\",'Önc. Alan Sonuç'!E85)","v":""},{"$f":"IF('Önc. Alan Sonuç'!F85=\"\",\"\",'Önc. Alan Sonuç'!F85)","v":""},{"$f":"IF('Önc. Alan Sonuç'!G85=\"\",\"\",'Önc. Alan Sonuç'!G85)","v":""},{"$f":"IF('Önc. Alan Sonuç'!H85=\"\",\"\",'Önc. Alan Sonuç'!H85)","v":""},{"$f":"IF('Önc. Alan Sonuç'!I85=\"\",\"\",'Önc. Alan Sonuç'!I85)","v":""},{"$f":"IF('Önc. Alan Sonuç'!J85=\"\",\"\",'Önc. Alan Sonuç'!J85)","v":""},{"$f":"IF('Önc. Alan Sonuç'!K85=\"\",\"\",'Önc. Alan Sonuç'!K85)","v":""},{"$f":"IF('Önc. Alan Sonuç'!L85=\"\",\"\",'Önc. Alan Sonuç'!L85)","v":""},{"$f":"IF('Önc. Alan Sonuç'!M85=\"\",\"\",'Önc. Alan Sonuç'!M85)","v":""},{"$f":"IF('Önc. Alan Sonuç'!N85=\"\",\"\",'Önc. Alan Sonuç'!N85)","v":""}]
[{"$f":"IF('Önc. Alan Sonuç'!A86=\"\",\"\",'Önc. Alan Sonuç'!A86)","v":""},{"$f":"IF('Önc. Alan Sonuç'!B86=\"\",\"\",LEFT('Önc. Alan Sonuç'!B86,3)&REPT(\"*\",4)&RIGHT('Önc. Alan Sonuç'!B86,2))","v":""},{"$f":"IF('Önc. Alan Sonuç'!C86=\"\",\"\",IF(ISERR(FIND(\" \",'Önc. Alan Sonuç'!C86))=TRUE,LEFT('Önc. Alan Sonuç'!C86,2)&REPT(\"*\",3),LEFT('Önc. Alan Sonuç'!C86,2)&REPT(\"*\",3)&\" \"&MID('Önc. Alan Sonuç'!C86,FIND(\" \",'Önc. Alan Sonuç'!C86)+1,2)&REPT(\"*\",3)))","v":""},{"$f":"IF('Önc. Alan Sonuç'!D86=\"\",\"\",IF(ISERR(FIND(\" \",'Önc. Alan Sonuç'!D86))=TRUE,LEFT('Önc. Alan Sonuç'!D86,2)&REPT(\"*\",3),LEFT('Önc. Alan Sonuç'!D86,2)&REPT(\"*\",3)&\" \"&MID('Önc. Alan Sonuç'!D86,FIND(\" \",'Önc. Alan Sonuç'!D86)+1,2)&REPT(\"*\",3)))","v":""},{"$f":"IF('Önc. Alan Sonuç'!E86=\"\",\"\",'Önc. Alan Sonuç'!E86)","v":""},{"$f":"IF('Önc. Alan Sonuç'!F86=\"\",\"\",'Önc. Alan Sonuç'!F86)","v":""},{"$f":"IF('Önc. Alan Sonuç'!G86=\"\",\"\",'Önc. Alan Sonuç'!G86)","v":""},{"$f":"IF('Önc. Alan Sonuç'!H86=\"\",\"\",'Önc. Alan Sonuç'!H86)","v":""},{"$f":"IF('Önc. Alan Sonuç'!I86=\"\",\"\",'Önc. Alan Sonuç'!I86)","v":""},{"$f":"IF('Önc. Alan Sonuç'!J86=\"\",\"\",'Önc. Alan Sonuç'!J86)","v":""},{"$f":"IF('Önc. Alan Sonuç'!K86=\"\",\"\",'Önc. Alan Sonuç'!K86)","v":""},{"$f":"IF('Önc. Alan Sonuç'!L86=\"\",\"\",'Önc. Alan Sonuç'!L86)","v":""},{"$f":"IF('Önc. Alan Sonuç'!M86=\"\",\"\",'Önc. Alan Sonuç'!M86)","v":""},{"$f":"IF('Önc. Alan Sonuç'!N86=\"\",\"\",'Önc. Alan Sonuç'!N86)","v":""}]
[{"$f":"IF('Önc. Alan Sonuç'!A87=\"\",\"\",'Önc. Alan Sonuç'!A87)","v":""},{"$f":"IF('Önc. Alan Sonuç'!B87=\"\",\"\",LEFT('Önc. Alan Sonuç'!B87,3)&REPT(\"*\",4)&RIGHT('Önc. Alan Sonuç'!B87,2))","v":""},{"$f":"IF('Önc. Alan Sonuç'!C87=\"\",\"\",IF(ISERR(FIND(\" \",'Önc. Alan Sonuç'!C87))=TRUE,LEFT('Önc. Alan Sonuç'!C87,2)&REPT(\"*\",3),LEFT('Önc. Alan Sonuç'!C87,2)&REPT(\"*\",3)&\" \"&MID('Önc. Alan Sonuç'!C87,FIND(\" \",'Önc. Alan Sonuç'!C87)+1,2)&REPT(\"*\",3)))","v":""},{"$f":"IF('Önc. Alan Sonuç'!D87=\"\",\"\",IF(ISERR(FIND(\" \",'Önc. Alan Sonuç'!D87))=TRUE,LEFT('Önc. Alan Sonuç'!D87,2)&REPT(\"*\",3),LEFT('Önc. Alan Sonuç'!D87,2)&REPT(\"*\",3)&\" \"&MID('Önc. Alan Sonuç'!D87,FIND(\" \",'Önc. Alan Sonuç'!D87)+1,2)&REPT(\"*\",3)))","v":""},{"$f":"IF('Önc. Alan Sonuç'!E87=\"\",\"\",'Önc. Alan Sonuç'!E87)","v":""},{"$f":"IF('Önc. Alan Sonuç'!F87=\"\",\"\",'Önc. Alan Sonuç'!F87)","v":""},{"$f":"IF('Önc. Alan Sonuç'!G87=\"\",\"\",'Önc. Alan Sonuç'!G87)","v":""},{"$f":"IF('Önc. Alan Sonuç'!H87=\"\",\"\",'Önc. Alan Sonuç'!H87)","v":""},{"$f":"IF('Önc. Alan Sonuç'!I87=\"\",\"\",'Önc. Alan Sonuç'!I87)","v":""},{"$f":"IF('Önc. Alan Sonuç'!J87=\"\",\"\",'Önc. Alan Sonuç'!J87)","v":""},{"$f":"IF('Önc. Alan Sonuç'!K87=\"\",\"\",'Önc. Alan Sonuç'!K87)","v":""},{"$f":"IF('Önc. Alan Sonuç'!L87=\"\",\"\",'Önc. Alan Sonuç'!L87)","v":""},{"$f":"IF('Önc. Alan Sonuç'!M87=\"\",\"\",'Önc. Alan Sonuç'!M87)","v":""},{"$f":"IF('Önc. Alan Sonuç'!N87=\"\",\"\",'Önc. Alan Sonuç'!N87)","v":""}]
[{"$f":"IF('Önc. Alan Sonuç'!A88=\"\",\"\",'Önc. Alan Sonuç'!A88)","v":""},{"$f":"IF('Önc. Alan Sonuç'!B88=\"\",\"\",LEFT('Önc. Alan Sonuç'!B88,3)&REPT(\"*\",4)&RIGHT('Önc. Alan Sonuç'!B88,2))","v":""},{"$f":"IF('Önc. Alan Sonuç'!C88=\"\",\"\",IF(ISERR(FIND(\" \",'Önc. Alan Sonuç'!C88))=TRUE,LEFT('Önc. Alan Sonuç'!C88,2)&REPT(\"*\",3),LEFT('Önc. Alan Sonuç'!C88,2)&REPT(\"*\",3)&\" \"&MID('Önc. Alan Sonuç'!C88,FIND(\" \",'Önc. Alan Sonuç'!C88)+1,2)&REPT(\"*\",3)))","v":""},{"$f":"IF('Önc. Alan Sonuç'!D88=\"\",\"\",IF(ISERR(FIND(\" \",'Önc. Alan Sonuç'!D88))=TRUE,LEFT('Önc. Alan Sonuç'!D88,2)&REPT(\"*\",3),LEFT('Önc. Alan Sonuç'!D88,2)&REPT(\"*\",3)&\" \"&MID('Önc. Alan Sonuç'!D88,FIND(\" \",'Önc. Alan Sonuç'!D88)+1,2)&REPT(\"*\",3)))","v":""},{"$f":"IF('Önc. Alan Sonuç'!E88=\"\",\"\",'Önc. Alan Sonuç'!E88)","v":""},{"$f":"IF('Önc. Alan Sonuç'!F88=\"\",\"\",'Önc. Alan Sonuç'!F88)","v":""},{"$f":"IF('Önc. Alan Sonuç'!G88=\"\",\"\",'Önc. Alan Sonuç'!G88)","v":""},{"$f":"IF('Önc. Alan Sonuç'!H88=\"\",\"\",'Önc. Alan Sonuç'!H88)","v":""},{"$f":"IF('Önc. Alan Sonuç'!I88=\"\",\"\",'Önc. Alan Sonuç'!I88)","v":""},{"$f":"IF('Önc. Alan Sonuç'!J88=\"\",\"\",'Önc. Alan Sonuç'!J88)","v":""},{"$f":"IF('Önc. Alan Sonuç'!K88=\"\",\"\",'Önc. Alan Sonuç'!K88)","v":""},{"$f":"IF('Önc. Alan Sonuç'!L88=\"\",\"\",'Önc. Alan Sonuç'!L88)","v":""},{"$f":"IF('Önc. Alan Sonuç'!M88=\"\",\"\",'Önc. Alan Sonuç'!M88)","v":""},{"$f":"IF('Önc. Alan Sonuç'!N88=\"\",\"\",'Önc. Alan Sonuç'!N88)","v":""}]
[{"$f":"IF('Önc. Alan Sonuç'!A89=\"\",\"\",'Önc. Alan Sonuç'!A89)","v":""},{"$f":"IF('Önc. Alan Sonuç'!B89=\"\",\"\",LEFT('Önc. Alan Sonuç'!B89,3)&REPT(\"*\",4)&RIGHT('Önc. Alan Sonuç'!B89,2))","v":""},{"$f":"IF('Önc. Alan Sonuç'!C89=\"\",\"\",IF(ISERR(FIND(\" \",'Önc. Alan Sonuç'!C89))=TRUE,LEFT('Önc. Alan Sonuç'!C89,2)&REPT(\"*\",3),LEFT('Önc. Alan Sonuç'!C89,2)&REPT(\"*\",3)&\" \"&MID('Önc. Alan Sonuç'!C89,FIND(\" \",'Önc. Alan Sonuç'!C89)+1,2)&REPT(\"*\",3)))","v":""},{"$f":"IF('Önc. Alan Sonuç'!D89=\"\",\"\",IF(ISERR(FIND(\" \",'Önc. Alan Sonuç'!D89))=TRUE,LEFT('Önc. Alan Sonuç'!D89,2)&REPT(\"*\",3),LEFT('Önc. Alan Sonuç'!D89,2)&REPT(\"*\",3)&\" \"&MID('Önc. Alan Sonuç'!D89,FIND(\" \",'Önc. Alan Sonuç'!D89)+1,2)&REPT(\"*\",3)))","v":""},{"$f":"IF('Önc. Alan Sonuç'!E89=\"\",\"\",'Önc. Alan Sonuç'!E89)","v":""},{"$f":"IF('Önc. Alan Sonuç'!F89=\"\",\"\",'Önc. Alan Sonuç'!F89)","v":""},{"$f":"IF('Önc. Alan Sonuç'!G89=\"\",\"\",'Önc. Alan Sonuç'!G89)","v":""},{"$f":"IF('Önc. Alan Sonuç'!H89=\"\",\"\",'Önc. Alan Sonuç'!H89)","v":""},{"$f":"IF('Önc. Alan Sonuç'!I89=\"\",\"\",'Önc. Alan Sonuç'!I89)","v":""},{"$f":"IF('Önc. Alan Sonuç'!J89=\"\",\"\",'Önc. Alan Sonuç'!J89)","v":""},{"$f":"IF('Önc. Alan Sonuç'!K89=\"\",\"\",'Önc. Alan Sonuç'!K89)","v":""},{"$f":"IF('Önc. Alan Sonuç'!L89=\"\",\"\",'Önc. Alan Sonuç'!L89)","v":""},{"$f":"IF('Önc. Alan Sonuç'!M89=\"\",\"\",'Önc. Alan Sonuç'!M89)","v":""},{"$f":"IF('Önc. Alan Sonuç'!N89=\"\",\"\",'Önc. Alan Sonuç'!N89)","v":""}]
[{"$f":"IF('Önc. Alan Sonuç'!A90=\"\",\"\",'Önc. Alan Sonuç'!A90)","v":""},{"$f":"IF('Önc. Alan Sonuç'!B90=\"\",\"\",LEFT('Önc. Alan Sonuç'!B90,3)&REPT(\"*\",4)&RIGHT('Önc. Alan Sonuç'!B90,2))","v":""},{"$f":"IF('Önc. Alan Sonuç'!C90=\"\",\"\",IF(ISERR(FIND(\" \",'Önc. Alan Sonuç'!C90))=TRUE,LEFT('Önc. Alan Sonuç'!C90,2)&REPT(\"*\",3),LEFT('Önc. Alan Sonuç'!C90,2)&REPT(\"*\",3)&\" \"&MID('Önc. Alan Sonuç'!C90,FIND(\" \",'Önc. Alan Sonuç'!C90)+1,2)&REPT(\"*\",3)))","v":""},{"$f":"IF('Önc. Alan Sonuç'!D90=\"\",\"\",IF(ISERR(FIND(\" \",'Önc. Alan Sonuç'!D90))=TRUE,LEFT('Önc. Alan Sonuç'!D90,2)&REPT(\"*\",3),LEFT('Önc. Alan Sonuç'!D90,2)&REPT(\"*\",3)&\" \"&MID('Önc. Alan Sonuç'!D90,FIND(\" \",'Önc. Alan Sonuç'!D90)+1,2)&REPT(\"*\",3)))","v":""},{"$f":"IF('Önc. Alan Sonuç'!E90=\"\",\"\",'Önc. Alan Sonuç'!E90)","v":""},{"$f":"IF('Önc. Alan Sonuç'!F90=\"\",\"\",'Önc. Alan Sonuç'!F90)","v":""},{"$f":"IF('Önc. Alan Sonuç'!G90=\"\",\"\",'Önc. Alan Sonuç'!G90)","v":""},{"$f":"IF('Önc. Alan Sonuç'!H90=\"\",\"\",'Önc. Alan Sonuç'!H90)","v":""},{"$f":"IF('Önc. Alan Sonuç'!I90=\"\",\"\",'Önc. Alan Sonuç'!I90)","v":""},{"$f":"IF('Önc. Alan Sonuç'!J90=\"\",\"\",'Önc. Alan Sonuç'!J90)","v":""},{"$f":"IF('Önc. Alan Sonuç'!K90=\"\",\"\",'Önc. Alan Sonuç'!K90)","v":""},{"$f":"IF('Önc. Alan Sonuç'!L90=\"\",\"\",'Önc. Alan Sonuç'!L90)","v":""},{"$f":"IF('Önc. Alan Sonuç'!M90=\"\",\"\",'Önc. Alan Sonuç'!M90)","v":""},{"$f":"IF('Önc. Alan Sonuç'!N90=\"\",\"\",'Önc. Alan Sonuç'!N90)","v":""}]
[{"$f":"IF('Önc. Alan Sonuç'!A91=\"\",\"\",'Önc. Alan Sonuç'!A91)","v":""},{"$f":"IF('Önc. Alan Sonuç'!B91=\"\",\"\",LEFT('Önc. Alan Sonuç'!B91,3)&REPT(\"*\",4)&RIGHT('Önc. Alan Sonuç'!B91,2))","v":""},{"$f":"IF('Önc. Alan Sonuç'!C91=\"\",\"\",IF(ISERR(FIND(\" \",'Önc. Alan Sonuç'!C91))=TRUE,LEFT('Önc. Alan Sonuç'!C91,2)&REPT(\"*\",3),LEFT('Önc. Alan Sonuç'!C91,2)&REPT(\"*\",3)&\" \"&MID('Önc. Alan Sonuç'!C91,FIND(\" \",'Önc. Alan Sonuç'!C91)+1,2)&REPT(\"*\",3)))","v":""},{"$f":"IF('Önc. Alan Sonuç'!D91=\"\",\"\",IF(ISERR(FIND(\" \",'Önc. Alan Sonuç'!D91))=TRUE,LEFT('Önc. Alan Sonuç'!D91,2)&REPT(\"*\",3),LEFT('Önc. Alan Sonuç'!D91,2)&REPT(\"*\",3)&\" \"&MID('Önc. Alan Sonuç'!D91,FIND(\" \",'Önc. Alan Sonuç'!D91)+1,2)&REPT(\"*\",3)))","v":""},{"$f":"IF('Önc. Alan Sonuç'!E91=\"\",\"\",'Önc. Alan Sonuç'!E91)","v":""},{"$f":"IF('Önc. Alan Sonuç'!F91=\"\",\"\",'Önc. Alan Sonuç'!F91)","v":""},{"$f":"IF('Önc. Alan Sonuç'!G91=\"\",\"\",'Önc. Alan Sonuç'!G91)","v":""},{"$f":"IF('Önc. Alan Sonuç'!H91=\"\",\"\",'Önc. Alan Sonuç'!H91)","v":""},{"$f":"IF('Önc. Alan Sonuç'!I91=\"\",\"\",'Önc. Alan Sonuç'!I91)","v":""},{"$f":"IF('Önc. Alan Sonuç'!J91=\"\",\"\",'Önc. Alan Sonuç'!J91)","v":""},{"$f":"IF('Önc. Alan Sonuç'!K91=\"\",\"\",'Önc. Alan Sonuç'!K91)","v":""},{"$f":"IF('Önc. Alan Sonuç'!L91=\"\",\"\",'Önc. Alan Sonuç'!L91)","v":""},{"$f":"IF('Önc. Alan Sonuç'!M91=\"\",\"\",'Önc. Alan Sonuç'!M91)","v":""},{"$f":"IF('Önc. Alan Sonuç'!N91=\"\",\"\",'Önc. Alan Sonuç'!N91)","v":""}]
[{"$f":"IF('Önc. Alan Sonuç'!A92=\"\",\"\",'Önc. Alan Sonuç'!A92)","v":""},{"$f":"IF('Önc. Alan Sonuç'!B92=\"\",\"\",LEFT('Önc. Alan Sonuç'!B92,3)&REPT(\"*\",4)&RIGHT('Önc. Alan Sonuç'!B92,2))","v":""},{"$f":"IF('Önc. Alan Sonuç'!C92=\"\",\"\",IF(ISERR(FIND(\" \",'Önc. Alan Sonuç'!C92))=TRUE,LEFT('Önc. Alan Sonuç'!C92,2)&REPT(\"*\",3),LEFT('Önc. Alan Sonuç'!C92,2)&REPT(\"*\",3)&\" \"&MID('Önc. Alan Sonuç'!C92,FIND(\" \",'Önc. Alan Sonuç'!C92)+1,2)&REPT(\"*\",3)))","v":""},{"$f":"IF('Önc. Alan Sonuç'!D92=\"\",\"\",IF(ISERR(FIND(\" \",'Önc. Alan Sonuç'!D92))=TRUE,LEFT('Önc. Alan Sonuç'!D92,2)&REPT(\"*\",3),LEFT('Önc. Alan Sonuç'!D92,2)&REPT(\"*\",3)&\" \"&MID('Önc. Alan Sonuç'!D92,FIND(\" \",'Önc. Alan Sonuç'!D92)+1,2)&REPT(\"*\",3)))","v":""},{"$f":"IF('Önc. Alan Sonuç'!E92=\"\",\"\",'Önc. Alan Sonuç'!E92)","v":""},{"$f":"IF('Önc. Alan Sonuç'!F92=\"\",\"\",'Önc. Alan Sonuç'!F92)","v":""},{"$f":"IF('Önc. Alan Sonuç'!G92=\"\",\"\",'Önc. Alan Sonuç'!G92)","v":""},{"$f":"IF('Önc. Alan Sonuç'!H92=\"\",\"\",'Önc. Alan Sonuç'!H92)","v":""},{"$f":"IF('Önc. Alan Sonuç'!I92=\"\",\"\",'Önc. Alan Sonuç'!I92)","v":""},{"$f":"IF('Önc. Alan Sonuç'!J92=\"\",\"\",'Önc. Alan Sonuç'!J92)","v":""},{"$f":"IF('Önc. Alan Sonuç'!K92=\"\",\"\",'Önc. Alan Sonuç'!K92)","v":""},{"$f":"IF('Önc. Alan Sonuç'!L92=\"\",\"\",'Önc. Alan Sonuç'!L92)","v":""},{"$f":"IF('Önc. Alan Sonuç'!M92=\"\",\"\",'Önc. Alan Sonuç'!M92)","v":""},{"$f":"IF('Önc. Alan Sonuç'!N92=\"\",\"\",'Önc. Alan Sonuç'!N92)","v":""}]
[{"$f":"IF('Önc. Alan Sonuç'!A93=\"\",\"\",'Önc. Alan Sonuç'!A93)","v":""},{"$f":"IF('Önc. Alan Sonuç'!B93=\"\",\"\",LEFT('Önc. Alan Sonuç'!B93,3)&REPT(\"*\",4)&RIGHT('Önc. Alan Sonuç'!B93,2))","v":""},{"$f":"IF('Önc. Alan Sonuç'!C93=\"\",\"\",IF(ISERR(FIND(\" \",'Önc. Alan Sonuç'!C93))=TRUE,LEFT('Önc. Alan Sonuç'!C93,2)&REPT(\"*\",3),LEFT('Önc. Alan Sonuç'!C93,2)&REPT(\"*\",3)&\" \"&MID('Önc. Alan Sonuç'!C93,FIND(\" \",'Önc. Alan Sonuç'!C93)+1,2)&REPT(\"*\",3)))","v":""},{"$f":"IF('Önc. Alan Sonuç'!D93=\"\",\"\",IF(ISERR(FIND(\" \",'Önc. Alan Sonuç'!D93))=TRUE,LEFT('Önc. Alan Sonuç'!D93,2)&REPT(\"*\",3),LEFT('Önc. Alan Sonuç'!D93,2)&REPT(\"*\",3)&\" \"&MID('Önc. Alan Sonuç'!D93,FIND(\" \",'Önc. Alan Sonuç'!D93)+1,2)&REPT(\"*\",3)))","v":""},{"$f":"IF('Önc. Alan Sonuç'!E93=\"\",\"\",'Önc. Alan Sonuç'!E93)","v":""},{"$f":"IF('Önc. Alan Sonuç'!F93=\"\",\"\",'Önc. Alan Sonuç'!F93)","v":""},{"$f":"IF('Önc. Alan Sonuç'!G93=\"\",\"\",'Önc. Alan Sonuç'!G93)","v":""},{"$f":"IF('Önc. Alan Sonuç'!H93=\"\",\"\",'Önc. Alan Sonuç'!H93)","v":""},{"$f":"IF('Önc. Alan Sonuç'!I93=\"\",\"\",'Önc. Alan Sonuç'!I93)","v":""},{"$f":"IF('Önc. Alan Sonuç'!J93=\"\",\"\",'Önc. Alan Sonuç'!J93)","v":""},{"$f":"IF('Önc. Alan Sonuç'!K93=\"\",\"\",'Önc. Alan Sonuç'!K93)","v":""},{"$f":"IF('Önc. Alan Sonuç'!L93=\"\",\"\",'Önc. Alan Sonuç'!L93)","v":""},{"$f":"IF('Önc. Alan Sonuç'!M93=\"\",\"\",'Önc. Alan Sonuç'!M93)","v":""},{"$f":"IF('Önc. Alan Sonuç'!N93=\"\",\"\",'Önc. Alan Sonuç'!N93)","v":""}]
[{"$f":"IF('Önc. Alan Sonuç'!A94=\"\",\"\",'Önc. Alan Sonuç'!A94)","v":""},{"$f":"IF('Önc. Alan Sonuç'!B94=\"\",\"\",LEFT('Önc. Alan Sonuç'!B94,3)&REPT(\"*\",4)&RIGHT('Önc. Alan Sonuç'!B94,2))","v":""},{"$f":"IF('Önc. Alan Sonuç'!C94=\"\",\"\",IF(ISERR(FIND(\" \",'Önc. Alan Sonuç'!C94))=TRUE,LEFT('Önc. Alan Sonuç'!C94,2)&REPT(\"*\",3),LEFT('Önc. Alan Sonuç'!C94,2)&REPT(\"*\",3)&\" \"&MID('Önc. Alan Sonuç'!C94,FIND(\" \",'Önc. Alan Sonuç'!C94)+1,2)&REPT(\"*\",3)))","v":""},{"$f":"IF('Önc. Alan Sonuç'!D94=\"\",\"\",IF(ISERR(FIND(\" \",'Önc. Alan Sonuç'!D94))=TRUE,LEFT('Önc. Alan Sonuç'!D94,2)&REPT(\"*\",3),LEFT('Önc. Alan Sonuç'!D94,2)&REPT(\"*\",3)&\" \"&MID('Önc. Alan Sonuç'!D94,FIND(\" \",'Önc. Alan Sonuç'!D94)+1,2)&REPT(\"*\",3)))","v":""},{"$f":"IF('Önc. Alan Sonuç'!E94=\"\",\"\",'Önc. Alan Sonuç'!E94)","v":""},{"$f":"IF('Önc. Alan Sonuç'!F94=\"\",\"\",'Önc. Alan Sonuç'!F94)","v":""},{"$f":"IF('Önc. Alan Sonuç'!G94=\"\",\"\",'Önc. Alan Sonuç'!G94)","v":""},{"$f":"IF('Önc. Alan Sonuç'!H94=\"\",\"\",'Önc. Alan Sonuç'!H94)","v":""},{"$f":"IF('Önc. Alan Sonuç'!I94=\"\",\"\",'Önc. Alan Sonuç'!I94)","v":""},{"$f":"IF('Önc. Alan Sonuç'!J94=\"\",\"\",'Önc. Alan Sonuç'!J94)","v":""},{"$f":"IF('Önc. Alan Sonuç'!K94=\"\",\"\",'Önc. Alan Sonuç'!K94)","v":""},{"$f":"IF('Önc. Alan Sonuç'!L94=\"\",\"\",'Önc. Alan Sonuç'!L94)","v":""},{"$f":"IF('Önc. Alan Sonuç'!M94=\"\",\"\",'Önc. Alan Sonuç'!M94)","v":""},{"$f":"IF('Önc. Alan Sonuç'!N94=\"\",\"\",'Önc. Alan Sonuç'!N94)","v":""}]
[{"$f":"IF('Önc. Alan Sonuç'!A95=\"\",\"\",'Önc. Alan Sonuç'!A95)","v":""},{"$f":"IF('Önc. Alan Sonuç'!B95=\"\",\"\",LEFT('Önc. Alan Sonuç'!B95,3)&REPT(\"*\",4)&RIGHT('Önc. Alan Sonuç'!B95,2))","v":""},{"$f":"IF('Önc. Alan Sonuç'!C95=\"\",\"\",IF(ISERR(FIND(\" \",'Önc. Alan Sonuç'!C95))=TRUE,LEFT('Önc. Alan Sonuç'!C95,2)&REPT(\"*\",3),LEFT('Önc. Alan Sonuç'!C95,2)&REPT(\"*\",3)&\" \"&MID('Önc. Alan Sonuç'!C95,FIND(\" \",'Önc. Alan Sonuç'!C95)+1,2)&REPT(\"*\",3)))","v":""},{"$f":"IF('Önc. Alan Sonuç'!D95=\"\",\"\",IF(ISERR(FIND(\" \",'Önc. Alan Sonuç'!D95))=TRUE,LEFT('Önc. Alan Sonuç'!D95,2)&REPT(\"*\",3),LEFT('Önc. Alan Sonuç'!D95,2)&REPT(\"*\",3)&\" \"&MID('Önc. Alan Sonuç'!D95,FIND(\" \",'Önc. Alan Sonuç'!D95)+1,2)&REPT(\"*\",3)))","v":""},{"$f":"IF('Önc. Alan Sonuç'!E95=\"\",\"\",'Önc. Alan Sonuç'!E95)","v":""},{"$f":"IF('Önc. Alan Sonuç'!F95=\"\",\"\",'Önc. Alan Sonuç'!F95)","v":""},{"$f":"IF('Önc. Alan Sonuç'!G95=\"\",\"\",'Önc. Alan Sonuç'!G95)","v":""},{"$f":"IF('Önc. Alan Sonuç'!H95=\"\",\"\",'Önc. Alan Sonuç'!H95)","v":""},{"$f":"IF('Önc. Alan Sonuç'!I95=\"\",\"\",'Önc. Alan Sonuç'!I95)","v":""},{"$f":"IF('Önc. Alan Sonuç'!J95=\"\",\"\",'Önc. Alan Sonuç'!J95)","v":""},{"$f":"IF('Önc. Alan Sonuç'!K95=\"\",\"\",'Önc. Alan Sonuç'!K95)","v":""},{"$f":"IF('Önc. Alan Sonuç'!L95=\"\",\"\",'Önc. Alan Sonuç'!L95)","v":""},{"$f":"IF('Önc. Alan Sonuç'!M95=\"\",\"\",'Önc. Alan Sonuç'!M95)","v":""},{"$f":"IF('Önc. Alan Sonuç'!N95=\"\",\"\",'Önc. Alan Sonuç'!N95)","v":""}]
[{"$f":"IF('Önc. Alan Sonuç'!A96=\"\",\"\",'Önc. Alan Sonuç'!A96)","v":""},{"$f":"IF('Önc. Alan Sonuç'!B96=\"\",\"\",LEFT('Önc. Alan Sonuç'!B96,3)&REPT(\"*\",4)&RIGHT('Önc. Alan Sonuç'!B96,2))","v":""},{"$f":"IF('Önc. Alan Sonuç'!C96=\"\",\"\",IF(ISERR(FIND(\" \",'Önc. Alan Sonuç'!C96))=TRUE,LEFT('Önc. Alan Sonuç'!C96,2)&REPT(\"*\",3),LEFT('Önc. Alan Sonuç'!C96,2)&REPT(\"*\",3)&\" \"&MID('Önc. Alan Sonuç'!C96,FIND(\" \",'Önc. Alan Sonuç'!C96)+1,2)&REPT(\"*\",3)))","v":""},{"$f":"IF('Önc. Alan Sonuç'!D96=\"\",\"\",IF(ISERR(FIND(\" \",'Önc. Alan Sonuç'!D96))=TRUE,LEFT('Önc. Alan Sonuç'!D96,2)&REPT(\"*\",3),LEFT('Önc. Alan Sonuç'!D96,2)&REPT(\"*\",3)&\" \"&MID('Önc. Alan Sonuç'!D96,FIND(\" \",'Önc. Alan Sonuç'!D96)+1,2)&REPT(\"*\",3)))","v":""},{"$f":"IF('Önc. Alan Sonuç'!E96=\"\",\"\",'Önc. Alan Sonuç'!E96)","v":""},{"$f":"IF('Önc. Alan Sonuç'!F96=\"\",\"\",'Önc. Alan Sonuç'!F96)","v":""},{"$f":"IF('Önc. Alan Sonuç'!G96=\"\",\"\",'Önc. Alan Sonuç'!G96)","v":""},{"$f":"IF('Önc. Alan Sonuç'!H96=\"\",\"\",'Önc. Alan Sonuç'!H96)","v":""},{"$f":"IF('Önc. Alan Sonuç'!I96=\"\",\"\",'Önc. Alan Sonuç'!I96)","v":""},{"$f":"IF('Önc. Alan Sonuç'!J96=\"\",\"\",'Önc. Alan Sonuç'!J96)","v":""},{"$f":"IF('Önc. Alan Sonuç'!K96=\"\",\"\",'Önc. Alan Sonuç'!K96)","v":""},{"$f":"IF('Önc. Alan Sonuç'!L96=\"\",\"\",'Önc. Alan Sonuç'!L96)","v":""},{"$f":"IF('Önc. Alan Sonuç'!M96=\"\",\"\",'Önc. Alan Sonuç'!M96)","v":""},{"$f":"IF('Önc. Alan Sonuç'!N96=\"\",\"\",'Önc. Alan Sonuç'!N96)","v":""}]
[{"$f":"IF('Önc. Alan Sonuç'!A97=\"\",\"\",'Önc. Alan Sonuç'!A97)","v":""},{"$f":"IF('Önc. Alan Sonuç'!B97=\"\",\"\",LEFT('Önc. Alan Sonuç'!B97,3)&REPT(\"*\",4)&RIGHT('Önc. Alan Sonuç'!B97,2))","v":""},{"$f":"IF('Önc. Alan Sonuç'!C97=\"\",\"\",IF(ISERR(FIND(\" \",'Önc. Alan Sonuç'!C97))=TRUE,LEFT('Önc. Alan Sonuç'!C97,2)&REPT(\"*\",3),LEFT('Önc. Alan Sonuç'!C97,2)&REPT(\"*\",3)&\" \"&MID('Önc. Alan Sonuç'!C97,FIND(\" \",'Önc. Alan Sonuç'!C97)+1,2)&REPT(\"*\",3)))","v":""},{"$f":"IF('Önc. Alan Sonuç'!D97=\"\",\"\",IF(ISERR(FIND(\" \",'Önc. Alan Sonuç'!D97))=TRUE,LEFT('Önc. Alan Sonuç'!D97,2)&REPT(\"*\",3),LEFT('Önc. Alan Sonuç'!D97,2)&REPT(\"*\",3)&\" \"&MID('Önc. Alan Sonuç'!D97,FIND(\" \",'Önc. Alan Sonuç'!D97)+1,2)&REPT(\"*\",3)))","v":""},{"$f":"IF('Önc. Alan Sonuç'!E97=\"\",\"\",'Önc. Alan Sonuç'!E97)","v":""},{"$f":"IF('Önc. Alan Sonuç'!F97=\"\",\"\",'Önc. Alan Sonuç'!F97)","v":""},{"$f":"IF('Önc. Alan Sonuç'!G97=\"\",\"\",'Önc. Alan Sonuç'!G97)","v":""},{"$f":"IF('Önc. Alan Sonuç'!H97=\"\",\"\",'Önc. Alan Sonuç'!H97)","v":""},{"$f":"IF('Önc. Alan Sonuç'!I97=\"\",\"\",'Önc. Alan Sonuç'!I97)","v":""},{"$f":"IF('Önc. Alan Sonuç'!J97=\"\",\"\",'Önc. Alan Sonuç'!J97)","v":""},{"$f":"IF('Önc. Alan Sonuç'!K97=\"\",\"\",'Önc. Alan Sonuç'!K97)","v":""},{"$f":"IF('Önc. Alan Sonuç'!L97=\"\",\"\",'Önc. Alan Sonuç'!L97)","v":""},{"$f":"IF('Önc. Alan Sonuç'!M97=\"\",\"\",'Önc. Alan Sonuç'!M97)","v":""},{"$f":"IF('Önc. Alan Sonuç'!N97=\"\",\"\",'Önc. Alan Sonuç'!N97)","v":""}]
[{"$f":"IF('Önc. Alan Sonuç'!A98=\"\",\"\",'Önc. Alan Sonuç'!A98)","v":""},{"$f":"IF('Önc. Alan Sonuç'!B98=\"\",\"\",LEFT('Önc. Alan Sonuç'!B98,3)&REPT(\"*\",4)&RIGHT('Önc. Alan Sonuç'!B98,2))","v":""},{"$f":"IF('Önc. Alan Sonuç'!C98=\"\",\"\",IF(ISERR(FIND(\" \",'Önc. Alan Sonuç'!C98))=TRUE,LEFT('Önc. Alan Sonuç'!C98,2)&REPT(\"*\",3),LEFT('Önc. Alan Sonuç'!C98,2)&REPT(\"*\",3)&\" \"&MID('Önc. Alan Sonuç'!C98,FIND(\" \",'Önc. Alan Sonuç'!C98)+1,2)&REPT(\"*\",3)))","v":""},{"$f":"IF('Önc. Alan Sonuç'!D98=\"\",\"\",IF(ISERR(FIND(\" \",'Önc. Alan Sonuç'!D98))=TRUE,LEFT('Önc. Alan Sonuç'!D98,2)&REPT(\"*\",3),LEFT('Önc. Alan Sonuç'!D98,2)&REPT(\"*\",3)&\" \"&MID('Önc. Alan Sonuç'!D98,FIND(\" \",'Önc. Alan Sonuç'!D98)+1,2)&REPT(\"*\",3)))","v":""},{"$f":"IF('Önc. Alan Sonuç'!E98=\"\",\"\",'Önc. Alan Sonuç'!E98)","v":""},{"$f":"IF('Önc. Alan Sonuç'!F98=\"\",\"\",'Önc. Alan Sonuç'!F98)","v":""},{"$f":"IF('Önc. Alan Sonuç'!G98=\"\",\"\",'Önc. Alan Sonuç'!G98)","v":""},{"$f":"IF('Önc. Alan Sonuç'!H98=\"\",\"\",'Önc. Alan Sonuç'!H98)","v":""},{"$f":"IF('Önc. Alan Sonuç'!I98=\"\",\"\",'Önc. Alan Sonuç'!I98)","v":""},{"$f":"IF('Önc. Alan Sonuç'!J98=\"\",\"\",'Önc. Alan Sonuç'!J98)","v":""},{"$f":"IF('Önc. Alan Sonuç'!K98=\"\",\"\",'Önc. Alan Sonuç'!K98)","v":""},{"$f":"IF('Önc. Alan Sonuç'!L98=\"\",\"\",'Önc. Alan Sonuç'!L98)","v":""},{"$f":"IF('Önc. Alan Sonuç'!M98=\"\",\"\",'Önc. Alan Sonuç'!M98)","v":""},{"$f":"IF('Önc. Alan Sonuç'!N98=\"\",\"\",'Önc. Alan Sonuç'!N98)","v":""}]
[{"$f":"IF('Önc. Alan Sonuç'!A99=\"\",\"\",'Önc. Alan Sonuç'!A99)","v":""},{"$f":"IF('Önc. Alan Sonuç'!B99=\"\",\"\",LEFT('Önc. Alan Sonuç'!B99,3)&REPT(\"*\",4)&RIGHT('Önc. Alan Sonuç'!B99,2))","v":""},{"$f":"IF('Önc. Alan Sonuç'!C99=\"\",\"\",IF(ISERR(FIND(\" \",'Önc. Alan Sonuç'!C99))=TRUE,LEFT('Önc. Alan Sonuç'!C99,2)&REPT(\"*\",3),LEFT('Önc. Alan Sonuç'!C99,2)&REPT(\"*\",3)&\" \"&MID('Önc. Alan Sonuç'!C99,FIND(\" \",'Önc. Alan Sonuç'!C99)+1,2)&REPT(\"*\",3)))","v":""},{"$f":"IF('Önc. Alan Sonuç'!D99=\"\",\"\",IF(ISERR(FIND(\" \",'Önc. Alan Sonuç'!D99))=TRUE,LEFT('Önc. Alan Sonuç'!D99,2)&REPT(\"*\",3),LEFT('Önc. Alan Sonuç'!D99,2)&REPT(\"*\",3)&\" \"&MID('Önc. Alan Sonuç'!D99,FIND(\" \",'Önc. Alan Sonuç'!D99)+1,2)&REPT(\"*\",3)))","v":""},{"$f":"IF('Önc. Alan Sonuç'!E99=\"\",\"\",'Önc. Alan Sonuç'!E99)","v":""},{"$f":"IF('Önc. Alan Sonuç'!F99=\"\",\"\",'Önc. Alan Sonuç'!F99)","v":""},{"$f":"IF('Önc. Alan Sonuç'!G99=\"\",\"\",'Önc. Alan Sonuç'!G99)","v":""},{"$f":"IF('Önc. Alan Sonuç'!H99=\"\",\"\",'Önc. Alan Sonuç'!H99)","v":""},{"$f":"IF('Önc. Alan Sonuç'!I99=\"\",\"\",'Önc. Alan Sonuç'!I99)","v":""},{"$f":"IF('Önc. Alan Sonuç'!J99=\"\",\"\",'Önc. Alan Sonuç'!J99)","v":""},{"$f":"IF('Önc. Alan Sonuç'!K99=\"\",\"\",'Önc. Alan Sonuç'!K99)","v":""},{"$f":"IF('Önc. Alan Sonuç'!L99=\"\",\"\",'Önc. Alan Sonuç'!L99)","v":""},{"$f":"IF('Önc. Alan Sonuç'!M99=\"\",\"\",'Önc. Alan Sonuç'!M99)","v":""},{"$f":"IF('Önc. Alan Sonuç'!N99=\"\",\"\",'Önc. Alan Sonuç'!N99)","v":""}]
[{"$f":"IF('Önc. Alan Sonuç'!A100=\"\",\"\",'Önc. Alan Sonuç'!A100)","v":""},{"$f":"IF('Önc. Alan Sonuç'!B100=\"\",\"\",LEFT('Önc. Alan Sonuç'!B100,3)&REPT(\"*\",4)&RIGHT('Önc. Alan Sonuç'!B100,2))","v":""},{"$f":"IF('Önc. Alan Sonuç'!C100=\"\",\"\",IF(ISERR(FIND(\" \",'Önc. Alan Sonuç'!C100))=TRUE,LEFT('Önc. Alan Sonuç'!C100,2)&REPT(\"*\",3),LEFT('Önc. Alan Sonuç'!C100,2)&REPT(\"*\",3)&\" \"&MID('Önc. Alan Sonuç'!C100,FIND(\" \",'Önc. Alan Sonuç'!C100)+1,2)&REPT(\"*\",3)))","v":""},{"$f":"IF('Önc. Alan Sonuç'!D100=\"\",\"\",IF(ISERR(FIND(\" \",'Önc. Alan Sonuç'!D100))=TRUE,LEFT('Önc. Alan Sonuç'!D100,2)&REPT(\"*\",3),LEFT('Önc. Alan Sonuç'!D100,2)&REPT(\"*\",3)&\" \"&MID('Önc. Alan Sonuç'!D100,FIND(\" \",'Önc. Alan Sonuç'!D100)+1,2)&REPT(\"*\",3)))","v":""},{"$f":"IF('Önc. Alan Sonuç'!E100=\"\",\"\",'Önc. Alan Sonuç'!E100)","v":""},{"$f":"IF('Önc. Alan Sonuç'!F100=\"\",\"\",'Önc. Alan Sonuç'!F100)","v":""},{"$f":"IF('Önc. Alan Sonuç'!G100=\"\",\"\",'Önc. Alan Sonuç'!G100)","v":""},{"$f":"IF('Önc. Alan Sonuç'!H100=\"\",\"\",'Önc. Alan Sonuç'!H100)","v":""},{"$f":"IF('Önc. Alan Sonuç'!I100=\"\",\"\",'Önc. Alan Sonuç'!I100)","v":""},{"$f":"IF('Önc. Alan Sonuç'!J100=\"\",\"\",'Önc. Alan Sonuç'!J100)","v":""},{"$f":"IF('Önc. Alan Sonuç'!K100=\"\",\"\",'Önc. Alan Sonuç'!K100)","v":""},{"$f":"IF('Önc. Alan Sonuç'!L100=\"\",\"\",'Önc. Alan Sonuç'!L100)","v":""},{"$f":"IF('Önc. Alan Sonuç'!M100=\"\",\"\",'Önc. Alan Sonuç'!M100)","v":""},{"$f":"IF('Önc. Alan Sonuç'!N100=\"\",\"\",'Önc. Alan Sonuç'!N100)","v":""}]
[{"$f":"IF('Önc. Alan Sonuç'!A101=\"\",\"\",'Önc. Alan Sonuç'!A101)","v":""},{"$f":"IF('Önc. Alan Sonuç'!B101=\"\",\"\",LEFT('Önc. Alan Sonuç'!B101,3)&REPT(\"*\",4)&RIGHT('Önc. Alan Sonuç'!B101,2))","v":""},{"$f":"IF('Önc. Alan Sonuç'!C101=\"\",\"\",IF(ISERR(FIND(\" \",'Önc. Alan Sonuç'!C101))=TRUE,LEFT('Önc. Alan Sonuç'!C101,2)&REPT(\"*\",3),LEFT('Önc. Alan Sonuç'!C101,2)&REPT(\"*\",3)&\" \"&MID('Önc. Alan Sonuç'!C101,FIND(\" \",'Önc. Alan Sonuç'!C101)+1,2)&REPT(\"*\",3)))","v":""},{"$f":"IF('Önc. Alan Sonuç'!D101=\"\",\"\",IF(ISERR(FIND(\" \",'Önc. Alan Sonuç'!D101))=TRUE,LEFT('Önc. Alan Sonuç'!D101,2)&REPT(\"*\",3),LEFT('Önc. Alan Sonuç'!D101,2)&REPT(\"*\",3)&\" \"&MID('Önc. Alan Sonuç'!D101,FIND(\" \",'Önc. Alan Sonuç'!D101)+1,2)&REPT(\"*\",3)))","v":""},{"$f":"IF('Önc. Alan Sonuç'!E101=\"\",\"\",'Önc. Alan Sonuç'!E101)","v":""},{"$f":"IF('Önc. Alan Sonuç'!F101=\"\",\"\",'Önc. Alan Sonuç'!F101)","v":""},{"$f":"IF('Önc. Alan Sonuç'!G101=\"\",\"\",'Önc. Alan Sonuç'!G101)","v":""},{"$f":"IF('Önc. Alan Sonuç'!H101=\"\",\"\",'Önc. Alan Sonuç'!H101)","v":""},{"$f":"IF('Önc. Alan Sonuç'!I101=\"\",\"\",'Önc. Alan Sonuç'!I101)","v":""},{"$f":"IF('Önc. Alan Sonuç'!J101=\"\",\"\",'Önc. Alan Sonuç'!J101)","v":""},{"$f":"IF('Önc. Alan Sonuç'!K101=\"\",\"\",'Önc. Alan Sonuç'!K101)","v":""},{"$f":"IF('Önc. Alan Sonuç'!L101=\"\",\"\",'Önc. Alan Sonuç'!L101)","v":""},{"$f":"IF('Önc. Alan Sonuç'!M101=\"\",\"\",'Önc. Alan Sonuç'!M101)","v":""},{"$f":"IF('Önc. Alan Sonuç'!N101=\"\",\"\",'Önc. Alan Sonuç'!N101)","v":""}]
[{"$f":"IF('Önc. Alan Sonuç'!A102=\"\",\"\",'Önc. Alan Sonuç'!A102)","v":""},{"$f":"IF('Önc. Alan Sonuç'!B102=\"\",\"\",LEFT('Önc. Alan Sonuç'!B102,3)&REPT(\"*\",4)&RIGHT('Önc. Alan Sonuç'!B102,2))","v":""},{"$f":"IF('Önc. Alan Sonuç'!C102=\"\",\"\",IF(ISERR(FIND(\" \",'Önc. Alan Sonuç'!C102))=TRUE,LEFT('Önc. Alan Sonuç'!C102,2)&REPT(\"*\",3),LEFT('Önc. Alan Sonuç'!C102,2)&REPT(\"*\",3)&\" \"&MID('Önc. Alan Sonuç'!C102,FIND(\" \",'Önc. Alan Sonuç'!C102)+1,2)&REPT(\"*\",3)))","v":""},{"$f":"IF('Önc. Alan Sonuç'!D102=\"\",\"\",IF(ISERR(FIND(\" \",'Önc. Alan Sonuç'!D102))=TRUE,LEFT('Önc. Alan Sonuç'!D102,2)&REPT(\"*\",3),LEFT('Önc. Alan Sonuç'!D102,2)&REPT(\"*\",3)&\" \"&MID('Önc. Alan Sonuç'!D102,FIND(\" \",'Önc. Alan Sonuç'!D102)+1,2)&REPT(\"*\",3)))","v":""},{"$f":"IF('Önc. Alan Sonuç'!E102=\"\",\"\",'Önc. Alan Sonuç'!E102)","v":""},{"$f":"IF('Önc. Alan Sonuç'!F102=\"\",\"\",'Önc. Alan Sonuç'!F102)","v":""},{"$f":"IF('Önc. Alan Sonuç'!G102=\"\",\"\",'Önc. Alan Sonuç'!G102)","v":""},{"$f":"IF('Önc. Alan Sonuç'!H102=\"\",\"\",'Önc. Alan Sonuç'!H102)","v":""},{"$f":"IF('Önc. Alan Sonuç'!I102=\"\",\"\",'Önc. Alan Sonuç'!I102)","v":""},{"$f":"IF('Önc. Alan Sonuç'!J102=\"\",\"\",'Önc. Alan Sonuç'!J102)","v":""},{"$f":"IF('Önc. Alan Sonuç'!K102=\"\",\"\",'Önc. Alan Sonuç'!K102)","v":""},{"$f":"IF('Önc. Alan Sonuç'!L102=\"\",\"\",'Önc. Alan Sonuç'!L102)","v":""},{"$f":"IF('Önc. Alan Sonuç'!M102=\"\",\"\",'Önc. Alan Sonuç'!M102)","v":""},{"$f":"IF('Önc. Alan Sonuç'!N102=\"\",\"\",'Önc. Alan Sonuç'!N102)","v":""}]
[{"$f":"IF('Önc. Alan Sonuç'!A103=\"\",\"\",'Önc. Alan Sonuç'!A103)","v":""},{"$f":"IF('Önc. Alan Sonuç'!B103=\"\",\"\",LEFT('Önc. Alan Sonuç'!B103,3)&REPT(\"*\",4)&RIGHT('Önc. Alan Sonuç'!B103,2))","v":""},{"$f":"IF('Önc. Alan Sonuç'!C103=\"\",\"\",IF(ISERR(FIND(\" \",'Önc. Alan Sonuç'!C103))=TRUE,LEFT('Önc. Alan Sonuç'!C103,2)&REPT(\"*\",3),LEFT('Önc. Alan Sonuç'!C103,2)&REPT(\"*\",3)&\" \"&MID('Önc. Alan Sonuç'!C103,FIND(\" \",'Önc. Alan Sonuç'!C103)+1,2)&REPT(\"*\",3)))","v":""},{"$f":"IF('Önc. Alan Sonuç'!D103=\"\",\"\",IF(ISERR(FIND(\" \",'Önc. Alan Sonuç'!D103))=TRUE,LEFT('Önc. Alan Sonuç'!D103,2)&REPT(\"*\",3),LEFT('Önc. Alan Sonuç'!D103,2)&REPT(\"*\",3)&\" \"&MID('Önc. Alan Sonuç'!D103,FIND(\" \",'Önc. Alan Sonuç'!D103)+1,2)&REPT(\"*\",3)))","v":""},{"$f":"IF('Önc. Alan Sonuç'!E103=\"\",\"\",'Önc. Alan Sonuç'!E103)","v":""},{"$f":"IF('Önc. Alan Sonuç'!F103=\"\",\"\",'Önc. Alan Sonuç'!F103)","v":""},{"$f":"IF('Önc. Alan Sonuç'!G103=\"\",\"\",'Önc. Alan Sonuç'!G103)","v":""},{"$f":"IF('Önc. Alan Sonuç'!H103=\"\",\"\",'Önc. Alan Sonuç'!H103)","v":""},{"$f":"IF('Önc. Alan Sonuç'!I103=\"\",\"\",'Önc. Alan Sonuç'!I103)","v":""},{"$f":"IF('Önc. Alan Sonuç'!J103=\"\",\"\",'Önc. Alan Sonuç'!J103)","v":""},{"$f":"IF('Önc. Alan Sonuç'!K103=\"\",\"\",'Önc. Alan Sonuç'!K103)","v":""},{"$f":"IF('Önc. Alan Sonuç'!L103=\"\",\"\",'Önc. Alan Sonuç'!L103)","v":""},{"$f":"IF('Önc. Alan Sonuç'!M103=\"\",\"\",'Önc. Alan Sonuç'!M103)","v":""},{"$f":"IF('Önc. Alan Sonuç'!N103=\"\",\"\",'Önc. Alan Sonuç'!N103)","v":""}]