{"text_format":"1","workbook":"xlsx","n_sheets":6,"sheets":["Yab.Dil Ön Değ","Ön Değ. Rapor","Yab. Dil. Öğr. Gör. Sonuç","Sonuç Rapor","Ulus.İlişkiler.Sonuç","Ulus.İlişkiler.Sonuç Rapor"],"not_rendered":{"charts":0,"images":1,"macros":1,"external_links":0,"defined_names":2,"comments":0,"pivot_tables":0},"unopened":[],"bounds":{"document_bytes":16777216,"sheet_cells":100000,"rows_first":2000,"rows_last":500,"rows_between":2000,"halvings":0,"cell_chars":16384,"cell_head_chars":4096},"cells_cut":0,"cells_raw":0,"read":"whole","date_system":"1900"}

{"sheet":"Yab.Dil Ön Değ","index":0,"n_rows":30,"n_cols":16,"rows_kept":30,"cut":false,"hidden":false,"merged":[[4,2,4,3],[4,4,4,7],[4,8,4,11],[31,0,31,11],[0,0,0,11],[1,0,1,11],[2,0,2,11],[3,0,3,11],[8,0,8,1],[5,0,5,1],[6,0,6,1],[7,0,7,1],[8,2,8,11],[4,0,4,1],[9,0,9,3],[9,4,9,11],[5,2,5,3],[5,4,5,7],[5,8,5,11],[10,0,11,0],[10,7,11,7],[10,8,10,11],[10,4,10,6],[10,1,10,3],[7,2,7,3],[7,4,7,7],[7,8,7,11],[6,2,6,3],[6,4,6,7],[6,8,6,11]]}
["T.C."]
["BAYBURT ÜNİVERSİTESİ"]
["ÖĞRETİM ELEMANI ÖN DEĞERLENDİRME TUTANAĞI"]
["Üniversitemize bağlı birimlere, 2547 sayılı Kanunun ilgili maddeleri ve 09.11.2018 tarihli ve 30590 sayılı Resmi Gazetede yayımlanan \"Öğretim Üyesi Dışındaki Öğretim Elemanı Kadrolarına Yapılacak Atamalarda Uygulanacak Merkezi Sınav İle Giriş Sınavlarına İlişkin Usul ve Esaslar Hakkında Yönetmelik” 10. Maddesi Uyarınca Lisans ve Ön Lisans Düzeyindeki Eğitim Veren Yerlere Alınacak Akademik Personele Ait Ön Değerlendirme Sonuç Tutanağı  ",null,null,null,null,null,null,null,null,null,null,null,null,null,null,"                                                                                                                                                                   "]
["İlan No:",null,null,null,"Birimi:",null,null,null,"Rektörlük"]
["İlan Tarihi:",null,"…/.../....",null,"Bölümü:",null,null,null,"….. Bölümü / Ulusarası İlişkiler Ofisi"]
["Kadro Unvanı:",null,"Öğretim Görevlisi (Yabancı Dil Zorunlu Ortak Ders / Uluslararası İlişkiler Ofisi-Uyg. Birim)",null,"Alanı:"]
["Kadro Adedi:",null,null,null,"Öndeğerlendirme Tarihi:",null,null,null,"…/.../...."]
["İlan Özel Şartı:"]
["SINAVIN YAPILACAĞI YER, TARİH ve SAAT :",null,null,null,"……...     ../…/…. Günü Saat: …:…."]
["Sıra No","Başvuranın",null,null,"Başvuru Şartı",null,null,"İlan Şartına Uygunluğu (Tecrübe / Nitelikler)","Ön Sıralama Değerlendirme Sonuçları"]
[null,"T.C. Kimlik No","Adı","Soyadı","Alanındaki Ales Puanı","Yabancı Dil Puanı (Min. 85)","Tezli Yüksek Lisans Belgesi",null,"ALES  (%40)","Yabancı Dil Puanı (%60)","Toplam Puan","Ön Değerlendirme Sonucu      "]
[1,11111111111,"Örnek","Örnek",81.505549999999999,95,"Mevcut","Uygun",{"$f":"E13*0.4","v":32.602220000000003},{"$f":"F13*0.6","v":57},{"$f":"I13+J13","v":89.602220000000003},"Sınava Girebilir"]
[2,11111111111,"Örnek Örnek","Örnek",80.607429999999994,94,"Mevcut","Uygun",32.242972000000002,56.4,88.642972,"Sınava Girebilir"]
[3,11111111111,"Örnek","Örnek Örnek",79.275630000000007,93,"Mevcut","Uygun",31.710252000000004,55.8,87.510252000000008,"Sınava Girebilir"]
[4,11111111111,"Örnek Örnek","Örnek Örnek",78.113749999999996,90,"Mevcut","Uygun",31.2455,54,85.245499999999993,"Sınava Girebilir"]
[5,11111111111,"Örnek","Örnek",77.505549999999999,89,"Mevcut","Uygun",31.002220000000001,53.4,84.40222,"Sınava Girebilir"]
[6,11111111111,"Örnek","Örnek",76.607429999999994,88,"Mevcut","Uygun",30.642972,52.8,83.442971999999997,"Sınava Girebilir"]
[7,11111111111,"Örnek","Örnek",75.275630000000007,86,"Mevcut","Uygun",30.110252000000003,51.6,81.710251999999997,"Sınava Girebilir"]
[8,11111111111,"Örnek","Örnek",74.113749999999996,85,"Mevcut","Uygun",29.645499999999998,51,80.645499999999998,"Sınava Girebilir"]
[9,11111111111,"Örnek","Örnek",73.505549999999999,86,"Mevcut","Uygun",29.40222,51.6,81.002219999999994,"Sınava Girebilir"]
[10,11111111111,"Örnek","Örnek",72.607429999999994,87,"Mevcut","Uygun",29.042971999999999,52.199999999999996,81.242971999999995,"Sınava Girebilir"]
[11,11111111111,"Örnek","Örnek",71.275630000000007,85,"Mevcut","Uygun",28.510252000000005,51,79.510252000000008,"Yönetmelik Gereği Elendi *"]
[12,11111111111,"Örnek","Örnek",70.113749999999996,85,"Mevcut","Uygun",28.045500000000001,51,79.045500000000004,"Yönetmelik Gereği Elendi *"]
[13,11111111111,"Örnek","Örnek",70.505549999999999,85,"Mevcut","Uygun",28.202220000000001,51,79.202219999999997,"Yönetmelik Gereği Elendi *"]
[14,11111111111,"Örnek","Örnek",95,80,"Mevcut","Uygun Değil",38,48,86,"Başvuru Şartını Sağlamıyor (Yabancı Dil Puanı Yetersiz)"]
[15,11111111111,"Örnek","Örnek",80,88,"Mevcut","Uygun Değil",32,52.8,84.8,"Başvuru Şartını Sağlamıyor (Mezuniyet alanı ilanla uyumlu değil)"]
[16,11111111111,"Örnek","Örnek",75,85,"Mevcut Değil","Uygun Değil",30,51,81,"Başvuru Şartını Sağlamıyor (Yüksek Lisans Yapmış Olmak Şartını Sağlamıyor)"]
[17,11111111111,"Örnek","Örnek",78,86,"Mevcut","Uygun Değil",31.200000000000003,51.6,82.800000000000011,"Başvuru Şartını Sağlamıyor (Tecrübe süresi ilan şartını taşımıyor)"]
[18,11111111111,"Örnek","Örnek",68,88,"Mevcut","Uygun Değil",27.200000000000003,52.8,80,"Başvuru Şartını Sağlamıyor (Ales puanı yetersiz)"]

{"sheet":"Ön Değ. Rapor","index":1,"n_rows":75,"n_cols":16,"rows_kept":75,"cut":false,"hidden":false,"merged":[[9,0,9,3],[9,4,9,11],[10,0,11,0],[10,1,10,3],[10,4,10,6],[10,7,11,7],[10,8,10,11],[7,0,7,1],[7,2,7,3],[7,4,7,7],[7,8,7,11],[8,0,8,1],[8,2,8,11],[5,0,5,1],[5,2,5,3],[5,4,5,7],[5,8,5,11],[6,0,6,1],[6,2,6,3],[6,4,6,7],[6,8,6,11],[0,0,0,11],[1,0,1,11],[2,0,2,11],[3,0,3,11],[4,0,4,1],[4,2,4,3],[4,4,4,7],[4,8,4,11]]}
["T.C."]
["BAYBURT ÜNİVERSİTESİ"]
["ÖĞRETİM ELEMANI ÖN DEĞERLENDİRME TUTANAĞI"]
["Üniversitemize bağlı birimlere, 2547 sayılı Kanunun ilgili maddeleri ve 09.11.2018 tarihli ve 30590 sayılı Resmi Gazetede yayımlanan \"Öğretim Üyesi Dışındaki Öğretim Elemanı Kadrolarına Yapılacak Atamalarda Uygulanacak Merkezi Sınav İle Giriş Sınavlarına İlişkin Usul ve Esaslar Hakkında Yönetmelik” 10. Maddesi Uyarınca Lisans ve Ön Lisans Düzeyindeki Eğitim Veren Yerlere Alınacak Akademik Personele Ait Ön Değerlendirme Sonuç Tutanağı  ",null,null,null,null,null,null,null,null,null,null,null,null,null,null,"                                                                                                                                                                   "]
["İlan No:",null,{"$f":"IF('Yab.Dil Ön Değ'!C5=\"\",\"\",'Yab.Dil Ön Değ'!C5)","v":""},null,"Birimi:",null,null,null,{"$f":"IF('Yab.Dil Ön Değ'!I5=\"\",\"\",'Yab.Dil Ön Değ'!I5)","v":"Rektörlük"}]
["İlan Tarihi:",null,{"$f":"IF('Yab.Dil Ön Değ'!C6=\"\",\"\",'Yab.Dil Ön Değ'!C6)","v":"…/.../...."},null,"Bölümü:",null,null,null,{"$f":"IF('Yab.Dil Ön Değ'!I6=\"\",\"\",'Yab.Dil Ön Değ'!I6)","v":"….. Bölümü / Ulusarası İlişkiler Ofisi"}]
["Kadro Unvanı:",null,{"$f":"IF('Yab.Dil Ön Değ'!C7=\"\",\"\",'Yab.Dil Ön Değ'!C7)","v":"Öğretim Görevlisi (Yabancı Dil Zorunlu Ortak Ders / Uluslararası İlişkiler Ofisi-Uyg. Birim)"},null,"Alanı:",null,null,null,{"$f":"IF('Yab.Dil Ön Değ'!I7=\"\",\"\",'Yab.Dil Ön Değ'!I7)","v":""}]
["Kadro Adedi:",null,{"$f":"IF('Yab.Dil Ön Değ'!C8=\"\",\"\",'Yab.Dil Ön Değ'!C8)","v":""},null,"Öndeğerlendirme Tarihi:",null,null,null,{"$f":"IF('Yab.Dil Ön Değ'!I8=\"\",\"\",'Yab.Dil Ön Değ'!I8)","v":"…/.../...."}]
["İlan Özel Şartı:",null,{"$f":"IF('Yab.Dil Ön Değ'!C9=\"\",\"\",'Yab.Dil Ön Değ'!C9)","v":""}]
["SINAVIN YAPILACAĞI YER, TARİH ve SAAT :",null,null,null,{"$f":"IF('Yab.Dil Ön Değ'!E10=\"\",\"\",'Yab.Dil Ön Değ'!E10)","v":"……...     ../…/…. Günü Saat: …:…."}]
["Sıra No","Başvuranın",null,null,"Başvuru Şartı",null,null,"İlan Şartına Uygunluğu (Tecrübe / Nitelikler)","Ön Sıralama Değerlendirme Sonuçları"]
[null,"T.C. Kimlik No","Adı","Soyadı","Alanındaki Ales Puanı","Yabancı Dil Puanı (Min. 85)","Tezli Yüksek Lisans Belgesi",null,"ALES  (%40)","Yabancı Dil Puanı (%60)","Toplam Puan","Ön Değerlendirme Sonucu      "]
[{"$f":"IF('Yab.Dil Ön Değ'!A13=\"\",\"\",'Yab.Dil Ön Değ'!A13)","v":1},{"$f":"IF('Yab.Dil Ön Değ'!B13=\"\",\"\",LEFT('Yab.Dil Ön Değ'!B13,3)&REPT(\"*\",4)&RIGHT('Yab.Dil Ön Değ'!B13,2))","v":"111****11"},{"$f":"IF('Yab.Dil Ön Değ'!C13=\"\",\"\",IF(ISERR(FIND(\" \",'Yab.Dil Ön Değ'!C13))=TRUE,LEFT('Yab.Dil Ön Değ'!C13,2)&REPT(\"*\",3),LEFT('Yab.Dil Ön Değ'!C13,2)&REPT(\"*\",3)&\" \"&MID('Yab.Dil Ön Değ'!C13,FIND(\" \",'Yab.Dil Ön Değ'!C13)+1,2)&REPT(\"*\",3)))","v":"Ör***"},{"$f":"IF('Yab.Dil Ön Değ'!D13=\"\",\"\",IF(ISERR(FIND(\" \",'Yab.Dil Ön Değ'!D13))=TRUE,LEFT('Yab.Dil Ön Değ'!D13,2)&REPT(\"*\",3),LEFT('Yab.Dil Ön Değ'!D13,2)&REPT(\"*\",3)&\" \"&MID('Yab.Dil Ön Değ'!D13,FIND(\" \",'Yab.Dil Ön Değ'!D13)+1,2)&REPT(\"*\",3)))","v":"Ör***"},{"$f":"IF('Yab.Dil Ön Değ'!E13=\"\",\"\",'Yab.Dil Ön Değ'!E13)","v":81.505549999999999},{"$f":"IF('Yab.Dil Ön Değ'!F13=\"\",\"\",'Yab.Dil Ön Değ'!F13)","v":95},{"$f":"IF('Yab.Dil Ön Değ'!G13=\"\",\"\",'Yab.Dil Ön Değ'!G13)","v":"Mevcut"},{"$f":"IF('Yab.Dil Ön Değ'!H13=\"\",\"\",'Yab.Dil Ön Değ'!H13)","v":"Uygun"},{"$f":"IF('Yab.Dil Ön Değ'!I13=\"\",\"\",'Yab.Dil Ön Değ'!I13)","v":32.602220000000003},{"$f":"IF('Yab.Dil Ön Değ'!J13=\"\",\"\",'Yab.Dil Ön Değ'!J13)","v":57},{"$f":"IF('Yab.Dil Ön Değ'!K13=\"\",\"\",'Yab.Dil Ön Değ'!K13)","v":89.602220000000003},{"$f":"IF('Yab.Dil Ön Değ'!L13=\"\",\"\",'Yab.Dil Ön Değ'!L13)","v":"Sınava Girebilir"}]
[{"$f":"IF('Yab.Dil Ön Değ'!A14=\"\",\"\",'Yab.Dil Ön Değ'!A14)","v":2},{"$f":"IF('Yab.Dil Ön Değ'!B14=\"\",\"\",LEFT('Yab.Dil Ön Değ'!B14,3)&REPT(\"*\",4)&RIGHT('Yab.Dil Ön Değ'!B14,2))","v":"111****11"},{"$f":"IF('Yab.Dil Ön Değ'!C14=\"\",\"\",IF(ISERR(FIND(\" \",'Yab.Dil Ön Değ'!C14))=TRUE,LEFT('Yab.Dil Ön Değ'!C14,2)&REPT(\"*\",3),LEFT('Yab.Dil Ön Değ'!C14,2)&REPT(\"*\",3)&\" \"&MID('Yab.Dil Ön Değ'!C14,FIND(\" \",'Yab.Dil Ön Değ'!C14)+1,2)&REPT(\"*\",3)))","v":"Ör*** Ör***"},{"$f":"IF('Yab.Dil Ön Değ'!D14=\"\",\"\",IF(ISERR(FIND(\" \",'Yab.Dil Ön Değ'!D14))=TRUE,LEFT('Yab.Dil Ön Değ'!D14,2)&REPT(\"*\",3),LEFT('Yab.Dil Ön Değ'!D14,2)&REPT(\"*\",3)&\" \"&MID('Yab.Dil Ön Değ'!D14,FIND(\" \",'Yab.Dil Ön Değ'!D14)+1,2)&REPT(\"*\",3)))","v":"Ör***"},{"$f":"IF('Yab.Dil Ön Değ'!E14=\"\",\"\",'Yab.Dil Ön Değ'!E14)","v":80.607429999999994},{"$f":"IF('Yab.Dil Ön Değ'!F14=\"\",\"\",'Yab.Dil Ön Değ'!F14)","v":94},{"$f":"IF('Yab.Dil Ön Değ'!G14=\"\",\"\",'Yab.Dil Ön Değ'!G14)","v":"Mevcut"},{"$f":"IF('Yab.Dil Ön Değ'!H14=\"\",\"\",'Yab.Dil Ön Değ'!H14)","v":"Uygun"},{"$f":"IF('Yab.Dil Ön Değ'!I14=\"\",\"\",'Yab.Dil Ön Değ'!I14)","v":32.242972000000002},{"$f":"IF('Yab.Dil Ön Değ'!J14=\"\",\"\",'Yab.Dil Ön Değ'!J14)","v":56.4},{"$f":"IF('Yab.Dil Ön Değ'!K14=\"\",\"\",'Yab.Dil Ön Değ'!K14)","v":88.642972},{"$f":"IF('Yab.Dil Ön Değ'!L14=\"\",\"\",'Yab.Dil Ön Değ'!L14)","v":"Sınava Girebilir"}]
[{"$f":"IF('Yab.Dil Ön Değ'!A15=\"\",\"\",'Yab.Dil Ön Değ'!A15)","v":3},{"$f":"IF('Yab.Dil Ön Değ'!B15=\"\",\"\",LEFT('Yab.Dil Ön Değ'!B15,3)&REPT(\"*\",4)&RIGHT('Yab.Dil Ön Değ'!B15,2))","v":"111****11"},{"$f":"IF('Yab.Dil Ön Değ'!C15=\"\",\"\",IF(ISERR(FIND(\" \",'Yab.Dil Ön Değ'!C15))=TRUE,LEFT('Yab.Dil Ön Değ'!C15,2)&REPT(\"*\",3),LEFT('Yab.Dil Ön Değ'!C15,2)&REPT(\"*\",3)&\" \"&MID('Yab.Dil Ön Değ'!C15,FIND(\" \",'Yab.Dil Ön Değ'!C15)+1,2)&REPT(\"*\",3)))","v":"Ör***"},{"$f":"IF('Yab.Dil Ön Değ'!D15=\"\",\"\",IF(ISERR(FIND(\" \",'Yab.Dil Ön Değ'!D15))=TRUE,LEFT('Yab.Dil Ön Değ'!D15,2)&REPT(\"*\",3),LEFT('Yab.Dil Ön Değ'!D15,2)&REPT(\"*\",3)&\" \"&MID('Yab.Dil Ön Değ'!D15,FIND(\" \",'Yab.Dil Ön Değ'!D15)+1,2)&REPT(\"*\",3)))","v":"Ör*** Ör***"},{"$f":"IF('Yab.Dil Ön Değ'!E15=\"\",\"\",'Yab.Dil Ön Değ'!E15)","v":79.275630000000007},{"$f":"IF('Yab.Dil Ön Değ'!F15=\"\",\"\",'Yab.Dil Ön Değ'!F15)","v":93},{"$f":"IF('Yab.Dil Ön Değ'!G15=\"\",\"\",'Yab.Dil Ön Değ'!G15)","v":"Mevcut"},{"$f":"IF('Yab.Dil Ön Değ'!H15=\"\",\"\",'Yab.Dil Ön Değ'!H15)","v":"Uygun"},{"$f":"IF('Yab.Dil Ön Değ'!I15=\"\",\"\",'Yab.Dil Ön Değ'!I15)","v":31.710252000000004},{"$f":"IF('Yab.Dil Ön Değ'!J15=\"\",\"\",'Yab.Dil Ön Değ'!J15)","v":55.8},{"$f":"IF('Yab.Dil Ön Değ'!K15=\"\",\"\",'Yab.Dil Ön Değ'!K15)","v":87.510252000000008},{"$f":"IF('Yab.Dil Ön Değ'!L15=\"\",\"\",'Yab.Dil Ön Değ'!L15)","v":"Sınava Girebilir"}]
[{"$f":"IF('Yab.Dil Ön Değ'!A16=\"\",\"\",'Yab.Dil Ön Değ'!A16)","v":4},{"$f":"IF('Yab.Dil Ön Değ'!B16=\"\",\"\",LEFT('Yab.Dil Ön Değ'!B16,3)&REPT(\"*\",4)&RIGHT('Yab.Dil Ön Değ'!B16,2))","v":"111****11"},{"$f":"IF('Yab.Dil Ön Değ'!C16=\"\",\"\",IF(ISERR(FIND(\" \",'Yab.Dil Ön Değ'!C16))=TRUE,LEFT('Yab.Dil Ön Değ'!C16,2)&REPT(\"*\",3),LEFT('Yab.Dil Ön Değ'!C16,2)&REPT(\"*\",3)&\" \"&MID('Yab.Dil Ön Değ'!C16,FIND(\" \",'Yab.Dil Ön Değ'!C16)+1,2)&REPT(\"*\",3)))","v":"Ör*** Ör***"},{"$f":"IF('Yab.Dil Ön Değ'!D16=\"\",\"\",IF(ISERR(FIND(\" \",'Yab.Dil Ön Değ'!D16))=TRUE,LEFT('Yab.Dil Ön Değ'!D16,2)&REPT(\"*\",3),LEFT('Yab.Dil Ön Değ'!D16,2)&REPT(\"*\",3)&\" \"&MID('Yab.Dil Ön Değ'!D16,FIND(\" \",'Yab.Dil Ön Değ'!D16)+1,2)&REPT(\"*\",3)))","v":"Ör*** Ör***"},{"$f":"IF('Yab.Dil Ön Değ'!E16=\"\",\"\",'Yab.Dil Ön Değ'!E16)","v":78.113749999999996},{"$f":"IF('Yab.Dil Ön Değ'!F16=\"\",\"\",'Yab.Dil Ön Değ'!F16)","v":90},{"$f":"IF('Yab.Dil Ön Değ'!G16=\"\",\"\",'Yab.Dil Ön Değ'!G16)","v":"Mevcut"},{"$f":"IF('Yab.Dil Ön Değ'!H16=\"\",\"\",'Yab.Dil Ön Değ'!H16)","v":"Uygun"},{"$f":"IF('Yab.Dil Ön Değ'!I16=\"\",\"\",'Yab.Dil Ön Değ'!I16)","v":31.2455},{"$f":"IF('Yab.Dil Ön Değ'!J16=\"\",\"\",'Yab.Dil Ön Değ'!J16)","v":54},{"$f":"IF('Yab.Dil Ön Değ'!K16=\"\",\"\",'Yab.Dil Ön Değ'!K16)","v":85.245499999999993},{"$f":"IF('Yab.Dil Ön Değ'!L16=\"\",\"\",'Yab.Dil Ön Değ'!L16)","v":"Sınava Girebilir"}]
[{"$f":"IF('Yab.Dil Ön Değ'!A17=\"\",\"\",'Yab.Dil Ön Değ'!A17)","v":5},{"$f":"IF('Yab.Dil Ön Değ'!B17=\"\",\"\",LEFT('Yab.Dil Ön Değ'!B17,3)&REPT(\"*\",4)&RIGHT('Yab.Dil Ön Değ'!B17,2))","v":"111****11"},{"$f":"IF('Yab.Dil Ön Değ'!C17=\"\",\"\",IF(ISERR(FIND(\" \",'Yab.Dil Ön Değ'!C17))=TRUE,LEFT('Yab.Dil Ön Değ'!C17,2)&REPT(\"*\",3),LEFT('Yab.Dil Ön Değ'!C17,2)&REPT(\"*\",3)&\" \"&MID('Yab.Dil Ön Değ'!C17,FIND(\" \",'Yab.Dil Ön Değ'!C17)+1,2)&REPT(\"*\",3)))","v":"Ör***"},{"$f":"IF('Yab.Dil Ön Değ'!D17=\"\",\"\",IF(ISERR(FIND(\" \",'Yab.Dil Ön Değ'!D17))=TRUE,LEFT('Yab.Dil Ön Değ'!D17,2)&REPT(\"*\",3),LEFT('Yab.Dil Ön Değ'!D17,2)&REPT(\"*\",3)&\" \"&MID('Yab.Dil Ön Değ'!D17,FIND(\" \",'Yab.Dil Ön Değ'!D17)+1,2)&REPT(\"*\",3)))","v":"Ör***"},{"$f":"IF('Yab.Dil Ön Değ'!E17=\"\",\"\",'Yab.Dil Ön Değ'!E17)","v":77.505549999999999},{"$f":"IF('Yab.Dil Ön Değ'!F17=\"\",\"\",'Yab.Dil Ön Değ'!F17)","v":89},{"$f":"IF('Yab.Dil Ön Değ'!G17=\"\",\"\",'Yab.Dil Ön Değ'!G17)","v":"Mevcut"},{"$f":"IF('Yab.Dil Ön Değ'!H17=\"\",\"\",'Yab.Dil Ön Değ'!H17)","v":"Uygun"},{"$f":"IF('Yab.Dil Ön Değ'!I17=\"\",\"\",'Yab.Dil Ön Değ'!I17)","v":31.002220000000001},{"$f":"IF('Yab.Dil Ön Değ'!J17=\"\",\"\",'Yab.Dil Ön Değ'!J17)","v":53.4},{"$f":"IF('Yab.Dil Ön Değ'!K17=\"\",\"\",'Yab.Dil Ön Değ'!K17)","v":84.40222},{"$f":"IF('Yab.Dil Ön Değ'!L17=\"\",\"\",'Yab.Dil Ön Değ'!L17)","v":"Sınava Girebilir"}]
[{"$f":"IF('Yab.Dil Ön Değ'!A18=\"\",\"\",'Yab.Dil Ön Değ'!A18)","v":6},{"$f":"IF('Yab.Dil Ön Değ'!B18=\"\",\"\",LEFT('Yab.Dil Ön Değ'!B18,3)&REPT(\"*\",4)&RIGHT('Yab.Dil Ön Değ'!B18,2))","v":"111****11"},{"$f":"IF('Yab.Dil Ön Değ'!C18=\"\",\"\",IF(ISERR(FIND(\" \",'Yab.Dil Ön Değ'!C18))=TRUE,LEFT('Yab.Dil Ön Değ'!C18,2)&REPT(\"*\",3),LEFT('Yab.Dil Ön Değ'!C18,2)&REPT(\"*\",3)&\" \"&MID('Yab.Dil Ön Değ'!C18,FIND(\" \",'Yab.Dil Ön Değ'!C18)+1,2)&REPT(\"*\",3)))","v":"Ör***"},{"$f":"IF('Yab.Dil Ön Değ'!D18=\"\",\"\",IF(ISERR(FIND(\" \",'Yab.Dil Ön Değ'!D18))=TRUE,LEFT('Yab.Dil Ön Değ'!D18,2)&REPT(\"*\",3),LEFT('Yab.Dil Ön Değ'!D18,2)&REPT(\"*\",3)&\" \"&MID('Yab.Dil Ön Değ'!D18,FIND(\" \",'Yab.Dil Ön Değ'!D18)+1,2)&REPT(\"*\",3)))","v":"Ör***"},{"$f":"IF('Yab.Dil Ön Değ'!E18=\"\",\"\",'Yab.Dil Ön Değ'!E18)","v":76.607429999999994},{"$f":"IF('Yab.Dil Ön Değ'!F18=\"\",\"\",'Yab.Dil Ön Değ'!F18)","v":88},{"$f":"IF('Yab.Dil Ön Değ'!G18=\"\",\"\",'Yab.Dil Ön Değ'!G18)","v":"Mevcut"},{"$f":"IF('Yab.Dil Ön Değ'!H18=\"\",\"\",'Yab.Dil Ön Değ'!H18)","v":"Uygun"},{"$f":"IF('Yab.Dil Ön Değ'!I18=\"\",\"\",'Yab.Dil Ön Değ'!I18)","v":30.642972},{"$f":"IF('Yab.Dil Ön Değ'!J18=\"\",\"\",'Yab.Dil Ön Değ'!J18)","v":52.8},{"$f":"IF('Yab.Dil Ön Değ'!K18=\"\",\"\",'Yab.Dil Ön Değ'!K18)","v":83.442971999999997},{"$f":"IF('Yab.Dil Ön Değ'!L18=\"\",\"\",'Yab.Dil Ön Değ'!L18)","v":"Sınava Girebilir"}]
[{"$f":"IF('Yab.Dil Ön Değ'!A19=\"\",\"\",'Yab.Dil Ön Değ'!A19)","v":7},{"$f":"IF('Yab.Dil Ön Değ'!B19=\"\",\"\",LEFT('Yab.Dil Ön Değ'!B19,3)&REPT(\"*\",4)&RIGHT('Yab.Dil Ön Değ'!B19,2))","v":"111****11"},{"$f":"IF('Yab.Dil Ön Değ'!C19=\"\",\"\",IF(ISERR(FIND(\" \",'Yab.Dil Ön Değ'!C19))=TRUE,LEFT('Yab.Dil Ön Değ'!C19,2)&REPT(\"*\",3),LEFT('Yab.Dil Ön Değ'!C19,2)&REPT(\"*\",3)&\" \"&MID('Yab.Dil Ön Değ'!C19,FIND(\" \",'Yab.Dil Ön Değ'!C19)+1,2)&REPT(\"*\",3)))","v":"Ör***"},{"$f":"IF('Yab.Dil Ön Değ'!D19=\"\",\"\",IF(ISERR(FIND(\" \",'Yab.Dil Ön Değ'!D19))=TRUE,LEFT('Yab.Dil Ön Değ'!D19,2)&REPT(\"*\",3),LEFT('Yab.Dil Ön Değ'!D19,2)&REPT(\"*\",3)&\" \"&MID('Yab.Dil Ön Değ'!D19,FIND(\" \",'Yab.Dil Ön Değ'!D19)+1,2)&REPT(\"*\",3)))","v":"Ör***"},{"$f":"IF('Yab.Dil Ön Değ'!E19=\"\",\"\",'Yab.Dil Ön Değ'!E19)","v":75.275630000000007},{"$f":"IF('Yab.Dil Ön Değ'!F19=\"\",\"\",'Yab.Dil Ön Değ'!F19)","v":86},{"$f":"IF('Yab.Dil Ön Değ'!G19=\"\",\"\",'Yab.Dil Ön Değ'!G19)","v":"Mevcut"},{"$f":"IF('Yab.Dil Ön Değ'!H19=\"\",\"\",'Yab.Dil Ön Değ'!H19)","v":"Uygun"},{"$f":"IF('Yab.Dil Ön Değ'!I19=\"\",\"\",'Yab.Dil Ön Değ'!I19)","v":30.110252000000003},{"$f":"IF('Yab.Dil Ön Değ'!J19=\"\",\"\",'Yab.Dil Ön Değ'!J19)","v":51.6},{"$f":"IF('Yab.Dil Ön Değ'!K19=\"\",\"\",'Yab.Dil Ön Değ'!K19)","v":81.710251999999997},{"$f":"IF('Yab.Dil Ön Değ'!L19=\"\",\"\",'Yab.Dil Ön Değ'!L19)","v":"Sınava Girebilir"}]
[{"$f":"IF('Yab.Dil Ön Değ'!A20=\"\",\"\",'Yab.Dil Ön Değ'!A20)","v":8},{"$f":"IF('Yab.Dil Ön Değ'!B20=\"\",\"\",LEFT('Yab.Dil Ön Değ'!B20,3)&REPT(\"*\",4)&RIGHT('Yab.Dil Ön Değ'!B20,2))","v":"111****11"},{"$f":"IF('Yab.Dil Ön Değ'!C20=\"\",\"\",IF(ISERR(FIND(\" \",'Yab.Dil Ön Değ'!C20))=TRUE,LEFT('Yab.Dil Ön Değ'!C20,2)&REPT(\"*\",3),LEFT('Yab.Dil Ön Değ'!C20,2)&REPT(\"*\",3)&\" \"&MID('Yab.Dil Ön Değ'!C20,FIND(\" \",'Yab.Dil Ön Değ'!C20)+1,2)&REPT(\"*\",3)))","v":"Ör***"},{"$f":"IF('Yab.Dil Ön Değ'!D20=\"\",\"\",IF(ISERR(FIND(\" \",'Yab.Dil Ön Değ'!D20))=TRUE,LEFT('Yab.Dil Ön Değ'!D20,2)&REPT(\"*\",3),LEFT('Yab.Dil Ön Değ'!D20,2)&REPT(\"*\",3)&\" \"&MID('Yab.Dil Ön Değ'!D20,FIND(\" \",'Yab.Dil Ön Değ'!D20)+1,2)&REPT(\"*\",3)))","v":"Ör***"},{"$f":"IF('Yab.Dil Ön Değ'!E20=\"\",\"\",'Yab.Dil Ön Değ'!E20)","v":74.113749999999996},{"$f":"IF('Yab.Dil Ön Değ'!F20=\"\",\"\",'Yab.Dil Ön Değ'!F20)","v":85},{"$f":"IF('Yab.Dil Ön Değ'!G20=\"\",\"\",'Yab.Dil Ön Değ'!G20)","v":"Mevcut"},{"$f":"IF('Yab.Dil Ön Değ'!H20=\"\",\"\",'Yab.Dil Ön Değ'!H20)","v":"Uygun"},{"$f":"IF('Yab.Dil Ön Değ'!I20=\"\",\"\",'Yab.Dil Ön Değ'!I20)","v":29.645499999999998},{"$f":"IF('Yab.Dil Ön Değ'!J20=\"\",\"\",'Yab.Dil Ön Değ'!J20)","v":51},{"$f":"IF('Yab.Dil Ön Değ'!K20=\"\",\"\",'Yab.Dil Ön Değ'!K20)","v":80.645499999999998},{"$f":"IF('Yab.Dil Ön Değ'!L20=\"\",\"\",'Yab.Dil Ön Değ'!L20)","v":"Sınava Girebilir"}]
[{"$f":"IF('Yab.Dil Ön Değ'!A21=\"\",\"\",'Yab.Dil Ön Değ'!A21)","v":9},{"$f":"IF('Yab.Dil Ön Değ'!B21=\"\",\"\",LEFT('Yab.Dil Ön Değ'!B21,3)&REPT(\"*\",4)&RIGHT('Yab.Dil Ön Değ'!B21,2))","v":"111****11"},{"$f":"IF('Yab.Dil Ön Değ'!C21=\"\",\"\",IF(ISERR(FIND(\" \",'Yab.Dil Ön Değ'!C21))=TRUE,LEFT('Yab.Dil Ön Değ'!C21,2)&REPT(\"*\",3),LEFT('Yab.Dil Ön Değ'!C21,2)&REPT(\"*\",3)&\" \"&MID('Yab.Dil Ön Değ'!C21,FIND(\" \",'Yab.Dil Ön Değ'!C21)+1,2)&REPT(\"*\",3)))","v":"Ör***"},{"$f":"IF('Yab.Dil Ön Değ'!D21=\"\",\"\",IF(ISERR(FIND(\" \",'Yab.Dil Ön Değ'!D21))=TRUE,LEFT('Yab.Dil Ön Değ'!D21,2)&REPT(\"*\",3),LEFT('Yab.Dil Ön Değ'!D21,2)&REPT(\"*\",3)&\" \"&MID('Yab.Dil Ön Değ'!D21,FIND(\" \",'Yab.Dil Ön Değ'!D21)+1,2)&REPT(\"*\",3)))","v":"Ör***"},{"$f":"IF('Yab.Dil Ön Değ'!E21=\"\",\"\",'Yab.Dil Ön Değ'!E21)","v":73.505549999999999},{"$f":"IF('Yab.Dil Ön Değ'!F21=\"\",\"\",'Yab.Dil Ön Değ'!F21)","v":86},{"$f":"IF('Yab.Dil Ön Değ'!G21=\"\",\"\",'Yab.Dil Ön Değ'!G21)","v":"Mevcut"},{"$f":"IF('Yab.Dil Ön Değ'!H21=\"\",\"\",'Yab.Dil Ön Değ'!H21)","v":"Uygun"},{"$f":"IF('Yab.Dil Ön Değ'!I21=\"\",\"\",'Yab.Dil Ön Değ'!I21)","v":29.40222},{"$f":"IF('Yab.Dil Ön Değ'!J21=\"\",\"\",'Yab.Dil Ön Değ'!J21)","v":51.6},{"$f":"IF('Yab.Dil Ön Değ'!K21=\"\",\"\",'Yab.Dil Ön Değ'!K21)","v":81.002219999999994},{"$f":"IF('Yab.Dil Ön Değ'!L21=\"\",\"\",'Yab.Dil Ön Değ'!L21)","v":"Sınava Girebilir"}]
[{"$f":"IF('Yab.Dil Ön Değ'!A22=\"\",\"\",'Yab.Dil Ön Değ'!A22)","v":10},{"$f":"IF('Yab.Dil Ön Değ'!B22=\"\",\"\",LEFT('Yab.Dil Ön Değ'!B22,3)&REPT(\"*\",4)&RIGHT('Yab.Dil Ön Değ'!B22,2))","v":"111****11"},{"$f":"IF('Yab.Dil Ön Değ'!C22=\"\",\"\",IF(ISERR(FIND(\" \",'Yab.Dil Ön Değ'!C22))=TRUE,LEFT('Yab.Dil Ön Değ'!C22,2)&REPT(\"*\",3),LEFT('Yab.Dil Ön Değ'!C22,2)&REPT(\"*\",3)&\" \"&MID('Yab.Dil Ön Değ'!C22,FIND(\" \",'Yab.Dil Ön Değ'!C22)+1,2)&REPT(\"*\",3)))","v":"Ör***"},{"$f":"IF('Yab.Dil Ön Değ'!D22=\"\",\"\",IF(ISERR(FIND(\" \",'Yab.Dil Ön Değ'!D22))=TRUE,LEFT('Yab.Dil Ön Değ'!D22,2)&REPT(\"*\",3),LEFT('Yab.Dil Ön Değ'!D22,2)&REPT(\"*\",3)&\" \"&MID('Yab.Dil Ön Değ'!D22,FIND(\" \",'Yab.Dil Ön Değ'!D22)+1,2)&REPT(\"*\",3)))","v":"Ör***"},{"$f":"IF('Yab.Dil Ön Değ'!E22=\"\",\"\",'Yab.Dil Ön Değ'!E22)","v":72.607429999999994},{"$f":"IF('Yab.Dil Ön Değ'!F22=\"\",\"\",'Yab.Dil Ön Değ'!F22)","v":87},{"$f":"IF('Yab.Dil Ön Değ'!G22=\"\",\"\",'Yab.Dil Ön Değ'!G22)","v":"Mevcut"},{"$f":"IF('Yab.Dil Ön Değ'!H22=\"\",\"\",'Yab.Dil Ön Değ'!H22)","v":"Uygun"},{"$f":"IF('Yab.Dil Ön Değ'!I22=\"\",\"\",'Yab.Dil Ön Değ'!I22)","v":29.042971999999999},{"$f":"IF('Yab.Dil Ön Değ'!J22=\"\",\"\",'Yab.Dil Ön Değ'!J22)","v":52.199999999999996},{"$f":"IF('Yab.Dil Ön Değ'!K22=\"\",\"\",'Yab.Dil Ön Değ'!K22)","v":81.242971999999995},{"$f":"IF('Yab.Dil Ön Değ'!L22=\"\",\"\",'Yab.Dil Ön Değ'!L22)","v":"Sınava Girebilir"}]
[{"$f":"IF('Yab.Dil Ön Değ'!A23=\"\",\"\",'Yab.Dil Ön Değ'!A23)","v":11},{"$f":"IF('Yab.Dil Ön Değ'!B23=\"\",\"\",LEFT('Yab.Dil Ön Değ'!B23,3)&REPT(\"*\",4)&RIGHT('Yab.Dil Ön Değ'!B23,2))","v":"111****11"},{"$f":"IF('Yab.Dil Ön Değ'!C23=\"\",\"\",IF(ISERR(FIND(\" \",'Yab.Dil Ön Değ'!C23))=TRUE,LEFT('Yab.Dil Ön Değ'!C23,2)&REPT(\"*\",3),LEFT('Yab.Dil Ön Değ'!C23,2)&REPT(\"*\",3)&\" \"&MID('Yab.Dil Ön Değ'!C23,FIND(\" \",'Yab.Dil Ön Değ'!C23)+1,2)&REPT(\"*\",3)))","v":"Ör***"},{"$f":"IF('Yab.Dil Ön Değ'!D23=\"\",\"\",IF(ISERR(FIND(\" \",'Yab.Dil Ön Değ'!D23))=TRUE,LEFT('Yab.Dil Ön Değ'!D23,2)&REPT(\"*\",3),LEFT('Yab.Dil Ön Değ'!D23,2)&REPT(\"*\",3)&\" \"&MID('Yab.Dil Ön Değ'!D23,FIND(\" \",'Yab.Dil Ön Değ'!D23)+1,2)&REPT(\"*\",3)))","v":"Ör***"},{"$f":"IF('Yab.Dil Ön Değ'!E23=\"\",\"\",'Yab.Dil Ön Değ'!E23)","v":71.275630000000007},{"$f":"IF('Yab.Dil Ön Değ'!F23=\"\",\"\",'Yab.Dil Ön Değ'!F23)","v":85},{"$f":"IF('Yab.Dil Ön Değ'!G23=\"\",\"\",'Yab.Dil Ön Değ'!G23)","v":"Mevcut"},{"$f":"IF('Yab.Dil Ön Değ'!H23=\"\",\"\",'Yab.Dil Ön Değ'!H23)","v":"Uygun"},{"$f":"IF('Yab.Dil Ön Değ'!I23=\"\",\"\",'Yab.Dil Ön Değ'!I23)","v":28.510252000000005},{"$f":"IF('Yab.Dil Ön Değ'!J23=\"\",\"\",'Yab.Dil Ön Değ'!J23)","v":51},{"$f":"IF('Yab.Dil Ön Değ'!K23=\"\",\"\",'Yab.Dil Ön Değ'!K23)","v":79.510252000000008},{"$f":"IF('Yab.Dil Ön Değ'!L23=\"\",\"\",'Yab.Dil Ön Değ'!L23)","v":"Yönetmelik Gereği Elendi *"}]
[{"$f":"IF('Yab.Dil Ön Değ'!A24=\"\",\"\",'Yab.Dil Ön Değ'!A24)","v":12},{"$f":"IF('Yab.Dil Ön Değ'!B24=\"\",\"\",LEFT('Yab.Dil Ön Değ'!B24,3)&REPT(\"*\",4)&RIGHT('Yab.Dil Ön Değ'!B24,2))","v":"111****11"},{"$f":"IF('Yab.Dil Ön Değ'!C24=\"\",\"\",IF(ISERR(FIND(\" \",'Yab.Dil Ön Değ'!C24))=TRUE,LEFT('Yab.Dil Ön Değ'!C24,2)&REPT(\"*\",3),LEFT('Yab.Dil Ön Değ'!C24,2)&REPT(\"*\",3)&\" \"&MID('Yab.Dil Ön Değ'!C24,FIND(\" \",'Yab.Dil Ön Değ'!C24)+1,2)&REPT(\"*\",3)))","v":"Ör***"},{"$f":"IF('Yab.Dil Ön Değ'!D24=\"\",\"\",IF(ISERR(FIND(\" \",'Yab.Dil Ön Değ'!D24))=TRUE,LEFT('Yab.Dil Ön Değ'!D24,2)&REPT(\"*\",3),LEFT('Yab.Dil Ön Değ'!D24,2)&REPT(\"*\",3)&\" \"&MID('Yab.Dil Ön Değ'!D24,FIND(\" \",'Yab.Dil Ön Değ'!D24)+1,2)&REPT(\"*\",3)))","v":"Ör***"},{"$f":"IF('Yab.Dil Ön Değ'!E24=\"\",\"\",'Yab.Dil Ön Değ'!E24)","v":70.113749999999996},{"$f":"IF('Yab.Dil Ön Değ'!F24=\"\",\"\",'Yab.Dil Ön Değ'!F24)","v":85},{"$f":"IF('Yab.Dil Ön Değ'!G24=\"\",\"\",'Yab.Dil Ön Değ'!G24)","v":"Mevcut"},{"$f":"IF('Yab.Dil Ön Değ'!H24=\"\",\"\",'Yab.Dil Ön Değ'!H24)","v":"Uygun"},{"$f":"IF('Yab.Dil Ön Değ'!I24=\"\",\"\",'Yab.Dil Ön Değ'!I24)","v":28.045500000000001},{"$f":"IF('Yab.Dil Ön Değ'!J24=\"\",\"\",'Yab.Dil Ön Değ'!J24)","v":51},{"$f":"IF('Yab.Dil Ön Değ'!K24=\"\",\"\",'Yab.Dil Ön Değ'!K24)","v":79.045500000000004},{"$f":"IF('Yab.Dil Ön Değ'!L24=\"\",\"\",'Yab.Dil Ön Değ'!L24)","v":"Yönetmelik Gereği Elendi *"}]
[{"$f":"IF('Yab.Dil Ön Değ'!A25=\"\",\"\",'Yab.Dil Ön Değ'!A25)","v":13},{"$f":"IF('Yab.Dil Ön Değ'!B25=\"\",\"\",LEFT('Yab.Dil Ön Değ'!B25,3)&REPT(\"*\",4)&RIGHT('Yab.Dil Ön Değ'!B25,2))","v":"111****11"},{"$f":"IF('Yab.Dil Ön Değ'!C25=\"\",\"\",IF(ISERR(FIND(\" \",'Yab.Dil Ön Değ'!C25))=TRUE,LEFT('Yab.Dil Ön Değ'!C25,2)&REPT(\"*\",3),LEFT('Yab.Dil Ön Değ'!C25,2)&REPT(\"*\",3)&\" \"&MID('Yab.Dil Ön Değ'!C25,FIND(\" \",'Yab.Dil Ön Değ'!C25)+1,2)&REPT(\"*\",3)))","v":"Ör***"},{"$f":"IF('Yab.Dil Ön Değ'!D25=\"\",\"\",IF(ISERR(FIND(\" \",'Yab.Dil Ön Değ'!D25))=TRUE,LEFT('Yab.Dil Ön Değ'!D25,2)&REPT(\"*\",3),LEFT('Yab.Dil Ön Değ'!D25,2)&REPT(\"*\",3)&\" \"&MID('Yab.Dil Ön Değ'!D25,FIND(\" \",'Yab.Dil Ön Değ'!D25)+1,2)&REPT(\"*\",3)))","v":"Ör***"},{"$f":"IF('Yab.Dil Ön Değ'!E25=\"\",\"\",'Yab.Dil Ön Değ'!E25)","v":70.505549999999999},{"$f":"IF('Yab.Dil Ön Değ'!F25=\"\",\"\",'Yab.Dil Ön Değ'!F25)","v":85},{"$f":"IF('Yab.Dil Ön Değ'!G25=\"\",\"\",'Yab.Dil Ön Değ'!G25)","v":"Mevcut"},{"$f":"IF('Yab.Dil Ön Değ'!H25=\"\",\"\",'Yab.Dil Ön Değ'!H25)","v":"Uygun"},{"$f":"IF('Yab.Dil Ön Değ'!I25=\"\",\"\",'Yab.Dil Ön Değ'!I25)","v":28.202220000000001},{"$f":"IF('Yab.Dil Ön Değ'!J25=\"\",\"\",'Yab.Dil Ön Değ'!J25)","v":51},{"$f":"IF('Yab.Dil Ön Değ'!K25=\"\",\"\",'Yab.Dil Ön Değ'!K25)","v":79.202219999999997},{"$f":"IF('Yab.Dil Ön Değ'!L25=\"\",\"\",'Yab.Dil Ön Değ'!L25)","v":"Yönetmelik Gereği Elendi *"}]
[{"$f":"IF('Yab.Dil Ön Değ'!A26=\"\",\"\",'Yab.Dil Ön Değ'!A26)","v":14},{"$f":"IF('Yab.Dil Ön Değ'!B26=\"\",\"\",LEFT('Yab.Dil Ön Değ'!B26,3)&REPT(\"*\",4)&RIGHT('Yab.Dil Ön Değ'!B26,2))","v":"111****11"},{"$f":"IF('Yab.Dil Ön Değ'!C26=\"\",\"\",IF(ISERR(FIND(\" \",'Yab.Dil Ön Değ'!C26))=TRUE,LEFT('Yab.Dil Ön Değ'!C26,2)&REPT(\"*\",3),LEFT('Yab.Dil Ön Değ'!C26,2)&REPT(\"*\",3)&\" \"&MID('Yab.Dil Ön Değ'!C26,FIND(\" \",'Yab.Dil Ön Değ'!C26)+1,2)&REPT(\"*\",3)))","v":"Ör***"},{"$f":"IF('Yab.Dil Ön Değ'!D26=\"\",\"\",IF(ISERR(FIND(\" \",'Yab.Dil Ön Değ'!D26))=TRUE,LEFT('Yab.Dil Ön Değ'!D26,2)&REPT(\"*\",3),LEFT('Yab.Dil Ön Değ'!D26,2)&REPT(\"*\",3)&\" \"&MID('Yab.Dil Ön Değ'!D26,FIND(\" \",'Yab.Dil Ön Değ'!D26)+1,2)&REPT(\"*\",3)))","v":"Ör***"},{"$f":"IF('Yab.Dil Ön Değ'!E26=\"\",\"\",'Yab.Dil Ön Değ'!E26)","v":95},{"$f":"IF('Yab.Dil Ön Değ'!F26=\"\",\"\",'Yab.Dil Ön Değ'!F26)","v":80},{"$f":"IF('Yab.Dil Ön Değ'!G26=\"\",\"\",'Yab.Dil Ön Değ'!G26)","v":"Mevcut"},{"$f":"IF('Yab.Dil Ön Değ'!H26=\"\",\"\",'Yab.Dil Ön Değ'!H26)","v":"Uygun Değil"},{"$f":"IF('Yab.Dil Ön Değ'!I26=\"\",\"\",'Yab.Dil Ön Değ'!I26)","v":38},{"$f":"IF('Yab.Dil Ön Değ'!J26=\"\",\"\",'Yab.Dil Ön Değ'!J26)","v":48},{"$f":"IF('Yab.Dil Ön Değ'!K26=\"\",\"\",'Yab.Dil Ön Değ'!K26)","v":86},{"$f":"IF('Yab.Dil Ön Değ'!L26=\"\",\"\",'Yab.Dil Ön Değ'!L26)","v":"Başvuru Şartını Sağlamıyor (Yabancı Dil Puanı Yetersiz)"}]
[{"$f":"IF('Yab.Dil Ön Değ'!A27=\"\",\"\",'Yab.Dil Ön Değ'!A27)","v":15},{"$f":"IF('Yab.Dil Ön Değ'!B27=\"\",\"\",LEFT('Yab.Dil Ön Değ'!B27,3)&REPT(\"*\",4)&RIGHT('Yab.Dil Ön Değ'!B27,2))","v":"111****11"},{"$f":"IF('Yab.Dil Ön Değ'!C27=\"\",\"\",IF(ISERR(FIND(\" \",'Yab.Dil Ön Değ'!C27))=TRUE,LEFT('Yab.Dil Ön Değ'!C27,2)&REPT(\"*\",3),LEFT('Yab.Dil Ön Değ'!C27,2)&REPT(\"*\",3)&\" \"&MID('Yab.Dil Ön Değ'!C27,FIND(\" \",'Yab.Dil Ön Değ'!C27)+1,2)&REPT(\"*\",3)))","v":"Ör***"},{"$f":"IF('Yab.Dil Ön Değ'!D27=\"\",\"\",IF(ISERR(FIND(\" \",'Yab.Dil Ön Değ'!D27))=TRUE,LEFT('Yab.Dil Ön Değ'!D27,2)&REPT(\"*\",3),LEFT('Yab.Dil Ön Değ'!D27,2)&REPT(\"*\",3)&\" \"&MID('Yab.Dil Ön Değ'!D27,FIND(\" \",'Yab.Dil Ön Değ'!D27)+1,2)&REPT(\"*\",3)))","v":"Ör***"},{"$f":"IF('Yab.Dil Ön Değ'!E27=\"\",\"\",'Yab.Dil Ön Değ'!E27)","v":80},{"$f":"IF('Yab.Dil Ön Değ'!F27=\"\",\"\",'Yab.Dil Ön Değ'!F27)","v":88},{"$f":"IF('Yab.Dil Ön Değ'!G27=\"\",\"\",'Yab.Dil Ön Değ'!G27)","v":"Mevcut"},{"$f":"IF('Yab.Dil Ön Değ'!H27=\"\",\"\",'Yab.Dil Ön Değ'!H27)","v":"Uygun Değil"},{"$f":"IF('Yab.Dil Ön Değ'!I27=\"\",\"\",'Yab.Dil Ön Değ'!I27)","v":32},{"$f":"IF('Yab.Dil Ön Değ'!J27=\"\",\"\",'Yab.Dil Ön Değ'!J27)","v":52.8},{"$f":"IF('Yab.Dil Ön Değ'!K27=\"\",\"\",'Yab.Dil Ön Değ'!K27)","v":84.8},{"$f":"IF('Yab.Dil Ön Değ'!L27=\"\",\"\",'Yab.Dil Ön Değ'!L27)","v":"Başvuru Şartını Sağlamıyor (Mezuniyet alanı ilanla uyumlu değil)"}]
[{"$f":"IF('Yab.Dil Ön Değ'!A28=\"\",\"\",'Yab.Dil Ön Değ'!A28)","v":16},{"$f":"IF('Yab.Dil Ön Değ'!B28=\"\",\"\",LEFT('Yab.Dil Ön Değ'!B28,3)&REPT(\"*\",4)&RIGHT('Yab.Dil Ön Değ'!B28,2))","v":"111****11"},{"$f":"IF('Yab.Dil Ön Değ'!C28=\"\",\"\",IF(ISERR(FIND(\" \",'Yab.Dil Ön Değ'!C28))=TRUE,LEFT('Yab.Dil Ön Değ'!C28,2)&REPT(\"*\",3),LEFT('Yab.Dil Ön Değ'!C28,2)&REPT(\"*\",3)&\" \"&MID('Yab.Dil Ön Değ'!C28,FIND(\" \",'Yab.Dil Ön Değ'!C28)+1,2)&REPT(\"*\",3)))","v":"Ör***"},{"$f":"IF('Yab.Dil Ön Değ'!D28=\"\",\"\",IF(ISERR(FIND(\" \",'Yab.Dil Ön Değ'!D28))=TRUE,LEFT('Yab.Dil Ön Değ'!D28,2)&REPT(\"*\",3),LEFT('Yab.Dil Ön Değ'!D28,2)&REPT(\"*\",3)&\" \"&MID('Yab.Dil Ön Değ'!D28,FIND(\" \",'Yab.Dil Ön Değ'!D28)+1,2)&REPT(\"*\",3)))","v":"Ör***"},{"$f":"IF('Yab.Dil Ön Değ'!E28=\"\",\"\",'Yab.Dil Ön Değ'!E28)","v":75},{"$f":"IF('Yab.Dil Ön Değ'!F28=\"\",\"\",'Yab.Dil Ön Değ'!F28)","v":85},{"$f":"IF('Yab.Dil Ön Değ'!G28=\"\",\"\",'Yab.Dil Ön Değ'!G28)","v":"Mevcut Değil"},{"$f":"IF('Yab.Dil Ön Değ'!H28=\"\",\"\",'Yab.Dil Ön Değ'!H28)","v":"Uygun Değil"},{"$f":"IF('Yab.Dil Ön Değ'!I28=\"\",\"\",'Yab.Dil Ön Değ'!I28)","v":30},{"$f":"IF('Yab.Dil Ön Değ'!J28=\"\",\"\",'Yab.Dil Ön Değ'!J28)","v":51},{"$f":"IF('Yab.Dil Ön Değ'!K28=\"\",\"\",'Yab.Dil Ön Değ'!K28)","v":81},{"$f":"IF('Yab.Dil Ön Değ'!L28=\"\",\"\",'Yab.Dil Ön Değ'!L28)","v":"Başvuru Şartını Sağlamıyor (Yüksek Lisans Yapmış Olmak Şartını Sağlamıyor)"}]
[{"$f":"IF('Yab.Dil Ön Değ'!A29=\"\",\"\",'Yab.Dil Ön Değ'!A29)","v":17},{"$f":"IF('Yab.Dil Ön Değ'!B29=\"\",\"\",LEFT('Yab.Dil Ön Değ'!B29,3)&REPT(\"*\",4)&RIGHT('Yab.Dil Ön Değ'!B29,2))","v":"111****11"},{"$f":"IF('Yab.Dil Ön Değ'!C29=\"\",\"\",IF(ISERR(FIND(\" \",'Yab.Dil Ön Değ'!C29))=TRUE,LEFT('Yab.Dil Ön Değ'!C29,2)&REPT(\"*\",3),LEFT('Yab.Dil Ön Değ'!C29,2)&REPT(\"*\",3)&\" \"&MID('Yab.Dil Ön Değ'!C29,FIND(\" \",'Yab.Dil Ön Değ'!C29)+1,2)&REPT(\"*\",3)))","v":"Ör***"},{"$f":"IF('Yab.Dil Ön Değ'!D29=\"\",\"\",IF(ISERR(FIND(\" \",'Yab.Dil Ön Değ'!D29))=TRUE,LEFT('Yab.Dil Ön Değ'!D29,2)&REPT(\"*\",3),LEFT('Yab.Dil Ön Değ'!D29,2)&REPT(\"*\",3)&\" \"&MID('Yab.Dil Ön Değ'!D29,FIND(\" \",'Yab.Dil Ön Değ'!D29)+1,2)&REPT(\"*\",3)))","v":"Ör***"},{"$f":"IF('Yab.Dil Ön Değ'!E29=\"\",\"\",'Yab.Dil Ön Değ'!E29)","v":78},{"$f":"IF('Yab.Dil Ön Değ'!F29=\"\",\"\",'Yab.Dil Ön Değ'!F29)","v":86},{"$f":"IF('Yab.Dil Ön Değ'!G29=\"\",\"\",'Yab.Dil Ön Değ'!G29)","v":"Mevcut"},{"$f":"IF('Yab.Dil Ön Değ'!H29=\"\",\"\",'Yab.Dil Ön Değ'!H29)","v":"Uygun Değil"},{"$f":"IF('Yab.Dil Ön Değ'!I29=\"\",\"\",'Yab.Dil Ön Değ'!I29)","v":31.200000000000003},{"$f":"IF('Yab.Dil Ön Değ'!J29=\"\",\"\",'Yab.Dil Ön Değ'!J29)","v":51.6},{"$f":"IF('Yab.Dil Ön Değ'!K29=\"\",\"\",'Yab.Dil Ön Değ'!K29)","v":82.800000000000011},{"$f":"IF('Yab.Dil Ön Değ'!L29=\"\",\"\",'Yab.Dil Ön Değ'!L29)","v":"Başvuru Şartını Sağlamıyor (Tecrübe süresi ilan şartını taşımıyor)"}]
[{"$f":"IF('Yab.Dil Ön Değ'!A30=\"\",\"\",'Yab.Dil Ön Değ'!A30)","v":18},{"$f":"IF('Yab.Dil Ön Değ'!B30=\"\",\"\",LEFT('Yab.Dil Ön Değ'!B30,3)&REPT(\"*\",4)&RIGHT('Yab.Dil Ön Değ'!B30,2))","v":"111****11"},{"$f":"IF('Yab.Dil Ön Değ'!C30=\"\",\"\",IF(ISERR(FIND(\" \",'Yab.Dil Ön Değ'!C30))=TRUE,LEFT('Yab.Dil Ön Değ'!C30,2)&REPT(\"*\",3),LEFT('Yab.Dil Ön Değ'!C30,2)&REPT(\"*\",3)&\" \"&MID('Yab.Dil Ön Değ'!C30,FIND(\" \",'Yab.Dil Ön Değ'!C30)+1,2)&REPT(\"*\",3)))","v":"Ör***"},{"$f":"IF('Yab.Dil Ön Değ'!D30=\"\",\"\",IF(ISERR(FIND(\" \",'Yab.Dil Ön Değ'!D30))=TRUE,LEFT('Yab.Dil Ön Değ'!D30,2)&REPT(\"*\",3),LEFT('Yab.Dil Ön Değ'!D30,2)&REPT(\"*\",3)&\" \"&MID('Yab.Dil Ön Değ'!D30,FIND(\" \",'Yab.Dil Ön Değ'!D30)+1,2)&REPT(\"*\",3)))","v":"Ör***"},{"$f":"IF('Yab.Dil Ön Değ'!E30=\"\",\"\",'Yab.Dil Ön Değ'!E30)","v":68},{"$f":"IF('Yab.Dil Ön Değ'!F30=\"\",\"\",'Yab.Dil Ön Değ'!F30)","v":88},{"$f":"IF('Yab.Dil Ön Değ'!G30=\"\",\"\",'Yab.Dil Ön Değ'!G30)","v":"Mevcut"},{"$f":"IF('Yab.Dil Ön Değ'!H30=\"\",\"\",'Yab.Dil Ön Değ'!H30)","v":"Uygun Değil"},{"$f":"IF('Yab.Dil Ön Değ'!I30=\"\",\"\",'Yab.Dil Ön Değ'!I30)","v":27.200000000000003},{"$f":"IF('Yab.Dil Ön Değ'!J30=\"\",\"\",'Yab.Dil Ön Değ'!J30)","v":52.8},{"$f":"IF('Yab.Dil Ön Değ'!K30=\"\",\"\",'Yab.Dil Ön Değ'!K30)","v":80},{"$f":"IF('Yab.Dil Ön Değ'!L30=\"\",\"\",'Yab.Dil Ön Değ'!L30)","v":"Başvuru Şartını Sağlamıyor (Ales puanı yetersiz)"}]
[{"$f":"IF('Yab.Dil Ön Değ'!A31=\"\",\"\",'Yab.Dil Ön Değ'!A31)","v":""},{"$f":"IF('Yab.Dil Ön Değ'!B31=\"\",\"\",LEFT('Yab.Dil Ön Değ'!B31,3)&REPT(\"*\",4)&RIGHT('Yab.Dil Ön Değ'!B31,2))","v":""},{"$f":"IF('Yab.Dil Ön Değ'!C31=\"\",\"\",IF(ISERR(FIND(\" \",'Yab.Dil Ön Değ'!C31))=TRUE,LEFT('Yab.Dil Ön Değ'!C31,2)&REPT(\"*\",3),LEFT('Yab.Dil Ön Değ'!C31,2)&REPT(\"*\",3)&\" \"&MID('Yab.Dil Ön Değ'!C31,FIND(\" \",'Yab.Dil Ön Değ'!C31)+1,2)&REPT(\"*\",3)))","v":""},{"$f":"IF('Yab.Dil Ön Değ'!D31=\"\",\"\",IF(ISERR(FIND(\" \",'Yab.Dil Ön Değ'!D31))=TRUE,LEFT('Yab.Dil Ön Değ'!D31,2)&REPT(\"*\",3),LEFT('Yab.Dil Ön Değ'!D31,2)&REPT(\"*\",3)&\" \"&MID('Yab.Dil Ön Değ'!D31,FIND(\" \",'Yab.Dil Ön Değ'!D31)+1,2)&REPT(\"*\",3)))","v":""},{"$f":"IF('Yab.Dil Ön Değ'!E31=\"\",\"\",'Yab.Dil Ön Değ'!E31)","v":""},{"$f":"IF('Yab.Dil Ön Değ'!F31=\"\",\"\",'Yab.Dil Ön Değ'!F31)","v":""},{"$f":"IF('Yab.Dil Ön Değ'!G31=\"\",\"\",'Yab.Dil Ön Değ'!G31)","v":""},{"$f":"IF('Yab.Dil Ön Değ'!H31=\"\",\"\",'Yab.Dil Ön Değ'!H31)","v":""},{"$f":"IF('Yab.Dil Ön Değ'!I31=\"\",\"\",'Yab.Dil Ön Değ'!I31)","v":""},{"$f":"IF('Yab.Dil Ön Değ'!J31=\"\",\"\",'Yab.Dil Ön Değ'!J31)","v":""},{"$f":"IF('Yab.Dil Ön Değ'!K31=\"\",\"\",'Yab.Dil Ön Değ'!K31)","v":""},{"$f":"IF('Yab.Dil Ön Değ'!L31=\"\",\"\",'Yab.Dil Ön Değ'!L31)","v":""}]
[{"$f":"IF('Yab.Dil Ön Değ'!A32=\"\",\"\",'Yab.Dil Ön Değ'!A32)","v":""},{"$f":"IF('Yab.Dil Ön Değ'!B32=\"\",\"\",LEFT('Yab.Dil Ön Değ'!B32,3)&REPT(\"*\",4)&RIGHT('Yab.Dil Ön Değ'!B32,2))","v":""},{"$f":"IF('Yab.Dil Ön Değ'!C32=\"\",\"\",IF(ISERR(FIND(\" \",'Yab.Dil Ön Değ'!C32))=TRUE,LEFT('Yab.Dil Ön Değ'!C32,2)&REPT(\"*\",3),LEFT('Yab.Dil Ön Değ'!C32,2)&REPT(\"*\",3)&\" \"&MID('Yab.Dil Ön Değ'!C32,FIND(\" \",'Yab.Dil Ön Değ'!C32)+1,2)&REPT(\"*\",3)))","v":""},{"$f":"IF('Yab.Dil Ön Değ'!D32=\"\",\"\",IF(ISERR(FIND(\" \",'Yab.Dil Ön Değ'!D32))=TRUE,LEFT('Yab.Dil Ön Değ'!D32,2)&REPT(\"*\",3),LEFT('Yab.Dil Ön Değ'!D32,2)&REPT(\"*\",3)&\" \"&MID('Yab.Dil Ön Değ'!D32,FIND(\" \",'Yab.Dil Ön Değ'!D32)+1,2)&REPT(\"*\",3)))","v":""},{"$f":"IF('Yab.Dil Ön Değ'!E32=\"\",\"\",'Yab.Dil Ön Değ'!E32)","v":""},{"$f":"IF('Yab.Dil Ön Değ'!F32=\"\",\"\",'Yab.Dil Ön Değ'!F32)","v":""},{"$f":"IF('Yab.Dil Ön Değ'!G32=\"\",\"\",'Yab.Dil Ön Değ'!G32)","v":""},{"$f":"IF('Yab.Dil Ön Değ'!H32=\"\",\"\",'Yab.Dil Ön Değ'!H32)","v":""},{"$f":"IF('Yab.Dil Ön Değ'!I32=\"\",\"\",'Yab.Dil Ön Değ'!I32)","v":""},{"$f":"IF('Yab.Dil Ön Değ'!J32=\"\",\"\",'Yab.Dil Ön Değ'!J32)","v":""},{"$f":"IF('Yab.Dil Ön Değ'!K32=\"\",\"\",'Yab.Dil Ön Değ'!K32)","v":""},{"$f":"IF('Yab.Dil Ön Değ'!L32=\"\",\"\",'Yab.Dil Ön Değ'!L32)","v":""}]
[{"$f":"IF('Yab.Dil Ön Değ'!A33=\"\",\"\",'Yab.Dil Ön Değ'!A33)","v":""},{"$f":"IF('Yab.Dil Ön Değ'!B33=\"\",\"\",LEFT('Yab.Dil Ön Değ'!B33,3)&REPT(\"*\",4)&RIGHT('Yab.Dil Ön Değ'!B33,2))","v":""},{"$f":"IF('Yab.Dil Ön Değ'!C33=\"\",\"\",IF(ISERR(FIND(\" \",'Yab.Dil Ön Değ'!C33))=TRUE,LEFT('Yab.Dil Ön Değ'!C33,2)&REPT(\"*\",3),LEFT('Yab.Dil Ön Değ'!C33,2)&REPT(\"*\",3)&\" \"&MID('Yab.Dil Ön Değ'!C33,FIND(\" \",'Yab.Dil Ön Değ'!C33)+1,2)&REPT(\"*\",3)))","v":""},{"$f":"IF('Yab.Dil Ön Değ'!D33=\"\",\"\",IF(ISERR(FIND(\" \",'Yab.Dil Ön Değ'!D33))=TRUE,LEFT('Yab.Dil Ön Değ'!D33,2)&REPT(\"*\",3),LEFT('Yab.Dil Ön Değ'!D33,2)&REPT(\"*\",3)&\" \"&MID('Yab.Dil Ön Değ'!D33,FIND(\" \",'Yab.Dil Ön Değ'!D33)+1,2)&REPT(\"*\",3)))","v":""},{"$f":"IF('Yab.Dil Ön Değ'!E33=\"\",\"\",'Yab.Dil Ön Değ'!E33)","v":""},{"$f":"IF('Yab.Dil Ön Değ'!F33=\"\",\"\",'Yab.Dil Ön Değ'!F33)","v":""},{"$f":"IF('Yab.Dil Ön Değ'!G33=\"\",\"\",'Yab.Dil Ön Değ'!G33)","v":""},{"$f":"IF('Yab.Dil Ön Değ'!H33=\"\",\"\",'Yab.Dil Ön Değ'!H33)","v":""},{"$f":"IF('Yab.Dil Ön Değ'!I33=\"\",\"\",'Yab.Dil Ön Değ'!I33)","v":""},{"$f":"IF('Yab.Dil Ön Değ'!J33=\"\",\"\",'Yab.Dil Ön Değ'!J33)","v":""},{"$f":"IF('Yab.Dil Ön Değ'!K33=\"\",\"\",'Yab.Dil Ön Değ'!K33)","v":""},{"$f":"IF('Yab.Dil Ön Değ'!L33=\"\",\"\",'Yab.Dil Ön Değ'!L33)","v":""}]
[{"$f":"IF('Yab.Dil Ön Değ'!A34=\"\",\"\",'Yab.Dil Ön Değ'!A34)","v":""},{"$f":"IF('Yab.Dil Ön Değ'!B34=\"\",\"\",LEFT('Yab.Dil Ön Değ'!B34,3)&REPT(\"*\",4)&RIGHT('Yab.Dil Ön Değ'!B34,2))","v":""},{"$f":"IF('Yab.Dil Ön Değ'!C34=\"\",\"\",IF(ISERR(FIND(\" \",'Yab.Dil Ön Değ'!C34))=TRUE,LEFT('Yab.Dil Ön Değ'!C34,2)&REPT(\"*\",3),LEFT('Yab.Dil Ön Değ'!C34,2)&REPT(\"*\",3)&\" \"&MID('Yab.Dil Ön Değ'!C34,FIND(\" \",'Yab.Dil Ön Değ'!C34)+1,2)&REPT(\"*\",3)))","v":""},{"$f":"IF('Yab.Dil Ön Değ'!D34=\"\",\"\",IF(ISERR(FIND(\" \",'Yab.Dil Ön Değ'!D34))=TRUE,LEFT('Yab.Dil Ön Değ'!D34,2)&REPT(\"*\",3),LEFT('Yab.Dil Ön Değ'!D34,2)&REPT(\"*\",3)&\" \"&MID('Yab.Dil Ön Değ'!D34,FIND(\" \",'Yab.Dil Ön Değ'!D34)+1,2)&REPT(\"*\",3)))","v":""},{"$f":"IF('Yab.Dil Ön Değ'!E34=\"\",\"\",'Yab.Dil Ön Değ'!E34)","v":""},{"$f":"IF('Yab.Dil Ön Değ'!F34=\"\",\"\",'Yab.Dil Ön Değ'!F34)","v":""},{"$f":"IF('Yab.Dil Ön Değ'!G34=\"\",\"\",'Yab.Dil Ön Değ'!G34)","v":""},{"$f":"IF('Yab.Dil Ön Değ'!H34=\"\",\"\",'Yab.Dil Ön Değ'!H34)","v":""},{"$f":"IF('Yab.Dil Ön Değ'!I34=\"\",\"\",'Yab.Dil Ön Değ'!I34)","v":""},{"$f":"IF('Yab.Dil Ön Değ'!J34=\"\",\"\",'Yab.Dil Ön Değ'!J34)","v":""},{"$f":"IF('Yab.Dil Ön Değ'!K34=\"\",\"\",'Yab.Dil Ön Değ'!K34)","v":""},{"$f":"IF('Yab.Dil Ön Değ'!L34=\"\",\"\",'Yab.Dil Ön Değ'!L34)","v":""}]
[{"$f":"IF('Yab.Dil Ön Değ'!A35=\"\",\"\",'Yab.Dil Ön Değ'!A35)","v":""},{"$f":"IF('Yab.Dil Ön Değ'!B35=\"\",\"\",LEFT('Yab.Dil Ön Değ'!B35,3)&REPT(\"*\",4)&RIGHT('Yab.Dil Ön Değ'!B35,2))","v":""},{"$f":"IF('Yab.Dil Ön Değ'!C35=\"\",\"\",IF(ISERR(FIND(\" \",'Yab.Dil Ön Değ'!C35))=TRUE,LEFT('Yab.Dil Ön Değ'!C35,2)&REPT(\"*\",3),LEFT('Yab.Dil Ön Değ'!C35,2)&REPT(\"*\",3)&\" \"&MID('Yab.Dil Ön Değ'!C35,FIND(\" \",'Yab.Dil Ön Değ'!C35)+1,2)&REPT(\"*\",3)))","v":""},{"$f":"IF('Yab.Dil Ön Değ'!D35=\"\",\"\",IF(ISERR(FIND(\" \",'Yab.Dil Ön Değ'!D35))=TRUE,LEFT('Yab.Dil Ön Değ'!D35,2)&REPT(\"*\",3),LEFT('Yab.Dil Ön Değ'!D35,2)&REPT(\"*\",3)&\" \"&MID('Yab.Dil Ön Değ'!D35,FIND(\" \",'Yab.Dil Ön Değ'!D35)+1,2)&REPT(\"*\",3)))","v":""},{"$f":"IF('Yab.Dil Ön Değ'!E35=\"\",\"\",'Yab.Dil Ön Değ'!E35)","v":""},{"$f":"IF('Yab.Dil Ön Değ'!F35=\"\",\"\",'Yab.Dil Ön Değ'!F35)","v":""},{"$f":"IF('Yab.Dil Ön Değ'!G35=\"\",\"\",'Yab.Dil Ön Değ'!G35)","v":""},{"$f":"IF('Yab.Dil Ön Değ'!H35=\"\",\"\",'Yab.Dil Ön Değ'!H35)","v":""},{"$f":"IF('Yab.Dil Ön Değ'!I35=\"\",\"\",'Yab.Dil Ön Değ'!I35)","v":""},{"$f":"IF('Yab.Dil Ön Değ'!J35=\"\",\"\",'Yab.Dil Ön Değ'!J35)","v":""},{"$f":"IF('Yab.Dil Ön Değ'!K35=\"\",\"\",'Yab.Dil Ön Değ'!K35)","v":""},{"$f":"IF('Yab.Dil Ön Değ'!L35=\"\",\"\",'Yab.Dil Ön Değ'!L35)","v":""}]
[{"$f":"IF('Yab.Dil Ön Değ'!A36=\"\",\"\",'Yab.Dil Ön Değ'!A36)","v":""},{"$f":"IF('Yab.Dil Ön Değ'!B36=\"\",\"\",LEFT('Yab.Dil Ön Değ'!B36,3)&REPT(\"*\",4)&RIGHT('Yab.Dil Ön Değ'!B36,2))","v":""},{"$f":"IF('Yab.Dil Ön Değ'!C36=\"\",\"\",IF(ISERR(FIND(\" \",'Yab.Dil Ön Değ'!C36))=TRUE,LEFT('Yab.Dil Ön Değ'!C36,2)&REPT(\"*\",3),LEFT('Yab.Dil Ön Değ'!C36,2)&REPT(\"*\",3)&\" \"&MID('Yab.Dil Ön Değ'!C36,FIND(\" \",'Yab.Dil Ön Değ'!C36)+1,2)&REPT(\"*\",3)))","v":""},{"$f":"IF('Yab.Dil Ön Değ'!D36=\"\",\"\",IF(ISERR(FIND(\" \",'Yab.Dil Ön Değ'!D36))=TRUE,LEFT('Yab.Dil Ön Değ'!D36,2)&REPT(\"*\",3),LEFT('Yab.Dil Ön Değ'!D36,2)&REPT(\"*\",3)&\" \"&MID('Yab.Dil Ön Değ'!D36,FIND(\" \",'Yab.Dil Ön Değ'!D36)+1,2)&REPT(\"*\",3)))","v":""},{"$f":"IF('Yab.Dil Ön Değ'!E36=\"\",\"\",'Yab.Dil Ön Değ'!E36)","v":""},{"$f":"IF('Yab.Dil Ön Değ'!F36=\"\",\"\",'Yab.Dil Ön Değ'!F36)","v":""},{"$f":"IF('Yab.Dil Ön Değ'!G36=\"\",\"\",'Yab.Dil Ön Değ'!G36)","v":""},{"$f":"IF('Yab.Dil Ön Değ'!H36=\"\",\"\",'Yab.Dil Ön Değ'!H36)","v":""},{"$f":"IF('Yab.Dil Ön Değ'!I36=\"\",\"\",'Yab.Dil Ön Değ'!I36)","v":""},{"$f":"IF('Yab.Dil Ön Değ'!J36=\"\",\"\",'Yab.Dil Ön Değ'!J36)","v":""},{"$f":"IF('Yab.Dil Ön Değ'!K36=\"\",\"\",'Yab.Dil Ön Değ'!K36)","v":""},{"$f":"IF('Yab.Dil Ön Değ'!L36=\"\",\"\",'Yab.Dil Ön Değ'!L36)","v":""}]
[{"$f":"IF('Yab.Dil Ön Değ'!A37=\"\",\"\",'Yab.Dil Ön Değ'!A37)","v":""},{"$f":"IF('Yab.Dil Ön Değ'!B37=\"\",\"\",LEFT('Yab.Dil Ön Değ'!B37,3)&REPT(\"*\",4)&RIGHT('Yab.Dil Ön Değ'!B37,2))","v":""},{"$f":"IF('Yab.Dil Ön Değ'!C37=\"\",\"\",IF(ISERR(FIND(\" \",'Yab.Dil Ön Değ'!C37))=TRUE,LEFT('Yab.Dil Ön Değ'!C37,2)&REPT(\"*\",3),LEFT('Yab.Dil Ön Değ'!C37,2)&REPT(\"*\",3)&\" \"&MID('Yab.Dil Ön Değ'!C37,FIND(\" \",'Yab.Dil Ön Değ'!C37)+1,2)&REPT(\"*\",3)))","v":""},{"$f":"IF('Yab.Dil Ön Değ'!D37=\"\",\"\",IF(ISERR(FIND(\" \",'Yab.Dil Ön Değ'!D37))=TRUE,LEFT('Yab.Dil Ön Değ'!D37,2)&REPT(\"*\",3),LEFT('Yab.Dil Ön Değ'!D37,2)&REPT(\"*\",3)&\" \"&MID('Yab.Dil Ön Değ'!D37,FIND(\" \",'Yab.Dil Ön Değ'!D37)+1,2)&REPT(\"*\",3)))","v":""},{"$f":"IF('Yab.Dil Ön Değ'!E37=\"\",\"\",'Yab.Dil Ön Değ'!E37)","v":""},{"$f":"IF('Yab.Dil Ön Değ'!F37=\"\",\"\",'Yab.Dil Ön Değ'!F37)","v":""},{"$f":"IF('Yab.Dil Ön Değ'!G37=\"\",\"\",'Yab.Dil Ön Değ'!G37)","v":""},{"$f":"IF('Yab.Dil Ön Değ'!H37=\"\",\"\",'Yab.Dil Ön Değ'!H37)","v":""},{"$f":"IF('Yab.Dil Ön Değ'!I37=\"\",\"\",'Yab.Dil Ön Değ'!I37)","v":""},{"$f":"IF('Yab.Dil Ön Değ'!J37=\"\",\"\",'Yab.Dil Ön Değ'!J37)","v":""},{"$f":"IF('Yab.Dil Ön Değ'!K37=\"\",\"\",'Yab.Dil Ön Değ'!K37)","v":""},{"$f":"IF('Yab.Dil Ön Değ'!L37=\"\",\"\",'Yab.Dil Ön Değ'!L37)","v":""}]
[{"$f":"IF('Yab.Dil Ön Değ'!A38=\"\",\"\",'Yab.Dil Ön Değ'!A38)","v":""},{"$f":"IF('Yab.Dil Ön Değ'!B38=\"\",\"\",LEFT('Yab.Dil Ön Değ'!B38,3)&REPT(\"*\",4)&RIGHT('Yab.Dil Ön Değ'!B38,2))","v":""},{"$f":"IF('Yab.Dil Ön Değ'!C38=\"\",\"\",IF(ISERR(FIND(\" \",'Yab.Dil Ön Değ'!C38))=TRUE,LEFT('Yab.Dil Ön Değ'!C38,2)&REPT(\"*\",3),LEFT('Yab.Dil Ön Değ'!C38,2)&REPT(\"*\",3)&\" \"&MID('Yab.Dil Ön Değ'!C38,FIND(\" \",'Yab.Dil Ön Değ'!C38)+1,2)&REPT(\"*\",3)))","v":""},{"$f":"IF('Yab.Dil Ön Değ'!D38=\"\",\"\",IF(ISERR(FIND(\" \",'Yab.Dil Ön Değ'!D38))=TRUE,LEFT('Yab.Dil Ön Değ'!D38,2)&REPT(\"*\",3),LEFT('Yab.Dil Ön Değ'!D38,2)&REPT(\"*\",3)&\" \"&MID('Yab.Dil Ön Değ'!D38,FIND(\" \",'Yab.Dil Ön Değ'!D38)+1,2)&REPT(\"*\",3)))","v":""},{"$f":"IF('Yab.Dil Ön Değ'!E38=\"\",\"\",'Yab.Dil Ön Değ'!E38)","v":""},{"$f":"IF('Yab.Dil Ön Değ'!F38=\"\",\"\",'Yab.Dil Ön Değ'!F38)","v":""},{"$f":"IF('Yab.Dil Ön Değ'!G38=\"\",\"\",'Yab.Dil Ön Değ'!G38)","v":""},{"$f":"IF('Yab.Dil Ön Değ'!H38=\"\",\"\",'Yab.Dil Ön Değ'!H38)","v":""},{"$f":"IF('Yab.Dil Ön Değ'!I38=\"\",\"\",'Yab.Dil Ön Değ'!I38)","v":""},{"$f":"IF('Yab.Dil Ön Değ'!J38=\"\",\"\",'Yab.Dil Ön Değ'!J38)","v":""},{"$f":"IF('Yab.Dil Ön Değ'!K38=\"\",\"\",'Yab.Dil Ön Değ'!K38)","v":""},{"$f":"IF('Yab.Dil Ön Değ'!L38=\"\",\"\",'Yab.Dil Ön Değ'!L38)","v":""}]
[{"$f":"IF('Yab.Dil Ön Değ'!A39=\"\",\"\",'Yab.Dil Ön Değ'!A39)","v":""},{"$f":"IF('Yab.Dil Ön Değ'!B39=\"\",\"\",LEFT('Yab.Dil Ön Değ'!B39,3)&REPT(\"*\",4)&RIGHT('Yab.Dil Ön Değ'!B39,2))","v":""},{"$f":"IF('Yab.Dil Ön Değ'!C39=\"\",\"\",IF(ISERR(FIND(\" \",'Yab.Dil Ön Değ'!C39))=TRUE,LEFT('Yab.Dil Ön Değ'!C39,2)&REPT(\"*\",3),LEFT('Yab.Dil Ön Değ'!C39,2)&REPT(\"*\",3)&\" \"&MID('Yab.Dil Ön Değ'!C39,FIND(\" \",'Yab.Dil Ön Değ'!C39)+1,2)&REPT(\"*\",3)))","v":""},{"$f":"IF('Yab.Dil Ön Değ'!D39=\"\",\"\",IF(ISERR(FIND(\" \",'Yab.Dil Ön Değ'!D39))=TRUE,LEFT('Yab.Dil Ön Değ'!D39,2)&REPT(\"*\",3),LEFT('Yab.Dil Ön Değ'!D39,2)&REPT(\"*\",3)&\" \"&MID('Yab.Dil Ön Değ'!D39,FIND(\" \",'Yab.Dil Ön Değ'!D39)+1,2)&REPT(\"*\",3)))","v":""},{"$f":"IF('Yab.Dil Ön Değ'!E39=\"\",\"\",'Yab.Dil Ön Değ'!E39)","v":""},{"$f":"IF('Yab.Dil Ön Değ'!F39=\"\",\"\",'Yab.Dil Ön Değ'!F39)","v":""},{"$f":"IF('Yab.Dil Ön Değ'!G39=\"\",\"\",'Yab.Dil Ön Değ'!G39)","v":""},{"$f":"IF('Yab.Dil Ön Değ'!H39=\"\",\"\",'Yab.Dil Ön Değ'!H39)","v":""},{"$f":"IF('Yab.Dil Ön Değ'!I39=\"\",\"\",'Yab.Dil Ön Değ'!I39)","v":""},{"$f":"IF('Yab.Dil Ön Değ'!J39=\"\",\"\",'Yab.Dil Ön Değ'!J39)","v":""},{"$f":"IF('Yab.Dil Ön Değ'!K39=\"\",\"\",'Yab.Dil Ön Değ'!K39)","v":""},{"$f":"IF('Yab.Dil Ön Değ'!L39=\"\",\"\",'Yab.Dil Ön Değ'!L39)","v":""}]
[{"$f":"IF('Yab.Dil Ön Değ'!A40=\"\",\"\",'Yab.Dil Ön Değ'!A40)","v":""},{"$f":"IF('Yab.Dil Ön Değ'!B40=\"\",\"\",LEFT('Yab.Dil Ön Değ'!B40,3)&REPT(\"*\",4)&RIGHT('Yab.Dil Ön Değ'!B40,2))","v":""},{"$f":"IF('Yab.Dil Ön Değ'!C40=\"\",\"\",IF(ISERR(FIND(\" \",'Yab.Dil Ön Değ'!C40))=TRUE,LEFT('Yab.Dil Ön Değ'!C40,2)&REPT(\"*\",3),LEFT('Yab.Dil Ön Değ'!C40,2)&REPT(\"*\",3)&\" \"&MID('Yab.Dil Ön Değ'!C40,FIND(\" \",'Yab.Dil Ön Değ'!C40)+1,2)&REPT(\"*\",3)))","v":""},{"$f":"IF('Yab.Dil Ön Değ'!D40=\"\",\"\",IF(ISERR(FIND(\" \",'Yab.Dil Ön Değ'!D40))=TRUE,LEFT('Yab.Dil Ön Değ'!D40,2)&REPT(\"*\",3),LEFT('Yab.Dil Ön Değ'!D40,2)&REPT(\"*\",3)&\" \"&MID('Yab.Dil Ön Değ'!D40,FIND(\" \",'Yab.Dil Ön Değ'!D40)+1,2)&REPT(\"*\",3)))","v":""},{"$f":"IF('Yab.Dil Ön Değ'!E40=\"\",\"\",'Yab.Dil Ön Değ'!E40)","v":""},{"$f":"IF('Yab.Dil Ön Değ'!F40=\"\",\"\",'Yab.Dil Ön Değ'!F40)","v":""},{"$f":"IF('Yab.Dil Ön Değ'!G40=\"\",\"\",'Yab.Dil Ön Değ'!G40)","v":""},{"$f":"IF('Yab.Dil Ön Değ'!H40=\"\",\"\",'Yab.Dil Ön Değ'!H40)","v":""},{"$f":"IF('Yab.Dil Ön Değ'!I40=\"\",\"\",'Yab.Dil Ön Değ'!I40)","v":""},{"$f":"IF('Yab.Dil Ön Değ'!J40=\"\",\"\",'Yab.Dil Ön Değ'!J40)","v":""},{"$f":"IF('Yab.Dil Ön Değ'!K40=\"\",\"\",'Yab.Dil Ön Değ'!K40)","v":""},{"$f":"IF('Yab.Dil Ön Değ'!L40=\"\",\"\",'Yab.Dil Ön Değ'!L40)","v":""}]
[{"$f":"IF('Yab.Dil Ön Değ'!A41=\"\",\"\",'Yab.Dil Ön Değ'!A41)","v":""},{"$f":"IF('Yab.Dil Ön Değ'!B41=\"\",\"\",LEFT('Yab.Dil Ön Değ'!B41,3)&REPT(\"*\",4)&RIGHT('Yab.Dil Ön Değ'!B41,2))","v":""},{"$f":"IF('Yab.Dil Ön Değ'!C41=\"\",\"\",IF(ISERR(FIND(\" \",'Yab.Dil Ön Değ'!C41))=TRUE,LEFT('Yab.Dil Ön Değ'!C41,2)&REPT(\"*\",3),LEFT('Yab.Dil Ön Değ'!C41,2)&REPT(\"*\",3)&\" \"&MID('Yab.Dil Ön Değ'!C41,FIND(\" \",'Yab.Dil Ön Değ'!C41)+1,2)&REPT(\"*\",3)))","v":""},{"$f":"IF('Yab.Dil Ön Değ'!D41=\"\",\"\",IF(ISERR(FIND(\" \",'Yab.Dil Ön Değ'!D41))=TRUE,LEFT('Yab.Dil Ön Değ'!D41,2)&REPT(\"*\",3),LEFT('Yab.Dil Ön Değ'!D41,2)&REPT(\"*\",3)&\" \"&MID('Yab.Dil Ön Değ'!D41,FIND(\" \",'Yab.Dil Ön Değ'!D41)+1,2)&REPT(\"*\",3)))","v":""},{"$f":"IF('Yab.Dil Ön Değ'!E41=\"\",\"\",'Yab.Dil Ön Değ'!E41)","v":""},{"$f":"IF('Yab.Dil Ön Değ'!F41=\"\",\"\",'Yab.Dil Ön Değ'!F41)","v":""},{"$f":"IF('Yab.Dil Ön Değ'!G41=\"\",\"\",'Yab.Dil Ön Değ'!G41)","v":""},{"$f":"IF('Yab.Dil Ön Değ'!H41=\"\",\"\",'Yab.Dil Ön Değ'!H41)","v":""},{"$f":"IF('Yab.Dil Ön Değ'!I41=\"\",\"\",'Yab.Dil Ön Değ'!I41)","v":""},{"$f":"IF('Yab.Dil Ön Değ'!J41=\"\",\"\",'Yab.Dil Ön Değ'!J41)","v":""},{"$f":"IF('Yab.Dil Ön Değ'!K41=\"\",\"\",'Yab.Dil Ön Değ'!K41)","v":""},{"$f":"IF('Yab.Dil Ön Değ'!L41=\"\",\"\",'Yab.Dil Ön Değ'!L41)","v":""}]
[{"$f":"IF('Yab.Dil Ön Değ'!A42=\"\",\"\",'Yab.Dil Ön Değ'!A42)","v":""},{"$f":"IF('Yab.Dil Ön Değ'!B42=\"\",\"\",LEFT('Yab.Dil Ön Değ'!B42,3)&REPT(\"*\",4)&RIGHT('Yab.Dil Ön Değ'!B42,2))","v":""},{"$f":"IF('Yab.Dil Ön Değ'!C42=\"\",\"\",IF(ISERR(FIND(\" \",'Yab.Dil Ön Değ'!C42))=TRUE,LEFT('Yab.Dil Ön Değ'!C42,2)&REPT(\"*\",3),LEFT('Yab.Dil Ön Değ'!C42,2)&REPT(\"*\",3)&\" \"&MID('Yab.Dil Ön Değ'!C42,FIND(\" \",'Yab.Dil Ön Değ'!C42)+1,2)&REPT(\"*\",3)))","v":""},{"$f":"IF('Yab.Dil Ön Değ'!D42=\"\",\"\",IF(ISERR(FIND(\" \",'Yab.Dil Ön Değ'!D42))=TRUE,LEFT('Yab.Dil Ön Değ'!D42,2)&REPT(\"*\",3),LEFT('Yab.Dil Ön Değ'!D42,2)&REPT(\"*\",3)&\" \"&MID('Yab.Dil Ön Değ'!D42,FIND(\" \",'Yab.Dil Ön Değ'!D42)+1,2)&REPT(\"*\",3)))","v":""},{"$f":"IF('Yab.Dil Ön Değ'!E42=\"\",\"\",'Yab.Dil Ön Değ'!E42)","v":""},{"$f":"IF('Yab.Dil Ön Değ'!F42=\"\",\"\",'Yab.Dil Ön Değ'!F42)","v":""},{"$f":"IF('Yab.Dil Ön Değ'!G42=\"\",\"\",'Yab.Dil Ön Değ'!G42)","v":""},{"$f":"IF('Yab.Dil Ön Değ'!H42=\"\",\"\",'Yab.Dil Ön Değ'!H42)","v":""},{"$f":"IF('Yab.Dil Ön Değ'!I42=\"\",\"\",'Yab.Dil Ön Değ'!I42)","v":""},{"$f":"IF('Yab.Dil Ön Değ'!J42=\"\",\"\",'Yab.Dil Ön Değ'!J42)","v":""},{"$f":"IF('Yab.Dil Ön Değ'!K42=\"\",\"\",'Yab.Dil Ön Değ'!K42)","v":""},{"$f":"IF('Yab.Dil Ön Değ'!L42=\"\",\"\",'Yab.Dil Ön Değ'!L42)","v":""}]
[{"$f":"IF('Yab.Dil Ön Değ'!A43=\"\",\"\",'Yab.Dil Ön Değ'!A43)","v":""},{"$f":"IF('Yab.Dil Ön Değ'!B43=\"\",\"\",LEFT('Yab.Dil Ön Değ'!B43,3)&REPT(\"*\",4)&RIGHT('Yab.Dil Ön Değ'!B43,2))","v":""},{"$f":"IF('Yab.Dil Ön Değ'!C43=\"\",\"\",IF(ISERR(FIND(\" \",'Yab.Dil Ön Değ'!C43))=TRUE,LEFT('Yab.Dil Ön Değ'!C43,2)&REPT(\"*\",3),LEFT('Yab.Dil Ön Değ'!C43,2)&REPT(\"*\",3)&\" \"&MID('Yab.Dil Ön Değ'!C43,FIND(\" \",'Yab.Dil Ön Değ'!C43)+1,2)&REPT(\"*\",3)))","v":""},{"$f":"IF('Yab.Dil Ön Değ'!D43=\"\",\"\",IF(ISERR(FIND(\" \",'Yab.Dil Ön Değ'!D43))=TRUE,LEFT('Yab.Dil Ön Değ'!D43,2)&REPT(\"*\",3),LEFT('Yab.Dil Ön Değ'!D43,2)&REPT(\"*\",3)&\" \"&MID('Yab.Dil Ön Değ'!D43,FIND(\" \",'Yab.Dil Ön Değ'!D43)+1,2)&REPT(\"*\",3)))","v":""},{"$f":"IF('Yab.Dil Ön Değ'!E43=\"\",\"\",'Yab.Dil Ön Değ'!E43)","v":""},{"$f":"IF('Yab.Dil Ön Değ'!F43=\"\",\"\",'Yab.Dil Ön Değ'!F43)","v":""},{"$f":"IF('Yab.Dil Ön Değ'!G43=\"\",\"\",'Yab.Dil Ön Değ'!G43)","v":""},{"$f":"IF('Yab.Dil Ön Değ'!H43=\"\",\"\",'Yab.Dil Ön Değ'!H43)","v":""},{"$f":"IF('Yab.Dil Ön Değ'!I43=\"\",\"\",'Yab.Dil Ön Değ'!I43)","v":""},{"$f":"IF('Yab.Dil Ön Değ'!J43=\"\",\"\",'Yab.Dil Ön Değ'!J43)","v":""},{"$f":"IF('Yab.Dil Ön Değ'!K43=\"\",\"\",'Yab.Dil Ön Değ'!K43)","v":""},{"$f":"IF('Yab.Dil Ön Değ'!L43=\"\",\"\",'Yab.Dil Ön Değ'!L43)","v":""}]
[{"$f":"IF('Yab.Dil Ön Değ'!A44=\"\",\"\",'Yab.Dil Ön Değ'!A44)","v":""},{"$f":"IF('Yab.Dil Ön Değ'!B44=\"\",\"\",LEFT('Yab.Dil Ön Değ'!B44,3)&REPT(\"*\",4)&RIGHT('Yab.Dil Ön Değ'!B44,2))","v":""},{"$f":"IF('Yab.Dil Ön Değ'!C44=\"\",\"\",IF(ISERR(FIND(\" \",'Yab.Dil Ön Değ'!C44))=TRUE,LEFT('Yab.Dil Ön Değ'!C44,2)&REPT(\"*\",3),LEFT('Yab.Dil Ön Değ'!C44,2)&REPT(\"*\",3)&\" \"&MID('Yab.Dil Ön Değ'!C44,FIND(\" \",'Yab.Dil Ön Değ'!C44)+1,2)&REPT(\"*\",3)))","v":""},{"$f":"IF('Yab.Dil Ön Değ'!D44=\"\",\"\",IF(ISERR(FIND(\" \",'Yab.Dil Ön Değ'!D44))=TRUE,LEFT('Yab.Dil Ön Değ'!D44,2)&REPT(\"*\",3),LEFT('Yab.Dil Ön Değ'!D44,2)&REPT(\"*\",3)&\" \"&MID('Yab.Dil Ön Değ'!D44,FIND(\" \",'Yab.Dil Ön Değ'!D44)+1,2)&REPT(\"*\",3)))","v":""},{"$f":"IF('Yab.Dil Ön Değ'!E44=\"\",\"\",'Yab.Dil Ön Değ'!E44)","v":""},{"$f":"IF('Yab.Dil Ön Değ'!F44=\"\",\"\",'Yab.Dil Ön Değ'!F44)","v":""},{"$f":"IF('Yab.Dil Ön Değ'!G44=\"\",\"\",'Yab.Dil Ön Değ'!G44)","v":""},{"$f":"IF('Yab.Dil Ön Değ'!H44=\"\",\"\",'Yab.Dil Ön Değ'!H44)","v":""},{"$f":"IF('Yab.Dil Ön Değ'!I44=\"\",\"\",'Yab.Dil Ön Değ'!I44)","v":""},{"$f":"IF('Yab.Dil Ön Değ'!J44=\"\",\"\",'Yab.Dil Ön Değ'!J44)","v":""},{"$f":"IF('Yab.Dil Ön Değ'!K44=\"\",\"\",'Yab.Dil Ön Değ'!K44)","v":""},{"$f":"IF('Yab.Dil Ön Değ'!L44=\"\",\"\",'Yab.Dil Ön Değ'!L44)","v":""}]
[{"$f":"IF('Yab.Dil Ön Değ'!A45=\"\",\"\",'Yab.Dil Ön Değ'!A45)","v":""},{"$f":"IF('Yab.Dil Ön Değ'!B45=\"\",\"\",LEFT('Yab.Dil Ön Değ'!B45,3)&REPT(\"*\",4)&RIGHT('Yab.Dil Ön Değ'!B45,2))","v":""},{"$f":"IF('Yab.Dil Ön Değ'!C45=\"\",\"\",IF(ISERR(FIND(\" \",'Yab.Dil Ön Değ'!C45))=TRUE,LEFT('Yab.Dil Ön Değ'!C45,2)&REPT(\"*\",3),LEFT('Yab.Dil Ön Değ'!C45,2)&REPT(\"*\",3)&\" \"&MID('Yab.Dil Ön Değ'!C45,FIND(\" \",'Yab.Dil Ön Değ'!C45)+1,2)&REPT(\"*\",3)))","v":""},{"$f":"IF('Yab.Dil Ön Değ'!D45=\"\",\"\",IF(ISERR(FIND(\" \",'Yab.Dil Ön Değ'!D45))=TRUE,LEFT('Yab.Dil Ön Değ'!D45,2)&REPT(\"*\",3),LEFT('Yab.Dil Ön Değ'!D45,2)&REPT(\"*\",3)&\" \"&MID('Yab.Dil Ön Değ'!D45,FIND(\" \",'Yab.Dil Ön Değ'!D45)+1,2)&REPT(\"*\",3)))","v":""},{"$f":"IF('Yab.Dil Ön Değ'!E45=\"\",\"\",'Yab.Dil Ön Değ'!E45)","v":""},{"$f":"IF('Yab.Dil Ön Değ'!F45=\"\",\"\",'Yab.Dil Ön Değ'!F45)","v":""},{"$f":"IF('Yab.Dil Ön Değ'!G45=\"\",\"\",'Yab.Dil Ön Değ'!G45)","v":""},{"$f":"IF('Yab.Dil Ön Değ'!H45=\"\",\"\",'Yab.Dil Ön Değ'!H45)","v":""},{"$f":"IF('Yab.Dil Ön Değ'!I45=\"\",\"\",'Yab.Dil Ön Değ'!I45)","v":""},{"$f":"IF('Yab.Dil Ön Değ'!J45=\"\",\"\",'Yab.Dil Ön Değ'!J45)","v":""},{"$f":"IF('Yab.Dil Ön Değ'!K45=\"\",\"\",'Yab.Dil Ön Değ'!K45)","v":""},{"$f":"IF('Yab.Dil Ön Değ'!L45=\"\",\"\",'Yab.Dil Ön Değ'!L45)","v":""}]
[{"$f":"IF('Yab.Dil Ön Değ'!A46=\"\",\"\",'Yab.Dil Ön Değ'!A46)","v":""},{"$f":"IF('Yab.Dil Ön Değ'!B46=\"\",\"\",LEFT('Yab.Dil Ön Değ'!B46,3)&REPT(\"*\",4)&RIGHT('Yab.Dil Ön Değ'!B46,2))","v":""},{"$f":"IF('Yab.Dil Ön Değ'!C46=\"\",\"\",IF(ISERR(FIND(\" \",'Yab.Dil Ön Değ'!C46))=TRUE,LEFT('Yab.Dil Ön Değ'!C46,2)&REPT(\"*\",3),LEFT('Yab.Dil Ön Değ'!C46,2)&REPT(\"*\",3)&\" \"&MID('Yab.Dil Ön Değ'!C46,FIND(\" \",'Yab.Dil Ön Değ'!C46)+1,2)&REPT(\"*\",3)))","v":""},{"$f":"IF('Yab.Dil Ön Değ'!D46=\"\",\"\",IF(ISERR(FIND(\" \",'Yab.Dil Ön Değ'!D46))=TRUE,LEFT('Yab.Dil Ön Değ'!D46,2)&REPT(\"*\",3),LEFT('Yab.Dil Ön Değ'!D46,2)&REPT(\"*\",3)&\" \"&MID('Yab.Dil Ön Değ'!D46,FIND(\" \",'Yab.Dil Ön Değ'!D46)+1,2)&REPT(\"*\",3)))","v":""},{"$f":"IF('Yab.Dil Ön Değ'!E46=\"\",\"\",'Yab.Dil Ön Değ'!E46)","v":""},{"$f":"IF('Yab.Dil Ön Değ'!F46=\"\",\"\",'Yab.Dil Ön Değ'!F46)","v":""},{"$f":"IF('Yab.Dil Ön Değ'!G46=\"\",\"\",'Yab.Dil Ön Değ'!G46)","v":""},{"$f":"IF('Yab.Dil Ön Değ'!H46=\"\",\"\",'Yab.Dil Ön Değ'!H46)","v":""},{"$f":"IF('Yab.Dil Ön Değ'!I46=\"\",\"\",'Yab.Dil Ön Değ'!I46)","v":""},{"$f":"IF('Yab.Dil Ön Değ'!J46=\"\",\"\",'Yab.Dil Ön Değ'!J46)","v":""},{"$f":"IF('Yab.Dil Ön Değ'!K46=\"\",\"\",'Yab.Dil Ön Değ'!K46)","v":""},{"$f":"IF('Yab.Dil Ön Değ'!L46=\"\",\"\",'Yab.Dil Ön Değ'!L46)","v":""}]
[{"$f":"IF('Yab.Dil Ön Değ'!A47=\"\",\"\",'Yab.Dil Ön Değ'!A47)","v":""},{"$f":"IF('Yab.Dil Ön Değ'!B47=\"\",\"\",LEFT('Yab.Dil Ön Değ'!B47,3)&REPT(\"*\",4)&RIGHT('Yab.Dil Ön Değ'!B47,2))","v":""},{"$f":"IF('Yab.Dil Ön Değ'!C47=\"\",\"\",IF(ISERR(FIND(\" \",'Yab.Dil Ön Değ'!C47))=TRUE,LEFT('Yab.Dil Ön Değ'!C47,2)&REPT(\"*\",3),LEFT('Yab.Dil Ön Değ'!C47,2)&REPT(\"*\",3)&\" \"&MID('Yab.Dil Ön Değ'!C47,FIND(\" \",'Yab.Dil Ön Değ'!C47)+1,2)&REPT(\"*\",3)))","v":""},{"$f":"IF('Yab.Dil Ön Değ'!D47=\"\",\"\",IF(ISERR(FIND(\" \",'Yab.Dil Ön Değ'!D47))=TRUE,LEFT('Yab.Dil Ön Değ'!D47,2)&REPT(\"*\",3),LEFT('Yab.Dil Ön Değ'!D47,2)&REPT(\"*\",3)&\" \"&MID('Yab.Dil Ön Değ'!D47,FIND(\" \",'Yab.Dil Ön Değ'!D47)+1,2)&REPT(\"*\",3)))","v":""},{"$f":"IF('Yab.Dil Ön Değ'!E47=\"\",\"\",'Yab.Dil Ön Değ'!E47)","v":""},{"$f":"IF('Yab.Dil Ön Değ'!F47=\"\",\"\",'Yab.Dil Ön Değ'!F47)","v":""},{"$f":"IF('Yab.Dil Ön Değ'!G47=\"\",\"\",'Yab.Dil Ön Değ'!G47)","v":""},{"$f":"IF('Yab.Dil Ön Değ'!H47=\"\",\"\",'Yab.Dil Ön Değ'!H47)","v":""},{"$f":"IF('Yab.Dil Ön Değ'!I47=\"\",\"\",'Yab.Dil Ön Değ'!I47)","v":""},{"$f":"IF('Yab.Dil Ön Değ'!J47=\"\",\"\",'Yab.Dil Ön Değ'!J47)","v":""},{"$f":"IF('Yab.Dil Ön Değ'!K47=\"\",\"\",'Yab.Dil Ön Değ'!K47)","v":""},{"$f":"IF('Yab.Dil Ön Değ'!L47=\"\",\"\",'Yab.Dil Ön Değ'!L47)","v":""}]
[{"$f":"IF('Yab.Dil Ön Değ'!A48=\"\",\"\",'Yab.Dil Ön Değ'!A48)","v":""},{"$f":"IF('Yab.Dil Ön Değ'!B48=\"\",\"\",LEFT('Yab.Dil Ön Değ'!B48,3)&REPT(\"*\",4)&RIGHT('Yab.Dil Ön Değ'!B48,2))","v":""},{"$f":"IF('Yab.Dil Ön Değ'!C48=\"\",\"\",IF(ISERR(FIND(\" \",'Yab.Dil Ön Değ'!C48))=TRUE,LEFT('Yab.Dil Ön Değ'!C48,2)&REPT(\"*\",3),LEFT('Yab.Dil Ön Değ'!C48,2)&REPT(\"*\",3)&\" \"&MID('Yab.Dil Ön Değ'!C48,FIND(\" \",'Yab.Dil Ön Değ'!C48)+1,2)&REPT(\"*\",3)))","v":""},{"$f":"IF('Yab.Dil Ön Değ'!D48=\"\",\"\",IF(ISERR(FIND(\" \",'Yab.Dil Ön Değ'!D48))=TRUE,LEFT('Yab.Dil Ön Değ'!D48,2)&REPT(\"*\",3),LEFT('Yab.Dil Ön Değ'!D48,2)&REPT(\"*\",3)&\" \"&MID('Yab.Dil Ön Değ'!D48,FIND(\" \",'Yab.Dil Ön Değ'!D48)+1,2)&REPT(\"*\",3)))","v":""},{"$f":"IF('Yab.Dil Ön Değ'!E48=\"\",\"\",'Yab.Dil Ön Değ'!E48)","v":""},{"$f":"IF('Yab.Dil Ön Değ'!F48=\"\",\"\",'Yab.Dil Ön Değ'!F48)","v":""},{"$f":"IF('Yab.Dil Ön Değ'!G48=\"\",\"\",'Yab.Dil Ön Değ'!G48)","v":""},{"$f":"IF('Yab.Dil Ön Değ'!H48=\"\",\"\",'Yab.Dil Ön Değ'!H48)","v":""},{"$f":"IF('Yab.Dil Ön Değ'!I48=\"\",\"\",'Yab.Dil Ön Değ'!I48)","v":""},{"$f":"IF('Yab.Dil Ön Değ'!J48=\"\",\"\",'Yab.Dil Ön Değ'!J48)","v":""},{"$f":"IF('Yab.Dil Ön Değ'!K48=\"\",\"\",'Yab.Dil Ön Değ'!K48)","v":""},{"$f":"IF('Yab.Dil Ön Değ'!L48=\"\",\"\",'Yab.Dil Ön Değ'!L48)","v":""}]
[{"$f":"IF('Yab.Dil Ön Değ'!A49=\"\",\"\",'Yab.Dil Ön Değ'!A49)","v":""},{"$f":"IF('Yab.Dil Ön Değ'!B49=\"\",\"\",LEFT('Yab.Dil Ön Değ'!B49,3)&REPT(\"*\",4)&RIGHT('Yab.Dil Ön Değ'!B49,2))","v":""},{"$f":"IF('Yab.Dil Ön Değ'!C49=\"\",\"\",IF(ISERR(FIND(\" \",'Yab.Dil Ön Değ'!C49))=TRUE,LEFT('Yab.Dil Ön Değ'!C49,2)&REPT(\"*\",3),LEFT('Yab.Dil Ön Değ'!C49,2)&REPT(\"*\",3)&\" \"&MID('Yab.Dil Ön Değ'!C49,FIND(\" \",'Yab.Dil Ön Değ'!C49)+1,2)&REPT(\"*\",3)))","v":""},{"$f":"IF('Yab.Dil Ön Değ'!D49=\"\",\"\",IF(ISERR(FIND(\" \",'Yab.Dil Ön Değ'!D49))=TRUE,LEFT('Yab.Dil Ön Değ'!D49,2)&REPT(\"*\",3),LEFT('Yab.Dil Ön Değ'!D49,2)&REPT(\"*\",3)&\" \"&MID('Yab.Dil Ön Değ'!D49,FIND(\" \",'Yab.Dil Ön Değ'!D49)+1,2)&REPT(\"*\",3)))","v":""},{"$f":"IF('Yab.Dil Ön Değ'!E49=\"\",\"\",'Yab.Dil Ön Değ'!E49)","v":""},{"$f":"IF('Yab.Dil Ön Değ'!F49=\"\",\"\",'Yab.Dil Ön Değ'!F49)","v":""},{"$f":"IF('Yab.Dil Ön Değ'!G49=\"\",\"\",'Yab.Dil Ön Değ'!G49)","v":""},{"$f":"IF('Yab.Dil Ön Değ'!H49=\"\",\"\",'Yab.Dil Ön Değ'!H49)","v":""},{"$f":"IF('Yab.Dil Ön Değ'!I49=\"\",\"\",'Yab.Dil Ön Değ'!I49)","v":""},{"$f":"IF('Yab.Dil Ön Değ'!J49=\"\",\"\",'Yab.Dil Ön Değ'!J49)","v":""},{"$f":"IF('Yab.Dil Ön Değ'!K49=\"\",\"\",'Yab.Dil Ön Değ'!K49)","v":""},{"$f":"IF('Yab.Dil Ön Değ'!L49=\"\",\"\",'Yab.Dil Ön Değ'!L49)","v":""}]
[{"$f":"IF('Yab.Dil Ön Değ'!A50=\"\",\"\",'Yab.Dil Ön Değ'!A50)","v":""},{"$f":"IF('Yab.Dil Ön Değ'!B50=\"\",\"\",LEFT('Yab.Dil Ön Değ'!B50,3)&REPT(\"*\",4)&RIGHT('Yab.Dil Ön Değ'!B50,2))","v":""},{"$f":"IF('Yab.Dil Ön Değ'!C50=\"\",\"\",IF(ISERR(FIND(\" \",'Yab.Dil Ön Değ'!C50))=TRUE,LEFT('Yab.Dil Ön Değ'!C50,2)&REPT(\"*\",3),LEFT('Yab.Dil Ön Değ'!C50,2)&REPT(\"*\",3)&\" \"&MID('Yab.Dil Ön Değ'!C50,FIND(\" \",'Yab.Dil Ön Değ'!C50)+1,2)&REPT(\"*\",3)))","v":""},{"$f":"IF('Yab.Dil Ön Değ'!D50=\"\",\"\",IF(ISERR(FIND(\" \",'Yab.Dil Ön Değ'!D50))=TRUE,LEFT('Yab.Dil Ön Değ'!D50,2)&REPT(\"*\",3),LEFT('Yab.Dil Ön Değ'!D50,2)&REPT(\"*\",3)&\" \"&MID('Yab.Dil Ön Değ'!D50,FIND(\" \",'Yab.Dil Ön Değ'!D50)+1,2)&REPT(\"*\",3)))","v":""},{"$f":"IF('Yab.Dil Ön Değ'!E50=\"\",\"\",'Yab.Dil Ön Değ'!E50)","v":""},{"$f":"IF('Yab.Dil Ön Değ'!F50=\"\",\"\",'Yab.Dil Ön Değ'!F50)","v":""},{"$f":"IF('Yab.Dil Ön Değ'!G50=\"\",\"\",'Yab.Dil Ön Değ'!G50)","v":""},{"$f":"IF('Yab.Dil Ön Değ'!H50=\"\",\"\",'Yab.Dil Ön Değ'!H50)","v":""},{"$f":"IF('Yab.Dil Ön Değ'!I50=\"\",\"\",'Yab.Dil Ön Değ'!I50)","v":""},{"$f":"IF('Yab.Dil Ön Değ'!J50=\"\",\"\",'Yab.Dil Ön Değ'!J50)","v":""},{"$f":"IF('Yab.Dil Ön Değ'!K50=\"\",\"\",'Yab.Dil Ön Değ'!K50)","v":""},{"$f":"IF('Yab.Dil Ön Değ'!L50=\"\",\"\",'Yab.Dil Ön Değ'!L50)","v":""}]
[{"$f":"IF('Yab.Dil Ön Değ'!A51=\"\",\"\",'Yab.Dil Ön Değ'!A51)","v":""},{"$f":"IF('Yab.Dil Ön Değ'!B51=\"\",\"\",LEFT('Yab.Dil Ön Değ'!B51,3)&REPT(\"*\",4)&RIGHT('Yab.Dil Ön Değ'!B51,2))","v":""},{"$f":"IF('Yab.Dil Ön Değ'!C51=\"\",\"\",IF(ISERR(FIND(\" \",'Yab.Dil Ön Değ'!C51))=TRUE,LEFT('Yab.Dil Ön Değ'!C51,2)&REPT(\"*\",3),LEFT('Yab.Dil Ön Değ'!C51,2)&REPT(\"*\",3)&\" \"&MID('Yab.Dil Ön Değ'!C51,FIND(\" \",'Yab.Dil Ön Değ'!C51)+1,2)&REPT(\"*\",3)))","v":""},{"$f":"IF('Yab.Dil Ön Değ'!D51=\"\",\"\",IF(ISERR(FIND(\" \",'Yab.Dil Ön Değ'!D51))=TRUE,LEFT('Yab.Dil Ön Değ'!D51,2)&REPT(\"*\",3),LEFT('Yab.Dil Ön Değ'!D51,2)&REPT(\"*\",3)&\" \"&MID('Yab.Dil Ön Değ'!D51,FIND(\" \",'Yab.Dil Ön Değ'!D51)+1,2)&REPT(\"*\",3)))","v":""},{"$f":"IF('Yab.Dil Ön Değ'!E51=\"\",\"\",'Yab.Dil Ön Değ'!E51)","v":""},{"$f":"IF('Yab.Dil Ön Değ'!F51=\"\",\"\",'Yab.Dil Ön Değ'!F51)","v":""},{"$f":"IF('Yab.Dil Ön Değ'!G51=\"\",\"\",'Yab.Dil Ön Değ'!G51)","v":""},{"$f":"IF('Yab.Dil Ön Değ'!H51=\"\",\"\",'Yab.Dil Ön Değ'!H51)","v":""},{"$f":"IF('Yab.Dil Ön Değ'!I51=\"\",\"\",'Yab.Dil Ön Değ'!I51)","v":""},{"$f":"IF('Yab.Dil Ön Değ'!J51=\"\",\"\",'Yab.Dil Ön Değ'!J51)","v":""},{"$f":"IF('Yab.Dil Ön Değ'!K51=\"\",\"\",'Yab.Dil Ön Değ'!K51)","v":""},{"$f":"IF('Yab.Dil Ön Değ'!L51=\"\",\"\",'Yab.Dil Ön Değ'!L51)","v":""}]
[{"$f":"IF('Yab.Dil Ön Değ'!A52=\"\",\"\",'Yab.Dil Ön Değ'!A52)","v":""},{"$f":"IF('Yab.Dil Ön Değ'!B52=\"\",\"\",LEFT('Yab.Dil Ön Değ'!B52,3)&REPT(\"*\",4)&RIGHT('Yab.Dil Ön Değ'!B52,2))","v":""},{"$f":"IF('Yab.Dil Ön Değ'!C52=\"\",\"\",IF(ISERR(FIND(\" \",'Yab.Dil Ön Değ'!C52))=TRUE,LEFT('Yab.Dil Ön Değ'!C52,2)&REPT(\"*\",3),LEFT('Yab.Dil Ön Değ'!C52,2)&REPT(\"*\",3)&\" \"&MID('Yab.Dil Ön Değ'!C52,FIND(\" \",'Yab.Dil Ön Değ'!C52)+1,2)&REPT(\"*\",3)))","v":""},{"$f":"IF('Yab.Dil Ön Değ'!D52=\"\",\"\",IF(ISERR(FIND(\" \",'Yab.Dil Ön Değ'!D52))=TRUE,LEFT('Yab.Dil Ön Değ'!D52,2)&REPT(\"*\",3),LEFT('Yab.Dil Ön Değ'!D52,2)&REPT(\"*\",3)&\" \"&MID('Yab.Dil Ön Değ'!D52,FIND(\" \",'Yab.Dil Ön Değ'!D52)+1,2)&REPT(\"*\",3)))","v":""},{"$f":"IF('Yab.Dil Ön Değ'!E52=\"\",\"\",'Yab.Dil Ön Değ'!E52)","v":""},{"$f":"IF('Yab.Dil Ön Değ'!F52=\"\",\"\",'Yab.Dil Ön Değ'!F52)","v":""},{"$f":"IF('Yab.Dil Ön Değ'!G52=\"\",\"\",'Yab.Dil Ön Değ'!G52)","v":""},{"$f":"IF('Yab.Dil Ön Değ'!H52=\"\",\"\",'Yab.Dil Ön Değ'!H52)","v":""},{"$f":"IF('Yab.Dil Ön Değ'!I52=\"\",\"\",'Yab.Dil Ön Değ'!I52)","v":""},{"$f":"IF('Yab.Dil Ön Değ'!J52=\"\",\"\",'Yab.Dil Ön Değ'!J52)","v":""},{"$f":"IF('Yab.Dil Ön Değ'!K52=\"\",\"\",'Yab.Dil Ön Değ'!K52)","v":""},{"$f":"IF('Yab.Dil Ön Değ'!L52=\"\",\"\",'Yab.Dil Ön Değ'!L52)","v":""}]
[{"$f":"IF('Yab.Dil Ön Değ'!A53=\"\",\"\",'Yab.Dil Ön Değ'!A53)","v":""},{"$f":"IF('Yab.Dil Ön Değ'!B53=\"\",\"\",LEFT('Yab.Dil Ön Değ'!B53,3)&REPT(\"*\",4)&RIGHT('Yab.Dil Ön Değ'!B53,2))","v":""},{"$f":"IF('Yab.Dil Ön Değ'!C53=\"\",\"\",IF(ISERR(FIND(\" \",'Yab.Dil Ön Değ'!C53))=TRUE,LEFT('Yab.Dil Ön Değ'!C53,2)&REPT(\"*\",3),LEFT('Yab.Dil Ön Değ'!C53,2)&REPT(\"*\",3)&\" \"&MID('Yab.Dil Ön Değ'!C53,FIND(\" \",'Yab.Dil Ön Değ'!C53)+1,2)&REPT(\"*\",3)))","v":""},{"$f":"IF('Yab.Dil Ön Değ'!D53=\"\",\"\",IF(ISERR(FIND(\" \",'Yab.Dil Ön Değ'!D53))=TRUE,LEFT('Yab.Dil Ön Değ'!D53,2)&REPT(\"*\",3),LEFT('Yab.Dil Ön Değ'!D53,2)&REPT(\"*\",3)&\" \"&MID('Yab.Dil Ön Değ'!D53,FIND(\" \",'Yab.Dil Ön Değ'!D53)+1,2)&REPT(\"*\",3)))","v":""},{"$f":"IF('Yab.Dil Ön Değ'!E53=\"\",\"\",'Yab.Dil Ön Değ'!E53)","v":""},{"$f":"IF('Yab.Dil Ön Değ'!F53=\"\",\"\",'Yab.Dil Ön Değ'!F53)","v":""},{"$f":"IF('Yab.Dil Ön Değ'!G53=\"\",\"\",'Yab.Dil Ön Değ'!G53)","v":""},{"$f":"IF('Yab.Dil Ön Değ'!H53=\"\",\"\",'Yab.Dil Ön Değ'!H53)","v":""},{"$f":"IF('Yab.Dil Ön Değ'!I53=\"\",\"\",'Yab.Dil Ön Değ'!I53)","v":""},{"$f":"IF('Yab.Dil Ön Değ'!J53=\"\",\"\",'Yab.Dil Ön Değ'!J53)","v":""},{"$f":"IF('Yab.Dil Ön Değ'!K53=\"\",\"\",'Yab.Dil Ön Değ'!K53)","v":""},{"$f":"IF('Yab.Dil Ön Değ'!L53=\"\",\"\",'Yab.Dil Ön Değ'!L53)","v":""}]
[{"$f":"IF('Yab.Dil Ön Değ'!A54=\"\",\"\",'Yab.Dil Ön Değ'!A54)","v":""},{"$f":"IF('Yab.Dil Ön Değ'!B54=\"\",\"\",LEFT('Yab.Dil Ön Değ'!B54,3)&REPT(\"*\",4)&RIGHT('Yab.Dil Ön Değ'!B54,2))","v":""},{"$f":"IF('Yab.Dil Ön Değ'!C54=\"\",\"\",IF(ISERR(FIND(\" \",'Yab.Dil Ön Değ'!C54))=TRUE,LEFT('Yab.Dil Ön Değ'!C54,2)&REPT(\"*\",3),LEFT('Yab.Dil Ön Değ'!C54,2)&REPT(\"*\",3)&\" \"&MID('Yab.Dil Ön Değ'!C54,FIND(\" \",'Yab.Dil Ön Değ'!C54)+1,2)&REPT(\"*\",3)))","v":""},{"$f":"IF('Yab.Dil Ön Değ'!D54=\"\",\"\",IF(ISERR(FIND(\" \",'Yab.Dil Ön Değ'!D54))=TRUE,LEFT('Yab.Dil Ön Değ'!D54,2)&REPT(\"*\",3),LEFT('Yab.Dil Ön Değ'!D54,2)&REPT(\"*\",3)&\" \"&MID('Yab.Dil Ön Değ'!D54,FIND(\" \",'Yab.Dil Ön Değ'!D54)+1,2)&REPT(\"*\",3)))","v":""},{"$f":"IF('Yab.Dil Ön Değ'!E54=\"\",\"\",'Yab.Dil Ön Değ'!E54)","v":""},{"$f":"IF('Yab.Dil Ön Değ'!F54=\"\",\"\",'Yab.Dil Ön Değ'!F54)","v":""},{"$f":"IF('Yab.Dil Ön Değ'!G54=\"\",\"\",'Yab.Dil Ön Değ'!G54)","v":""},{"$f":"IF('Yab.Dil Ön Değ'!H54=\"\",\"\",'Yab.Dil Ön Değ'!H54)","v":""},{"$f":"IF('Yab.Dil Ön Değ'!I54=\"\",\"\",'Yab.Dil Ön Değ'!I54)","v":""},{"$f":"IF('Yab.Dil Ön Değ'!J54=\"\",\"\",'Yab.Dil Ön Değ'!J54)","v":""},{"$f":"IF('Yab.Dil Ön Değ'!K54=\"\",\"\",'Yab.Dil Ön Değ'!K54)","v":""},{"$f":"IF('Yab.Dil Ön Değ'!L54=\"\",\"\",'Yab.Dil Ön Değ'!L54)","v":""}]
[{"$f":"IF('Yab.Dil Ön Değ'!A55=\"\",\"\",'Yab.Dil Ön Değ'!A55)","v":""},{"$f":"IF('Yab.Dil Ön Değ'!B55=\"\",\"\",LEFT('Yab.Dil Ön Değ'!B55,3)&REPT(\"*\",4)&RIGHT('Yab.Dil Ön Değ'!B55,2))","v":""},{"$f":"IF('Yab.Dil Ön Değ'!C55=\"\",\"\",IF(ISERR(FIND(\" \",'Yab.Dil Ön Değ'!C55))=TRUE,LEFT('Yab.Dil Ön Değ'!C55,2)&REPT(\"*\",3),LEFT('Yab.Dil Ön Değ'!C55,2)&REPT(\"*\",3)&\" \"&MID('Yab.Dil Ön Değ'!C55,FIND(\" \",'Yab.Dil Ön Değ'!C55)+1,2)&REPT(\"*\",3)))","v":""},{"$f":"IF('Yab.Dil Ön Değ'!D55=\"\",\"\",IF(ISERR(FIND(\" \",'Yab.Dil Ön Değ'!D55))=TRUE,LEFT('Yab.Dil Ön Değ'!D55,2)&REPT(\"*\",3),LEFT('Yab.Dil Ön Değ'!D55,2)&REPT(\"*\",3)&\" \"&MID('Yab.Dil Ön Değ'!D55,FIND(\" \",'Yab.Dil Ön Değ'!D55)+1,2)&REPT(\"*\",3)))","v":""},{"$f":"IF('Yab.Dil Ön Değ'!E55=\"\",\"\",'Yab.Dil Ön Değ'!E55)","v":""},{"$f":"IF('Yab.Dil Ön Değ'!F55=\"\",\"\",'Yab.Dil Ön Değ'!F55)","v":""},{"$f":"IF('Yab.Dil Ön Değ'!G55=\"\",\"\",'Yab.Dil Ön Değ'!G55)","v":""},{"$f":"IF('Yab.Dil Ön Değ'!H55=\"\",\"\",'Yab.Dil Ön Değ'!H55)","v":""},{"$f":"IF('Yab.Dil Ön Değ'!I55=\"\",\"\",'Yab.Dil Ön Değ'!I55)","v":""},{"$f":"IF('Yab.Dil Ön Değ'!J55=\"\",\"\",'Yab.Dil Ön Değ'!J55)","v":""},{"$f":"IF('Yab.Dil Ön Değ'!K55=\"\",\"\",'Yab.Dil Ön Değ'!K55)","v":""},{"$f":"IF('Yab.Dil Ön Değ'!L55=\"\",\"\",'Yab.Dil Ön Değ'!L55)","v":""}]
[{"$f":"IF('Yab.Dil Ön Değ'!A56=\"\",\"\",'Yab.Dil Ön Değ'!A56)","v":""},{"$f":"IF('Yab.Dil Ön Değ'!B56=\"\",\"\",LEFT('Yab.Dil Ön Değ'!B56,3)&REPT(\"*\",4)&RIGHT('Yab.Dil Ön Değ'!B56,2))","v":""},{"$f":"IF('Yab.Dil Ön Değ'!C56=\"\",\"\",IF(ISERR(FIND(\" \",'Yab.Dil Ön Değ'!C56))=TRUE,LEFT('Yab.Dil Ön Değ'!C56,2)&REPT(\"*\",3),LEFT('Yab.Dil Ön Değ'!C56,2)&REPT(\"*\",3)&\" \"&MID('Yab.Dil Ön Değ'!C56,FIND(\" \",'Yab.Dil Ön Değ'!C56)+1,2)&REPT(\"*\",3)))","v":""},{"$f":"IF('Yab.Dil Ön Değ'!D56=\"\",\"\",IF(ISERR(FIND(\" \",'Yab.Dil Ön Değ'!D56))=TRUE,LEFT('Yab.Dil Ön Değ'!D56,2)&REPT(\"*\",3),LEFT('Yab.Dil Ön Değ'!D56,2)&REPT(\"*\",3)&\" \"&MID('Yab.Dil Ön Değ'!D56,FIND(\" \",'Yab.Dil Ön Değ'!D56)+1,2)&REPT(\"*\",3)))","v":""},{"$f":"IF('Yab.Dil Ön Değ'!E56=\"\",\"\",'Yab.Dil Ön Değ'!E56)","v":""},{"$f":"IF('Yab.Dil Ön Değ'!F56=\"\",\"\",'Yab.Dil Ön Değ'!F56)","v":""},{"$f":"IF('Yab.Dil Ön Değ'!G56=\"\",\"\",'Yab.Dil Ön Değ'!G56)","v":""},{"$f":"IF('Yab.Dil Ön Değ'!H56=\"\",\"\",'Yab.Dil Ön Değ'!H56)","v":""},{"$f":"IF('Yab.Dil Ön Değ'!I56=\"\",\"\",'Yab.Dil Ön Değ'!I56)","v":""},{"$f":"IF('Yab.Dil Ön Değ'!J56=\"\",\"\",'Yab.Dil Ön Değ'!J56)","v":""},{"$f":"IF('Yab.Dil Ön Değ'!K56=\"\",\"\",'Yab.Dil Ön Değ'!K56)","v":""},{"$f":"IF('Yab.Dil Ön Değ'!L56=\"\",\"\",'Yab.Dil Ön Değ'!L56)","v":""}]
[{"$f":"IF('Yab.Dil Ön Değ'!A57=\"\",\"\",'Yab.Dil Ön Değ'!A57)","v":""},{"$f":"IF('Yab.Dil Ön Değ'!B57=\"\",\"\",LEFT('Yab.Dil Ön Değ'!B57,3)&REPT(\"*\",4)&RIGHT('Yab.Dil Ön Değ'!B57,2))","v":""},{"$f":"IF('Yab.Dil Ön Değ'!C57=\"\",\"\",IF(ISERR(FIND(\" \",'Yab.Dil Ön Değ'!C57))=TRUE,LEFT('Yab.Dil Ön Değ'!C57,2)&REPT(\"*\",3),LEFT('Yab.Dil Ön Değ'!C57,2)&REPT(\"*\",3)&\" \"&MID('Yab.Dil Ön Değ'!C57,FIND(\" \",'Yab.Dil Ön Değ'!C57)+1,2)&REPT(\"*\",3)))","v":""},{"$f":"IF('Yab.Dil Ön Değ'!D57=\"\",\"\",IF(ISERR(FIND(\" \",'Yab.Dil Ön Değ'!D57))=TRUE,LEFT('Yab.Dil Ön Değ'!D57,2)&REPT(\"*\",3),LEFT('Yab.Dil Ön Değ'!D57,2)&REPT(\"*\",3)&\" \"&MID('Yab.Dil Ön Değ'!D57,FIND(\" \",'Yab.Dil Ön Değ'!D57)+1,2)&REPT(\"*\",3)))","v":""},{"$f":"IF('Yab.Dil Ön Değ'!E57=\"\",\"\",'Yab.Dil Ön Değ'!E57)","v":""},{"$f":"IF('Yab.Dil Ön Değ'!F57=\"\",\"\",'Yab.Dil Ön Değ'!F57)","v":""},{"$f":"IF('Yab.Dil Ön Değ'!G57=\"\",\"\",'Yab.Dil Ön Değ'!G57)","v":""},{"$f":"IF('Yab.Dil Ön Değ'!H57=\"\",\"\",'Yab.Dil Ön Değ'!H57)","v":""},{"$f":"IF('Yab.Dil Ön Değ'!I57=\"\",\"\",'Yab.Dil Ön Değ'!I57)","v":""},{"$f":"IF('Yab.Dil Ön Değ'!J57=\"\",\"\",'Yab.Dil Ön Değ'!J57)","v":""},{"$f":"IF('Yab.Dil Ön Değ'!K57=\"\",\"\",'Yab.Dil Ön Değ'!K57)","v":""},{"$f":"IF('Yab.Dil Ön Değ'!L57=\"\",\"\",'Yab.Dil Ön Değ'!L57)","v":""}]
[{"$f":"IF('Yab.Dil Ön Değ'!A58=\"\",\"\",'Yab.Dil Ön Değ'!A58)","v":""},{"$f":"IF('Yab.Dil Ön Değ'!B58=\"\",\"\",LEFT('Yab.Dil Ön Değ'!B58,3)&REPT(\"*\",4)&RIGHT('Yab.Dil Ön Değ'!B58,2))","v":""},{"$f":"IF('Yab.Dil Ön Değ'!C58=\"\",\"\",IF(ISERR(FIND(\" \",'Yab.Dil Ön Değ'!C58))=TRUE,LEFT('Yab.Dil Ön Değ'!C58,2)&REPT(\"*\",3),LEFT('Yab.Dil Ön Değ'!C58,2)&REPT(\"*\",3)&\" \"&MID('Yab.Dil Ön Değ'!C58,FIND(\" \",'Yab.Dil Ön Değ'!C58)+1,2)&REPT(\"*\",3)))","v":""},{"$f":"IF('Yab.Dil Ön Değ'!D58=\"\",\"\",IF(ISERR(FIND(\" \",'Yab.Dil Ön Değ'!D58))=TRUE,LEFT('Yab.Dil Ön Değ'!D58,2)&REPT(\"*\",3),LEFT('Yab.Dil Ön Değ'!D58,2)&REPT(\"*\",3)&\" \"&MID('Yab.Dil Ön Değ'!D58,FIND(\" \",'Yab.Dil Ön Değ'!D58)+1,2)&REPT(\"*\",3)))","v":""},{"$f":"IF('Yab.Dil Ön Değ'!E58=\"\",\"\",'Yab.Dil Ön Değ'!E58)","v":""},{"$f":"IF('Yab.Dil Ön Değ'!F58=\"\",\"\",'Yab.Dil Ön Değ'!F58)","v":""},{"$f":"IF('Yab.Dil Ön Değ'!G58=\"\",\"\",'Yab.Dil Ön Değ'!G58)","v":""},{"$f":"IF('Yab.Dil Ön Değ'!H58=\"\",\"\",'Yab.Dil Ön Değ'!H58)","v":""},{"$f":"IF('Yab.Dil Ön Değ'!I58=\"\",\"\",'Yab.Dil Ön Değ'!I58)","v":""},{"$f":"IF('Yab.Dil Ön Değ'!J58=\"\",\"\",'Yab.Dil Ön Değ'!J58)","v":""},{"$f":"IF('Yab.Dil Ön Değ'!K58=\"\",\"\",'Yab.Dil Ön Değ'!K58)","v":""},{"$f":"IF('Yab.Dil Ön Değ'!L58=\"\",\"\",'Yab.Dil Ön Değ'!L58)","v":""}]
[{"$f":"IF('Yab.Dil Ön Değ'!A59=\"\",\"\",'Yab.Dil Ön Değ'!A59)","v":""},{"$f":"IF('Yab.Dil Ön Değ'!B59=\"\",\"\",LEFT('Yab.Dil Ön Değ'!B59,3)&REPT(\"*\",4)&RIGHT('Yab.Dil Ön Değ'!B59,2))","v":""},{"$f":"IF('Yab.Dil Ön Değ'!C59=\"\",\"\",IF(ISERR(FIND(\" \",'Yab.Dil Ön Değ'!C59))=TRUE,LEFT('Yab.Dil Ön Değ'!C59,2)&REPT(\"*\",3),LEFT('Yab.Dil Ön Değ'!C59,2)&REPT(\"*\",3)&\" \"&MID('Yab.Dil Ön Değ'!C59,FIND(\" \",'Yab.Dil Ön Değ'!C59)+1,2)&REPT(\"*\",3)))","v":""},{"$f":"IF('Yab.Dil Ön Değ'!D59=\"\",\"\",IF(ISERR(FIND(\" \",'Yab.Dil Ön Değ'!D59))=TRUE,LEFT('Yab.Dil Ön Değ'!D59,2)&REPT(\"*\",3),LEFT('Yab.Dil Ön Değ'!D59,2)&REPT(\"*\",3)&\" \"&MID('Yab.Dil Ön Değ'!D59,FIND(\" \",'Yab.Dil Ön Değ'!D59)+1,2)&REPT(\"*\",3)))","v":""},{"$f":"IF('Yab.Dil Ön Değ'!E59=\"\",\"\",'Yab.Dil Ön Değ'!E59)","v":""},{"$f":"IF('Yab.Dil Ön Değ'!F59=\"\",\"\",'Yab.Dil Ön Değ'!F59)","v":""},{"$f":"IF('Yab.Dil Ön Değ'!G59=\"\",\"\",'Yab.Dil Ön Değ'!G59)","v":""},{"$f":"IF('Yab.Dil Ön Değ'!H59=\"\",\"\",'Yab.Dil Ön Değ'!H59)","v":""},{"$f":"IF('Yab.Dil Ön Değ'!I59=\"\",\"\",'Yab.Dil Ön Değ'!I59)","v":""},{"$f":"IF('Yab.Dil Ön Değ'!J59=\"\",\"\",'Yab.Dil Ön Değ'!J59)","v":""},{"$f":"IF('Yab.Dil Ön Değ'!K59=\"\",\"\",'Yab.Dil Ön Değ'!K59)","v":""},{"$f":"IF('Yab.Dil Ön Değ'!L59=\"\",\"\",'Yab.Dil Ön Değ'!L59)","v":""}]
[{"$f":"IF('Yab.Dil Ön Değ'!A60=\"\",\"\",'Yab.Dil Ön Değ'!A60)","v":""},{"$f":"IF('Yab.Dil Ön Değ'!B60=\"\",\"\",LEFT('Yab.Dil Ön Değ'!B60,3)&REPT(\"*\",4)&RIGHT('Yab.Dil Ön Değ'!B60,2))","v":""},{"$f":"IF('Yab.Dil Ön Değ'!C60=\"\",\"\",IF(ISERR(FIND(\" \",'Yab.Dil Ön Değ'!C60))=TRUE,LEFT('Yab.Dil Ön Değ'!C60,2)&REPT(\"*\",3),LEFT('Yab.Dil Ön Değ'!C60,2)&REPT(\"*\",3)&\" \"&MID('Yab.Dil Ön Değ'!C60,FIND(\" \",'Yab.Dil Ön Değ'!C60)+1,2)&REPT(\"*\",3)))","v":""},{"$f":"IF('Yab.Dil Ön Değ'!D60=\"\",\"\",IF(ISERR(FIND(\" \",'Yab.Dil Ön Değ'!D60))=TRUE,LEFT('Yab.Dil Ön Değ'!D60,2)&REPT(\"*\",3),LEFT('Yab.Dil Ön Değ'!D60,2)&REPT(\"*\",3)&\" \"&MID('Yab.Dil Ön Değ'!D60,FIND(\" \",'Yab.Dil Ön Değ'!D60)+1,2)&REPT(\"*\",3)))","v":""},{"$f":"IF('Yab.Dil Ön Değ'!E60=\"\",\"\",'Yab.Dil Ön Değ'!E60)","v":""},{"$f":"IF('Yab.Dil Ön Değ'!F60=\"\",\"\",'Yab.Dil Ön Değ'!F60)","v":""},{"$f":"IF('Yab.Dil Ön Değ'!G60=\"\",\"\",'Yab.Dil Ön Değ'!G60)","v":""},{"$f":"IF('Yab.Dil Ön Değ'!H60=\"\",\"\",'Yab.Dil Ön Değ'!H60)","v":""},{"$f":"IF('Yab.Dil Ön Değ'!I60=\"\",\"\",'Yab.Dil Ön Değ'!I60)","v":""},{"$f":"IF('Yab.Dil Ön Değ'!J60=\"\",\"\",'Yab.Dil Ön Değ'!J60)","v":""},{"$f":"IF('Yab.Dil Ön Değ'!K60=\"\",\"\",'Yab.Dil Ön Değ'!K60)","v":""},{"$f":"IF('Yab.Dil Ön Değ'!L60=\"\",\"\",'Yab.Dil Ön Değ'!L60)","v":""}]
[{"$f":"IF('Yab.Dil Ön Değ'!A61=\"\",\"\",'Yab.Dil Ön Değ'!A61)","v":""},{"$f":"IF('Yab.Dil Ön Değ'!B61=\"\",\"\",LEFT('Yab.Dil Ön Değ'!B61,3)&REPT(\"*\",4)&RIGHT('Yab.Dil Ön Değ'!B61,2))","v":""},{"$f":"IF('Yab.Dil Ön Değ'!C61=\"\",\"\",IF(ISERR(FIND(\" \",'Yab.Dil Ön Değ'!C61))=TRUE,LEFT('Yab.Dil Ön Değ'!C61,2)&REPT(\"*\",3),LEFT('Yab.Dil Ön Değ'!C61,2)&REPT(\"*\",3)&\" \"&MID('Yab.Dil Ön Değ'!C61,FIND(\" \",'Yab.Dil Ön Değ'!C61)+1,2)&REPT(\"*\",3)))","v":""},{"$f":"IF('Yab.Dil Ön Değ'!D61=\"\",\"\",IF(ISERR(FIND(\" \",'Yab.Dil Ön Değ'!D61))=TRUE,LEFT('Yab.Dil Ön Değ'!D61,2)&REPT(\"*\",3),LEFT('Yab.Dil Ön Değ'!D61,2)&REPT(\"*\",3)&\" \"&MID('Yab.Dil Ön Değ'!D61,FIND(\" \",'Yab.Dil Ön Değ'!D61)+1,2)&REPT(\"*\",3)))","v":""},{"$f":"IF('Yab.Dil Ön Değ'!E61=\"\",\"\",'Yab.Dil Ön Değ'!E61)","v":""},{"$f":"IF('Yab.Dil Ön Değ'!F61=\"\",\"\",'Yab.Dil Ön Değ'!F61)","v":""},{"$f":"IF('Yab.Dil Ön Değ'!G61=\"\",\"\",'Yab.Dil Ön Değ'!G61)","v":""},{"$f":"IF('Yab.Dil Ön Değ'!H61=\"\",\"\",'Yab.Dil Ön Değ'!H61)","v":""},{"$f":"IF('Yab.Dil Ön Değ'!I61=\"\",\"\",'Yab.Dil Ön Değ'!I61)","v":""},{"$f":"IF('Yab.Dil Ön Değ'!J61=\"\",\"\",'Yab.Dil Ön Değ'!J61)","v":""},{"$f":"IF('Yab.Dil Ön Değ'!K61=\"\",\"\",'Yab.Dil Ön Değ'!K61)","v":""},{"$f":"IF('Yab.Dil Ön Değ'!L61=\"\",\"\",'Yab.Dil Ön Değ'!L61)","v":""}]
[{"$f":"IF('Yab.Dil Ön Değ'!A62=\"\",\"\",'Yab.Dil Ön Değ'!A62)","v":""},{"$f":"IF('Yab.Dil Ön Değ'!B62=\"\",\"\",LEFT('Yab.Dil Ön Değ'!B62,3)&REPT(\"*\",4)&RIGHT('Yab.Dil Ön Değ'!B62,2))","v":""},{"$f":"IF('Yab.Dil Ön Değ'!C62=\"\",\"\",IF(ISERR(FIND(\" \",'Yab.Dil Ön Değ'!C62))=TRUE,LEFT('Yab.Dil Ön Değ'!C62,2)&REPT(\"*\",3),LEFT('Yab.Dil Ön Değ'!C62,2)&REPT(\"*\",3)&\" \"&MID('Yab.Dil Ön Değ'!C62,FIND(\" \",'Yab.Dil Ön Değ'!C62)+1,2)&REPT(\"*\",3)))","v":""},{"$f":"IF('Yab.Dil Ön Değ'!D62=\"\",\"\",IF(ISERR(FIND(\" \",'Yab.Dil Ön Değ'!D62))=TRUE,LEFT('Yab.Dil Ön Değ'!D62,2)&REPT(\"*\",3),LEFT('Yab.Dil Ön Değ'!D62,2)&REPT(\"*\",3)&\" \"&MID('Yab.Dil Ön Değ'!D62,FIND(\" \",'Yab.Dil Ön Değ'!D62)+1,2)&REPT(\"*\",3)))","v":""},{"$f":"IF('Yab.Dil Ön Değ'!E62=\"\",\"\",'Yab.Dil Ön Değ'!E62)","v":""},{"$f":"IF('Yab.Dil Ön Değ'!F62=\"\",\"\",'Yab.Dil Ön Değ'!F62)","v":""},{"$f":"IF('Yab.Dil Ön Değ'!G62=\"\",\"\",'Yab.Dil Ön Değ'!G62)","v":""},{"$f":"IF('Yab.Dil Ön Değ'!H62=\"\",\"\",'Yab.Dil Ön Değ'!H62)","v":""},{"$f":"IF('Yab.Dil Ön Değ'!I62=\"\",\"\",'Yab.Dil Ön Değ'!I62)","v":""},{"$f":"IF('Yab.Dil Ön Değ'!J62=\"\",\"\",'Yab.Dil Ön Değ'!J62)","v":""},{"$f":"IF('Yab.Dil Ön Değ'!K62=\"\",\"\",'Yab.Dil Ön Değ'!K62)","v":""},{"$f":"IF('Yab.Dil Ön Değ'!L62=\"\",\"\",'Yab.Dil Ön Değ'!L62)","v":""}]
[{"$f":"IF('Yab.Dil Ön Değ'!A63=\"\",\"\",'Yab.Dil Ön Değ'!A63)","v":""},{"$f":"IF('Yab.Dil Ön Değ'!B63=\"\",\"\",LEFT('Yab.Dil Ön Değ'!B63,3)&REPT(\"*\",4)&RIGHT('Yab.Dil Ön Değ'!B63,2))","v":""},{"$f":"IF('Yab.Dil Ön Değ'!C63=\"\",\"\",IF(ISERR(FIND(\" \",'Yab.Dil Ön Değ'!C63))=TRUE,LEFT('Yab.Dil Ön Değ'!C63,2)&REPT(\"*\",3),LEFT('Yab.Dil Ön Değ'!C63,2)&REPT(\"*\",3)&\" \"&MID('Yab.Dil Ön Değ'!C63,FIND(\" \",'Yab.Dil Ön Değ'!C63)+1,2)&REPT(\"*\",3)))","v":""},{"$f":"IF('Yab.Dil Ön Değ'!D63=\"\",\"\",IF(ISERR(FIND(\" \",'Yab.Dil Ön Değ'!D63))=TRUE,LEFT('Yab.Dil Ön Değ'!D63,2)&REPT(\"*\",3),LEFT('Yab.Dil Ön Değ'!D63,2)&REPT(\"*\",3)&\" \"&MID('Yab.Dil Ön Değ'!D63,FIND(\" \",'Yab.Dil Ön Değ'!D63)+1,2)&REPT(\"*\",3)))","v":""},{"$f":"IF('Yab.Dil Ön Değ'!E63=\"\",\"\",'Yab.Dil Ön Değ'!E63)","v":""},{"$f":"IF('Yab.Dil Ön Değ'!F63=\"\",\"\",'Yab.Dil Ön Değ'!F63)","v":""},{"$f":"IF('Yab.Dil Ön Değ'!G63=\"\",\"\",'Yab.Dil Ön Değ'!G63)","v":""},{"$f":"IF('Yab.Dil Ön Değ'!H63=\"\",\"\",'Yab.Dil Ön Değ'!H63)","v":""},{"$f":"IF('Yab.Dil Ön Değ'!I63=\"\",\"\",'Yab.Dil Ön Değ'!I63)","v":""},{"$f":"IF('Yab.Dil Ön Değ'!J63=\"\",\"\",'Yab.Dil Ön Değ'!J63)","v":""},{"$f":"IF('Yab.Dil Ön Değ'!K63=\"\",\"\",'Yab.Dil Ön Değ'!K63)","v":""},{"$f":"IF('Yab.Dil Ön Değ'!L63=\"\",\"\",'Yab.Dil Ön Değ'!L63)","v":""}]
[{"$f":"IF('Yab.Dil Ön Değ'!A64=\"\",\"\",'Yab.Dil Ön Değ'!A64)","v":""},{"$f":"IF('Yab.Dil Ön Değ'!B64=\"\",\"\",LEFT('Yab.Dil Ön Değ'!B64,3)&REPT(\"*\",4)&RIGHT('Yab.Dil Ön Değ'!B64,2))","v":""},{"$f":"IF('Yab.Dil Ön Değ'!C64=\"\",\"\",IF(ISERR(FIND(\" \",'Yab.Dil Ön Değ'!C64))=TRUE,LEFT('Yab.Dil Ön Değ'!C64,2)&REPT(\"*\",3),LEFT('Yab.Dil Ön Değ'!C64,2)&REPT(\"*\",3)&\" \"&MID('Yab.Dil Ön Değ'!C64,FIND(\" \",'Yab.Dil Ön Değ'!C64)+1,2)&REPT(\"*\",3)))","v":""},{"$f":"IF('Yab.Dil Ön Değ'!D64=\"\",\"\",IF(ISERR(FIND(\" \",'Yab.Dil Ön Değ'!D64))=TRUE,LEFT('Yab.Dil Ön Değ'!D64,2)&REPT(\"*\",3),LEFT('Yab.Dil Ön Değ'!D64,2)&REPT(\"*\",3)&\" \"&MID('Yab.Dil Ön Değ'!D64,FIND(\" \",'Yab.Dil Ön Değ'!D64)+1,2)&REPT(\"*\",3)))","v":""},{"$f":"IF('Yab.Dil Ön Değ'!E64=\"\",\"\",'Yab.Dil Ön Değ'!E64)","v":""},{"$f":"IF('Yab.Dil Ön Değ'!F64=\"\",\"\",'Yab.Dil Ön Değ'!F64)","v":""},{"$f":"IF('Yab.Dil Ön Değ'!G64=\"\",\"\",'Yab.Dil Ön Değ'!G64)","v":""},{"$f":"IF('Yab.Dil Ön Değ'!H64=\"\",\"\",'Yab.Dil Ön Değ'!H64)","v":""},{"$f":"IF('Yab.Dil Ön Değ'!I64=\"\",\"\",'Yab.Dil Ön Değ'!I64)","v":""},{"$f":"IF('Yab.Dil Ön Değ'!J64=\"\",\"\",'Yab.Dil Ön Değ'!J64)","v":""},{"$f":"IF('Yab.Dil Ön Değ'!K64=\"\",\"\",'Yab.Dil Ön Değ'!K64)","v":""},{"$f":"IF('Yab.Dil Ön Değ'!L64=\"\",\"\",'Yab.Dil Ön Değ'!L64)","v":""}]
[{"$f":"IF('Yab.Dil Ön Değ'!A65=\"\",\"\",'Yab.Dil Ön Değ'!A65)","v":""},{"$f":"IF('Yab.Dil Ön Değ'!B65=\"\",\"\",LEFT('Yab.Dil Ön Değ'!B65,3)&REPT(\"*\",4)&RIGHT('Yab.Dil Ön Değ'!B65,2))","v":""},{"$f":"IF('Yab.Dil Ön Değ'!C65=\"\",\"\",IF(ISERR(FIND(\" \",'Yab.Dil Ön Değ'!C65))=TRUE,LEFT('Yab.Dil Ön Değ'!C65,2)&REPT(\"*\",3),LEFT('Yab.Dil Ön Değ'!C65,2)&REPT(\"*\",3)&\" \"&MID('Yab.Dil Ön Değ'!C65,FIND(\" \",'Yab.Dil Ön Değ'!C65)+1,2)&REPT(\"*\",3)))","v":""},{"$f":"IF('Yab.Dil Ön Değ'!D65=\"\",\"\",IF(ISERR(FIND(\" \",'Yab.Dil Ön Değ'!D65))=TRUE,LEFT('Yab.Dil Ön Değ'!D65,2)&REPT(\"*\",3),LEFT('Yab.Dil Ön Değ'!D65,2)&REPT(\"*\",3)&\" \"&MID('Yab.Dil Ön Değ'!D65,FIND(\" \",'Yab.Dil Ön Değ'!D65)+1,2)&REPT(\"*\",3)))","v":""},{"$f":"IF('Yab.Dil Ön Değ'!E65=\"\",\"\",'Yab.Dil Ön Değ'!E65)","v":""},{"$f":"IF('Yab.Dil Ön Değ'!F65=\"\",\"\",'Yab.Dil Ön Değ'!F65)","v":""},{"$f":"IF('Yab.Dil Ön Değ'!G65=\"\",\"\",'Yab.Dil Ön Değ'!G65)","v":""},{"$f":"IF('Yab.Dil Ön Değ'!H65=\"\",\"\",'Yab.Dil Ön Değ'!H65)","v":""},{"$f":"IF('Yab.Dil Ön Değ'!I65=\"\",\"\",'Yab.Dil Ön Değ'!I65)","v":""},{"$f":"IF('Yab.Dil Ön Değ'!J65=\"\",\"\",'Yab.Dil Ön Değ'!J65)","v":""},{"$f":"IF('Yab.Dil Ön Değ'!K65=\"\",\"\",'Yab.Dil Ön Değ'!K65)","v":""},{"$f":"IF('Yab.Dil Ön Değ'!L65=\"\",\"\",'Yab.Dil Ön Değ'!L65)","v":""}]
[{"$f":"IF('Yab.Dil Ön Değ'!A66=\"\",\"\",'Yab.Dil Ön Değ'!A66)","v":""},{"$f":"IF('Yab.Dil Ön Değ'!B66=\"\",\"\",LEFT('Yab.Dil Ön Değ'!B66,3)&REPT(\"*\",4)&RIGHT('Yab.Dil Ön Değ'!B66,2))","v":""},{"$f":"IF('Yab.Dil Ön Değ'!C66=\"\",\"\",IF(ISERR(FIND(\" \",'Yab.Dil Ön Değ'!C66))=TRUE,LEFT('Yab.Dil Ön Değ'!C66,2)&REPT(\"*\",3),LEFT('Yab.Dil Ön Değ'!C66,2)&REPT(\"*\",3)&\" \"&MID('Yab.Dil Ön Değ'!C66,FIND(\" \",'Yab.Dil Ön Değ'!C66)+1,2)&REPT(\"*\",3)))","v":""},{"$f":"IF('Yab.Dil Ön Değ'!D66=\"\",\"\",IF(ISERR(FIND(\" \",'Yab.Dil Ön Değ'!D66))=TRUE,LEFT('Yab.Dil Ön Değ'!D66,2)&REPT(\"*\",3),LEFT('Yab.Dil Ön Değ'!D66,2)&REPT(\"*\",3)&\" \"&MID('Yab.Dil Ön Değ'!D66,FIND(\" \",'Yab.Dil Ön Değ'!D66)+1,2)&REPT(\"*\",3)))","v":""},{"$f":"IF('Yab.Dil Ön Değ'!E66=\"\",\"\",'Yab.Dil Ön Değ'!E66)","v":""},{"$f":"IF('Yab.Dil Ön Değ'!F66=\"\",\"\",'Yab.Dil Ön Değ'!F66)","v":""},{"$f":"IF('Yab.Dil Ön Değ'!G66=\"\",\"\",'Yab.Dil Ön Değ'!G66)","v":""},{"$f":"IF('Yab.Dil Ön Değ'!H66=\"\",\"\",'Yab.Dil Ön Değ'!H66)","v":""},{"$f":"IF('Yab.Dil Ön Değ'!I66=\"\",\"\",'Yab.Dil Ön Değ'!I66)","v":""},{"$f":"IF('Yab.Dil Ön Değ'!J66=\"\",\"\",'Yab.Dil Ön Değ'!J66)","v":""},{"$f":"IF('Yab.Dil Ön Değ'!K66=\"\",\"\",'Yab.Dil Ön Değ'!K66)","v":""},{"$f":"IF('Yab.Dil Ön Değ'!L66=\"\",\"\",'Yab.Dil Ön Değ'!L66)","v":""}]
[{"$f":"IF('Yab.Dil Ön Değ'!A67=\"\",\"\",'Yab.Dil Ön Değ'!A67)","v":""},{"$f":"IF('Yab.Dil Ön Değ'!B67=\"\",\"\",LEFT('Yab.Dil Ön Değ'!B67,3)&REPT(\"*\",4)&RIGHT('Yab.Dil Ön Değ'!B67,2))","v":""},{"$f":"IF('Yab.Dil Ön Değ'!C67=\"\",\"\",IF(ISERR(FIND(\" \",'Yab.Dil Ön Değ'!C67))=TRUE,LEFT('Yab.Dil Ön Değ'!C67,2)&REPT(\"*\",3),LEFT('Yab.Dil Ön Değ'!C67,2)&REPT(\"*\",3)&\" \"&MID('Yab.Dil Ön Değ'!C67,FIND(\" \",'Yab.Dil Ön Değ'!C67)+1,2)&REPT(\"*\",3)))","v":""},{"$f":"IF('Yab.Dil Ön Değ'!D67=\"\",\"\",IF(ISERR(FIND(\" \",'Yab.Dil Ön Değ'!D67))=TRUE,LEFT('Yab.Dil Ön Değ'!D67,2)&REPT(\"*\",3),LEFT('Yab.Dil Ön Değ'!D67,2)&REPT(\"*\",3)&\" \"&MID('Yab.Dil Ön Değ'!D67,FIND(\" \",'Yab.Dil Ön Değ'!D67)+1,2)&REPT(\"*\",3)))","v":""},{"$f":"IF('Yab.Dil Ön Değ'!E67=\"\",\"\",'Yab.Dil Ön Değ'!E67)","v":""},{"$f":"IF('Yab.Dil Ön Değ'!F67=\"\",\"\",'Yab.Dil Ön Değ'!F67)","v":""},{"$f":"IF('Yab.Dil Ön Değ'!G67=\"\",\"\",'Yab.Dil Ön Değ'!G67)","v":""},{"$f":"IF('Yab.Dil Ön Değ'!H67=\"\",\"\",'Yab.Dil Ön Değ'!H67)","v":""},{"$f":"IF('Yab.Dil Ön Değ'!I67=\"\",\"\",'Yab.Dil Ön Değ'!I67)","v":""},{"$f":"IF('Yab.Dil Ön Değ'!J67=\"\",\"\",'Yab.Dil Ön Değ'!J67)","v":""},{"$f":"IF('Yab.Dil Ön Değ'!K67=\"\",\"\",'Yab.Dil Ön Değ'!K67)","v":""},{"$f":"IF('Yab.Dil Ön Değ'!L67=\"\",\"\",'Yab.Dil Ön Değ'!L67)","v":""}]
[{"$f":"IF('Yab.Dil Ön Değ'!A68=\"\",\"\",'Yab.Dil Ön Değ'!A68)","v":""},{"$f":"IF('Yab.Dil Ön Değ'!B68=\"\",\"\",LEFT('Yab.Dil Ön Değ'!B68,3)&REPT(\"*\",4)&RIGHT('Yab.Dil Ön Değ'!B68,2))","v":""},{"$f":"IF('Yab.Dil Ön Değ'!C68=\"\",\"\",IF(ISERR(FIND(\" \",'Yab.Dil Ön Değ'!C68))=TRUE,LEFT('Yab.Dil Ön Değ'!C68,2)&REPT(\"*\",3),LEFT('Yab.Dil Ön Değ'!C68,2)&REPT(\"*\",3)&\" \"&MID('Yab.Dil Ön Değ'!C68,FIND(\" \",'Yab.Dil Ön Değ'!C68)+1,2)&REPT(\"*\",3)))","v":""},{"$f":"IF('Yab.Dil Ön Değ'!D68=\"\",\"\",IF(ISERR(FIND(\" \",'Yab.Dil Ön Değ'!D68))=TRUE,LEFT('Yab.Dil Ön Değ'!D68,2)&REPT(\"*\",3),LEFT('Yab.Dil Ön Değ'!D68,2)&REPT(\"*\",3)&\" \"&MID('Yab.Dil Ön Değ'!D68,FIND(\" \",'Yab.Dil Ön Değ'!D68)+1,2)&REPT(\"*\",3)))","v":""},{"$f":"IF('Yab.Dil Ön Değ'!E68=\"\",\"\",'Yab.Dil Ön Değ'!E68)","v":""},{"$f":"IF('Yab.Dil Ön Değ'!F68=\"\",\"\",'Yab.Dil Ön Değ'!F68)","v":""},{"$f":"IF('Yab.Dil Ön Değ'!G68=\"\",\"\",'Yab.Dil Ön Değ'!G68)","v":""},{"$f":"IF('Yab.Dil Ön Değ'!H68=\"\",\"\",'Yab.Dil Ön Değ'!H68)","v":""},{"$f":"IF('Yab.Dil Ön Değ'!I68=\"\",\"\",'Yab.Dil Ön Değ'!I68)","v":""},{"$f":"IF('Yab.Dil Ön Değ'!J68=\"\",\"\",'Yab.Dil Ön Değ'!J68)","v":""},{"$f":"IF('Yab.Dil Ön Değ'!K68=\"\",\"\",'Yab.Dil Ön Değ'!K68)","v":""},{"$f":"IF('Yab.Dil Ön Değ'!L68=\"\",\"\",'Yab.Dil Ön Değ'!L68)","v":""}]
[{"$f":"IF('Yab.Dil Ön Değ'!A69=\"\",\"\",'Yab.Dil Ön Değ'!A69)","v":""},{"$f":"IF('Yab.Dil Ön Değ'!B69=\"\",\"\",LEFT('Yab.Dil Ön Değ'!B69,3)&REPT(\"*\",4)&RIGHT('Yab.Dil Ön Değ'!B69,2))","v":""},{"$f":"IF('Yab.Dil Ön Değ'!C69=\"\",\"\",IF(ISERR(FIND(\" \",'Yab.Dil Ön Değ'!C69))=TRUE,LEFT('Yab.Dil Ön Değ'!C69,2)&REPT(\"*\",3),LEFT('Yab.Dil Ön Değ'!C69,2)&REPT(\"*\",3)&\" \"&MID('Yab.Dil Ön Değ'!C69,FIND(\" \",'Yab.Dil Ön Değ'!C69)+1,2)&REPT(\"*\",3)))","v":""},{"$f":"IF('Yab.Dil Ön Değ'!D69=\"\",\"\",IF(ISERR(FIND(\" \",'Yab.Dil Ön Değ'!D69))=TRUE,LEFT('Yab.Dil Ön Değ'!D69,2)&REPT(\"*\",3),LEFT('Yab.Dil Ön Değ'!D69,2)&REPT(\"*\",3)&\" \"&MID('Yab.Dil Ön Değ'!D69,FIND(\" \",'Yab.Dil Ön Değ'!D69)+1,2)&REPT(\"*\",3)))","v":""},{"$f":"IF('Yab.Dil Ön Değ'!E69=\"\",\"\",'Yab.Dil Ön Değ'!E69)","v":""},{"$f":"IF('Yab.Dil Ön Değ'!F69=\"\",\"\",'Yab.Dil Ön Değ'!F69)","v":""},{"$f":"IF('Yab.Dil Ön Değ'!G69=\"\",\"\",'Yab.Dil Ön Değ'!G69)","v":""},{"$f":"IF('Yab.Dil Ön Değ'!H69=\"\",\"\",'Yab.Dil Ön Değ'!H69)","v":""},{"$f":"IF('Yab.Dil Ön Değ'!I69=\"\",\"\",'Yab.Dil Ön Değ'!I69)","v":""},{"$f":"IF('Yab.Dil Ön Değ'!J69=\"\",\"\",'Yab.Dil Ön Değ'!J69)","v":""},{"$f":"IF('Yab.Dil Ön Değ'!K69=\"\",\"\",'Yab.Dil Ön Değ'!K69)","v":""},{"$f":"IF('Yab.Dil Ön Değ'!L69=\"\",\"\",'Yab.Dil Ön Değ'!L69)","v":""}]
[{"$f":"IF('Yab.Dil Ön Değ'!A70=\"\",\"\",'Yab.Dil Ön Değ'!A70)","v":""},{"$f":"IF('Yab.Dil Ön Değ'!B70=\"\",\"\",LEFT('Yab.Dil Ön Değ'!B70,3)&REPT(\"*\",4)&RIGHT('Yab.Dil Ön Değ'!B70,2))","v":""},{"$f":"IF('Yab.Dil Ön Değ'!C70=\"\",\"\",IF(ISERR(FIND(\" \",'Yab.Dil Ön Değ'!C70))=TRUE,LEFT('Yab.Dil Ön Değ'!C70,2)&REPT(\"*\",3),LEFT('Yab.Dil Ön Değ'!C70,2)&REPT(\"*\",3)&\" \"&MID('Yab.Dil Ön Değ'!C70,FIND(\" \",'Yab.Dil Ön Değ'!C70)+1,2)&REPT(\"*\",3)))","v":""},{"$f":"IF('Yab.Dil Ön Değ'!D70=\"\",\"\",IF(ISERR(FIND(\" \",'Yab.Dil Ön Değ'!D70))=TRUE,LEFT('Yab.Dil Ön Değ'!D70,2)&REPT(\"*\",3),LEFT('Yab.Dil Ön Değ'!D70,2)&REPT(\"*\",3)&\" \"&MID('Yab.Dil Ön Değ'!D70,FIND(\" \",'Yab.Dil Ön Değ'!D70)+1,2)&REPT(\"*\",3)))","v":""},{"$f":"IF('Yab.Dil Ön Değ'!E70=\"\",\"\",'Yab.Dil Ön Değ'!E70)","v":""},{"$f":"IF('Yab.Dil Ön Değ'!F70=\"\",\"\",'Yab.Dil Ön Değ'!F70)","v":""},{"$f":"IF('Yab.Dil Ön Değ'!G70=\"\",\"\",'Yab.Dil Ön Değ'!G70)","v":""},{"$f":"IF('Yab.Dil Ön Değ'!H70=\"\",\"\",'Yab.Dil Ön Değ'!H70)","v":""},{"$f":"IF('Yab.Dil Ön Değ'!I70=\"\",\"\",'Yab.Dil Ön Değ'!I70)","v":""},{"$f":"IF('Yab.Dil Ön Değ'!J70=\"\",\"\",'Yab.Dil Ön Değ'!J70)","v":""},{"$f":"IF('Yab.Dil Ön Değ'!K70=\"\",\"\",'Yab.Dil Ön Değ'!K70)","v":""},{"$f":"IF('Yab.Dil Ön Değ'!L70=\"\",\"\",'Yab.Dil Ön Değ'!L70)","v":""}]
[{"$f":"IF('Yab.Dil Ön Değ'!A71=\"\",\"\",'Yab.Dil Ön Değ'!A71)","v":""},{"$f":"IF('Yab.Dil Ön Değ'!B71=\"\",\"\",LEFT('Yab.Dil Ön Değ'!B71,3)&REPT(\"*\",4)&RIGHT('Yab.Dil Ön Değ'!B71,2))","v":""},{"$f":"IF('Yab.Dil Ön Değ'!C71=\"\",\"\",IF(ISERR(FIND(\" \",'Yab.Dil Ön Değ'!C71))=TRUE,LEFT('Yab.Dil Ön Değ'!C71,2)&REPT(\"*\",3),LEFT('Yab.Dil Ön Değ'!C71,2)&REPT(\"*\",3)&\" \"&MID('Yab.Dil Ön Değ'!C71,FIND(\" \",'Yab.Dil Ön Değ'!C71)+1,2)&REPT(\"*\",3)))","v":""},{"$f":"IF('Yab.Dil Ön Değ'!D71=\"\",\"\",IF(ISERR(FIND(\" \",'Yab.Dil Ön Değ'!D71))=TRUE,LEFT('Yab.Dil Ön Değ'!D71,2)&REPT(\"*\",3),LEFT('Yab.Dil Ön Değ'!D71,2)&REPT(\"*\",3)&\" \"&MID('Yab.Dil Ön Değ'!D71,FIND(\" \",'Yab.Dil Ön Değ'!D71)+1,2)&REPT(\"*\",3)))","v":""},{"$f":"IF('Yab.Dil Ön Değ'!E71=\"\",\"\",'Yab.Dil Ön Değ'!E71)","v":""},{"$f":"IF('Yab.Dil Ön Değ'!F71=\"\",\"\",'Yab.Dil Ön Değ'!F71)","v":""},{"$f":"IF('Yab.Dil Ön Değ'!G71=\"\",\"\",'Yab.Dil Ön Değ'!G71)","v":""},{"$f":"IF('Yab.Dil Ön Değ'!H71=\"\",\"\",'Yab.Dil Ön Değ'!H71)","v":""},{"$f":"IF('Yab.Dil Ön Değ'!I71=\"\",\"\",'Yab.Dil Ön Değ'!I71)","v":""},{"$f":"IF('Yab.Dil Ön Değ'!J71=\"\",\"\",'Yab.Dil Ön Değ'!J71)","v":""},{"$f":"IF('Yab.Dil Ön Değ'!K71=\"\",\"\",'Yab.Dil Ön Değ'!K71)","v":""},{"$f":"IF('Yab.Dil Ön Değ'!L71=\"\",\"\",'Yab.Dil Ön Değ'!L71)","v":""}]
[{"$f":"IF('Yab.Dil Ön Değ'!A72=\"\",\"\",'Yab.Dil Ön Değ'!A72)","v":""},{"$f":"IF('Yab.Dil Ön Değ'!B72=\"\",\"\",LEFT('Yab.Dil Ön Değ'!B72,3)&REPT(\"*\",4)&RIGHT('Yab.Dil Ön Değ'!B72,2))","v":""},{"$f":"IF('Yab.Dil Ön Değ'!C72=\"\",\"\",IF(ISERR(FIND(\" \",'Yab.Dil Ön Değ'!C72))=TRUE,LEFT('Yab.Dil Ön Değ'!C72,2)&REPT(\"*\",3),LEFT('Yab.Dil Ön Değ'!C72,2)&REPT(\"*\",3)&\" \"&MID('Yab.Dil Ön Değ'!C72,FIND(\" \",'Yab.Dil Ön Değ'!C72)+1,2)&REPT(\"*\",3)))","v":""},{"$f":"IF('Yab.Dil Ön Değ'!D72=\"\",\"\",IF(ISERR(FIND(\" \",'Yab.Dil Ön Değ'!D72))=TRUE,LEFT('Yab.Dil Ön Değ'!D72,2)&REPT(\"*\",3),LEFT('Yab.Dil Ön Değ'!D72,2)&REPT(\"*\",3)&\" \"&MID('Yab.Dil Ön Değ'!D72,FIND(\" \",'Yab.Dil Ön Değ'!D72)+1,2)&REPT(\"*\",3)))","v":""},{"$f":"IF('Yab.Dil Ön Değ'!E72=\"\",\"\",'Yab.Dil Ön Değ'!E72)","v":""},{"$f":"IF('Yab.Dil Ön Değ'!F72=\"\",\"\",'Yab.Dil Ön Değ'!F72)","v":""},{"$f":"IF('Yab.Dil Ön Değ'!G72=\"\",\"\",'Yab.Dil Ön Değ'!G72)","v":""},{"$f":"IF('Yab.Dil Ön Değ'!H72=\"\",\"\",'Yab.Dil Ön Değ'!H72)","v":""},{"$f":"IF('Yab.Dil Ön Değ'!I72=\"\",\"\",'Yab.Dil Ön Değ'!I72)","v":""},{"$f":"IF('Yab.Dil Ön Değ'!J72=\"\",\"\",'Yab.Dil Ön Değ'!J72)","v":""},{"$f":"IF('Yab.Dil Ön Değ'!K72=\"\",\"\",'Yab.Dil Ön Değ'!K72)","v":""},{"$f":"IF('Yab.Dil Ön Değ'!L72=\"\",\"\",'Yab.Dil Ön Değ'!L72)","v":""}]
[{"$f":"IF('Yab.Dil Ön Değ'!A73=\"\",\"\",'Yab.Dil Ön Değ'!A73)","v":""},{"$f":"IF('Yab.Dil Ön Değ'!B73=\"\",\"\",LEFT('Yab.Dil Ön Değ'!B73,3)&REPT(\"*\",4)&RIGHT('Yab.Dil Ön Değ'!B73,2))","v":""},{"$f":"IF('Yab.Dil Ön Değ'!C73=\"\",\"\",IF(ISERR(FIND(\" \",'Yab.Dil Ön Değ'!C73))=TRUE,LEFT('Yab.Dil Ön Değ'!C73,2)&REPT(\"*\",3),LEFT('Yab.Dil Ön Değ'!C73,2)&REPT(\"*\",3)&\" \"&MID('Yab.Dil Ön Değ'!C73,FIND(\" \",'Yab.Dil Ön Değ'!C73)+1,2)&REPT(\"*\",3)))","v":""},{"$f":"IF('Yab.Dil Ön Değ'!D73=\"\",\"\",IF(ISERR(FIND(\" \",'Yab.Dil Ön Değ'!D73))=TRUE,LEFT('Yab.Dil Ön Değ'!D73,2)&REPT(\"*\",3),LEFT('Yab.Dil Ön Değ'!D73,2)&REPT(\"*\",3)&\" \"&MID('Yab.Dil Ön Değ'!D73,FIND(\" \",'Yab.Dil Ön Değ'!D73)+1,2)&REPT(\"*\",3)))","v":""},{"$f":"IF('Yab.Dil Ön Değ'!E73=\"\",\"\",'Yab.Dil Ön Değ'!E73)","v":""},{"$f":"IF('Yab.Dil Ön Değ'!F73=\"\",\"\",'Yab.Dil Ön Değ'!F73)","v":""},{"$f":"IF('Yab.Dil Ön Değ'!G73=\"\",\"\",'Yab.Dil Ön Değ'!G73)","v":""},{"$f":"IF('Yab.Dil Ön Değ'!H73=\"\",\"\",'Yab.Dil Ön Değ'!H73)","v":""},{"$f":"IF('Yab.Dil Ön Değ'!I73=\"\",\"\",'Yab.Dil Ön Değ'!I73)","v":""},{"$f":"IF('Yab.Dil Ön Değ'!J73=\"\",\"\",'Yab.Dil Ön Değ'!J73)","v":""},{"$f":"IF('Yab.Dil Ön Değ'!K73=\"\",\"\",'Yab.Dil Ön Değ'!K73)","v":""},{"$f":"IF('Yab.Dil Ön Değ'!L73=\"\",\"\",'Yab.Dil Ön Değ'!L73)","v":""}]
[{"$f":"IF('Yab.Dil Ön Değ'!A74=\"\",\"\",'Yab.Dil Ön Değ'!A74)","v":""},{"$f":"IF('Yab.Dil Ön Değ'!B74=\"\",\"\",LEFT('Yab.Dil Ön Değ'!B74,3)&REPT(\"*\",4)&RIGHT('Yab.Dil Ön Değ'!B74,2))","v":""},{"$f":"IF('Yab.Dil Ön Değ'!C74=\"\",\"\",IF(ISERR(FIND(\" \",'Yab.Dil Ön Değ'!C74))=TRUE,LEFT('Yab.Dil Ön Değ'!C74,2)&REPT(\"*\",3),LEFT('Yab.Dil Ön Değ'!C74,2)&REPT(\"*\",3)&\" \"&MID('Yab.Dil Ön Değ'!C74,FIND(\" \",'Yab.Dil Ön Değ'!C74)+1,2)&REPT(\"*\",3)))","v":""},{"$f":"IF('Yab.Dil Ön Değ'!D74=\"\",\"\",IF(ISERR(FIND(\" \",'Yab.Dil Ön Değ'!D74))=TRUE,LEFT('Yab.Dil Ön Değ'!D74,2)&REPT(\"*\",3),LEFT('Yab.Dil Ön Değ'!D74,2)&REPT(\"*\",3)&\" \"&MID('Yab.Dil Ön Değ'!D74,FIND(\" \",'Yab.Dil Ön Değ'!D74)+1,2)&REPT(\"*\",3)))","v":""},{"$f":"IF('Yab.Dil Ön Değ'!E74=\"\",\"\",'Yab.Dil Ön Değ'!E74)","v":""},{"$f":"IF('Yab.Dil Ön Değ'!F74=\"\",\"\",'Yab.Dil Ön Değ'!F74)","v":""},{"$f":"IF('Yab.Dil Ön Değ'!G74=\"\",\"\",'Yab.Dil Ön Değ'!G74)","v":""},{"$f":"IF('Yab.Dil Ön Değ'!H74=\"\",\"\",'Yab.Dil Ön Değ'!H74)","v":""},{"$f":"IF('Yab.Dil Ön Değ'!I74=\"\",\"\",'Yab.Dil Ön Değ'!I74)","v":""},{"$f":"IF('Yab.Dil Ön Değ'!J74=\"\",\"\",'Yab.Dil Ön Değ'!J74)","v":""},{"$f":"IF('Yab.Dil Ön Değ'!K74=\"\",\"\",'Yab.Dil Ön Değ'!K74)","v":""},{"$f":"IF('Yab.Dil Ön Değ'!L74=\"\",\"\",'Yab.Dil Ön Değ'!L74)","v":""}]
[{"$f":"IF('Yab.Dil Ön Değ'!A75=\"\",\"\",'Yab.Dil Ön Değ'!A75)","v":""},{"$f":"IF('Yab.Dil Ön Değ'!B75=\"\",\"\",LEFT('Yab.Dil Ön Değ'!B75,3)&REPT(\"*\",4)&RIGHT('Yab.Dil Ön Değ'!B75,2))","v":""},{"$f":"IF('Yab.Dil Ön Değ'!C75=\"\",\"\",IF(ISERR(FIND(\" \",'Yab.Dil Ön Değ'!C75))=TRUE,LEFT('Yab.Dil Ön Değ'!C75,2)&REPT(\"*\",3),LEFT('Yab.Dil Ön Değ'!C75,2)&REPT(\"*\",3)&\" \"&MID('Yab.Dil Ön Değ'!C75,FIND(\" \",'Yab.Dil Ön Değ'!C75)+1,2)&REPT(\"*\",3)))","v":""},{"$f":"IF('Yab.Dil Ön Değ'!D75=\"\",\"\",IF(ISERR(FIND(\" \",'Yab.Dil Ön Değ'!D75))=TRUE,LEFT('Yab.Dil Ön Değ'!D75,2)&REPT(\"*\",3),LEFT('Yab.Dil Ön Değ'!D75,2)&REPT(\"*\",3)&\" \"&MID('Yab.Dil Ön Değ'!D75,FIND(\" \",'Yab.Dil Ön Değ'!D75)+1,2)&REPT(\"*\",3)))","v":""},{"$f":"IF('Yab.Dil Ön Değ'!E75=\"\",\"\",'Yab.Dil Ön Değ'!E75)","v":""},{"$f":"IF('Yab.Dil Ön Değ'!F75=\"\",\"\",'Yab.Dil Ön Değ'!F75)","v":""},{"$f":"IF('Yab.Dil Ön Değ'!G75=\"\",\"\",'Yab.Dil Ön Değ'!G75)","v":""},{"$f":"IF('Yab.Dil Ön Değ'!H75=\"\",\"\",'Yab.Dil Ön Değ'!H75)","v":""},{"$f":"IF('Yab.Dil Ön Değ'!I75=\"\",\"\",'Yab.Dil Ön Değ'!I75)","v":""},{"$f":"IF('Yab.Dil Ön Değ'!J75=\"\",\"\",'Yab.Dil Ön Değ'!J75)","v":""},{"$f":"IF('Yab.Dil Ön Değ'!K75=\"\",\"\",'Yab.Dil Ön Değ'!K75)","v":""},{"$f":"IF('Yab.Dil Ön Değ'!L75=\"\",\"\",'Yab.Dil Ön Değ'!L75)","v":""}]

{"sheet":"Yab. Dil. Öğr. Gör. Sonuç","index":2,"n_rows":16,"n_cols":14,"rows_kept":16,"cut":false,"hidden":false,"merged":[[7,6,7,8],[7,9,7,10],[7,11,7,12],[0,0,0,13],[1,0,1,13],[2,0,2,13],[3,0,3,13],[4,0,4,1],[4,2,4,5],[4,6,4,8],[7,0,7,1],[7,2,7,5],[6,6,6,8],[6,2,6,5],[6,9,6,13],[5,9,5,13],[9,12,10,12],[9,13,10,13],[9,10,9,11],[9,1,9,3],[8,0,8,1],[8,2,8,13],[9,0,10,0],[9,4,9,5],[9,6,9,7],[9,8,9,9],[4,9,4,13],[5,0,5,1],[5,2,5,5],[6,0,6,1],[5,6,5,8]]}
["T.C."]
["BAYBURT ÜNİVERSİTESİ"]
["GİRİŞ SINAVI SONUÇ TUTANAĞI"]
[" Üniversitemize bağlı birimlere, 2547 sayılı Kanunun ilgili maddeleri ve 09.11.2018 tarih ve 30590 sayılı Resmi Gazetede yayımlanan \"Öğretim Üyesi Dışındaki Öğretim Elemanı Kadrolarına Naklen veya Açıktan Yapılacak Atamalarda Uygulanacak Merkezi Sınav ile Giriş Sınavlarına İlişkin Usul ve Esaslar Hakkında Yönetmelik” 11. ve 12. maddeleri hükümleri uyarınca yapılan Giriş Sınavında başarılı olan adayların isimleri aşağıda belirtilmiştir."]
["İlan No:",null,null,null,null,null,"Birimi:",null,null,"Rektörlük"]
["İlan Tarihi:",null,"…/.../....",null,null,null,"Bölümü:",null,null,"Yabancı Diller"]
["Kadro Unvanı:",null,"Öğretim Görevlisi (Yabancı Dil Zorunlu Ortak Ders) / (Eğitim-Öğretimi Yabancı Dil Olan Birim)",null,null,null,"Alanı:",null,null,"İngilizce / Almanca / Arapça vb."]
["Kadro Adedi:",null,1,null,null,null,"Sınav Tarihi:",null,null,"…/.../....",null,"Sonuç Tarihi:",null,"…/.../...."]
["İlan Özel Şartı:"]
["Sıra No","Başvuranın",null,null,"ALES Puanı",null,"Yabancı Dil Puanı",null,null,null,"Giriş (Sözlü) Sınavı",null,"(A+B+C+D) Değerlendirme Notu","Sonuç"]
[null,"T.C. Kimlik No","Adı","Soyadı","Puanı","(A) Puanın %30' u","Puanı","(B) Puanın %30' u","100' lük Sistem ","(C) Notun %10' u","Sözlü Sınav Notu","(D)  Notunun %30' u"]
[1,11111111111,"Örnek","Örnek",82.513919999999999,{"$f":"E12*0.3","v":24.754175999999998},90,{"$f":"G12*0.3","v":27},76.66,{"$f":"I12*0.1","v":7.6660000000000004},95,{"$f":"K12*0.3","v":28.5},{"$f":"F12+H12+J12+L12","v":87.920175999999998},"BAŞARILI (ASIL)"]
[2,11111111111,"Örnek Örnek","Örnek",85.030479999999997,{"$f":"E13*0.3","v":25.509143999999999},88,{"$f":"G13*0.3","v":26.4},76.66,{"$f":"I13*0.1","v":7.6660000000000004},63,{"$f":"K13*0.3","v":18.899999999999999},{"$f":"F13+H13+J13+L13","v":78.475144},"BAŞARILI (YEDEK)"]
[3,11111111111,"Örnek","Örnek Örnek",84.431349999999995,{"$f":"E14*0.3","v":25.329404999999998},85,{"$f":"G14*0.3","v":25.5},83.66,{"$f":"I14*0.1","v":8.3659999999999997},45,{"$f":"K14*0.3","v":13.5},{"$f":"F14+H14+J14+L14","v":72.695404999999994},"YÖNETMELİK GEREĞİ ELENDİ*"]
[4,11111111111,"Örnek Örnek","Örnek Örnek",72,{"$f":"E15*0.3","v":21.599999999999998},85,{"$f":"G15*0.3","v":25.5},76.66,{"$f":"I15*0.1","v":7.6660000000000004},30,{"$f":"K15*0.3","v":9},{"$f":"F15+H15+J15+L15","v":63.765999999999991},"BAŞARISIZ**"]
[5,11111111111,"Örnek","Örnek",84.431349999999995,{"$f":"E16*0.3","v":25.329404999999998},88,{"$f":"G16*0.3","v":26.4},83.66,{"$f":"I16*0.1","v":8.3659999999999997},"Sınava Girmedi","-","-","SINAVA GİRMEDİ"]

{"sheet":"Sonuç Rapor","index":3,"n_rows":70,"n_cols":14,"rows_kept":70,"cut":false,"hidden":false,"merged":[[9,12,10,12],[9,13,10,13],[9,0,10,0],[9,1,9,3],[9,4,9,5],[9,6,9,7],[9,8,9,9],[9,10,9,11],[8,0,8,1],[8,2,8,13],[5,0,5,1],[5,2,5,5],[5,6,5,8],[5,9,5,13],[6,0,6,1],[6,2,6,5],[6,6,6,8],[6,9,6,13],[7,0,7,1],[7,2,7,5],[7,6,7,8],[7,9,7,10],[7,11,7,12],[0,0,0,13],[1,0,1,13],[2,0,2,13],[3,0,3,13],[4,0,4,1],[4,2,4,5],[4,6,4,8],[4,9,4,13]]}
["T.C."]
["BAYBURT ÜNİVERSİTESİ"]
["GİRİŞ SINAVI SONUÇ TUTANAĞI"]
[" Üniversitemize bağlı birimlere, 2547 sayılı Kanunun ilgili maddeleri ve 09.11.2018 tarih ve 30590 sayılı Resmi Gazetede yayımlanan \"Öğretim Üyesi Dışındaki Öğretim Elemanı Kadrolarına Naklen veya Açıktan Yapılacak Atamalarda Uygulanacak Merkezi Sınav ile Giriş Sınavlarına İlişkin Usul ve Esaslar Hakkında Yönetmelik” 11. ve 12. maddeleri hükümleri uyarınca yapılan Giriş Sınavında başarılı olan adayların isimleri aşağıda belirtilmiştir."]
["İlan No:",null,{"$f":"IF('Yab. Dil. Öğr. Gör. Sonuç'!C5=\"\",\"\",'Yab. Dil. Öğr. Gör. Sonuç'!C5)","v":""},null,null,null,"Birimi:",null,null,{"$f":"IF('Yab. Dil. Öğr. Gör. Sonuç'!J5=\"\",\"\",'Yab. Dil. Öğr. Gör. Sonuç'!J5)","v":"Rektörlük"}]
["İlan Tarihi:",null,{"$f":"IF('Yab. Dil. Öğr. Gör. Sonuç'!C6=\"\",\"\",'Yab. Dil. Öğr. Gör. Sonuç'!C6)","v":"…/.../...."},null,null,null,"Bölümü:",null,null,{"$f":"IF('Yab. Dil. Öğr. Gör. Sonuç'!J6=\"\",\"\",'Yab. Dil. Öğr. Gör. Sonuç'!J6)","v":"Yabancı Diller"}]
["Kadro Unvanı:",null,{"$f":"IF('Yab. Dil. Öğr. Gör. Sonuç'!C7=\"\",\"\",'Yab. Dil. Öğr. Gör. Sonuç'!C7)","v":"Öğretim Görevlisi (Yabancı Dil Zorunlu Ortak Ders) / (Eğitim-Öğretimi Yabancı Dil Olan Birim)"},null,null,null,"Alanı:",null,null,{"$f":"IF('Yab. Dil. Öğr. Gör. Sonuç'!J7=\"\",\"\",'Yab. Dil. Öğr. Gör. Sonuç'!J7)","v":"İngilizce / Almanca / Arapça vb."}]
["Kadro Adedi:",null,{"$f":"IF('Yab. Dil. Öğr. Gör. Sonuç'!C8=\"\",\"\",'Yab. Dil. Öğr. Gör. Sonuç'!C8)","v":1},null,null,null,"Sınav Tarihi:",null,null,{"$f":"IF('Yab. Dil. Öğr. Gör. Sonuç'!J8=\"\",\"\",'Yab. Dil. Öğr. Gör. Sonuç'!J8)","v":"…/.../...."},null,"Sonuç Tarihi:",null,{"$f":"IF('Yab. Dil. Öğr. Gör. Sonuç'!N8=\"\",\"\",'Yab. Dil. Öğr. Gör. Sonuç'!N8)","v":"…/.../...."}]
["İlan Özel Şartı:",null,{"$f":"IF('Yab. Dil. Öğr. Gör. Sonuç'!C9=\"\",\"\",'Yab. Dil. Öğr. Gör. Sonuç'!C9)","v":""}]
["Sıra No","Başvuranın",null,null,"ALES Puanı",null,"Yabancı Dil Puanı",null,null,null,"Giriş (Sözlü) Sınavı",null,"(A+B+C+D) Değerlendirme Notu","Sonuç"]
[null,"T.C. Kimlik No","Adı","Soyadı","Puanı","(A) Puanın %30' u","Puanı","(B) Puanın %30' u","100' lük Sistem ","(C) Notun %10' u","Sözlü Sınav Notu","(D)  Notunun %30' u"]
[{"$f":"IF('Yab. Dil. Öğr. Gör. Sonuç'!A12=\"\",\"\",'Yab. Dil. Öğr. Gör. Sonuç'!A12)","v":1},{"$f":"IF('Yab. Dil. Öğr. Gör. Sonuç'!B12=\"\",\"\",LEFT('Yab. Dil. Öğr. Gör. Sonuç'!B12,3)&REPT(\"*\",4)&RIGHT('Yab. Dil. Öğr. Gör. Sonuç'!B12,2))","v":"111****11"},{"$f":"IF('Yab. Dil. Öğr. Gör. Sonuç'!C12=\"\",\"\",IF(ISERR(FIND(\" \",'Yab. Dil. Öğr. Gör. Sonuç'!C12))=TRUE,LEFT('Yab. Dil. Öğr. Gör. Sonuç'!C12,2)&REPT(\"*\",3),LEFT('Yab. Dil. Öğr. Gör. Sonuç'!C12,2)&REPT(\"*\",3)&\" \"&MID('Yab. Dil. Öğr. Gör. Sonuç'!C12,FIND(\" \",'Yab. Dil. Öğr. Gör. Sonuç'!C12)+1,2)&REPT(\"*\",3)))","v":"Ör***"},{"$f":"IF('Yab. Dil. Öğr. Gör. Sonuç'!D12=\"\",\"\",IF(ISERR(FIND(\" \",'Yab. Dil. Öğr. Gör. Sonuç'!D12))=TRUE,LEFT('Yab. Dil. Öğr. Gör. Sonuç'!D12,2)&REPT(\"*\",3),LEFT('Yab. Dil. Öğr. Gör. Sonuç'!D12,2)&REPT(\"*\",3)&\" \"&MID('Yab. Dil. Öğr. Gör. Sonuç'!D12,FIND(\" \",'Yab. Dil. Öğr. Gör. Sonuç'!D12)+1,2)&REPT(\"*\",3)))","v":"Ör***"},{"$f":"IF('Yab. Dil. Öğr. Gör. Sonuç'!E12=\"\",\"\",'Yab. Dil. Öğr. Gör. Sonuç'!E12)","v":82.513919999999999},{"$f":"IF('Yab. Dil. Öğr. Gör. Sonuç'!F12=\"\",\"\",'Yab. Dil. Öğr. Gör. Sonuç'!F12)","v":24.754175999999998},{"$f":"IF('Yab. Dil. Öğr. Gör. Sonuç'!G12=\"\",\"\",'Yab. Dil. Öğr. Gör. Sonuç'!G12)","v":90},{"$f":"IF('Yab. Dil. Öğr. Gör. Sonuç'!H12=\"\",\"\",'Yab. Dil. Öğr. Gör. Sonuç'!H12)","v":27},{"$f":"IF('Yab. Dil. Öğr. Gör. Sonuç'!I12=\"\",\"\",'Yab. Dil. Öğr. Gör. Sonuç'!I12)","v":76.66},{"$f":"IF('Yab. Dil. Öğr. Gör. Sonuç'!J12=\"\",\"\",'Yab. Dil. Öğr. Gör. Sonuç'!J12)","v":7.6660000000000004},{"$f":"IF('Yab. Dil. Öğr. Gör. Sonuç'!K12=\"\",\"\",'Yab. Dil. Öğr. Gör. Sonuç'!K12)","v":95},{"$f":"IF('Yab. Dil. Öğr. Gör. Sonuç'!L12=\"\",\"\",'Yab. Dil. Öğr. Gör. Sonuç'!L12)","v":28.5},{"$f":"IF('Yab. Dil. Öğr. Gör. Sonuç'!M12=\"\",\"\",'Yab. Dil. Öğr. Gör. Sonuç'!M12)","v":87.920175999999998},{"$f":"IF('Yab. Dil. Öğr. Gör. Sonuç'!N12=\"\",\"\",'Yab. Dil. Öğr. Gör. Sonuç'!N12)","v":"BAŞARILI (ASIL)"}]
[{"$f":"IF('Yab. Dil. Öğr. Gör. Sonuç'!A13=\"\",\"\",'Yab. Dil. Öğr. Gör. Sonuç'!A13)","v":2},{"$f":"IF('Yab. Dil. Öğr. Gör. Sonuç'!B13=\"\",\"\",LEFT('Yab. Dil. Öğr. Gör. Sonuç'!B13,3)&REPT(\"*\",4)&RIGHT('Yab. Dil. Öğr. Gör. Sonuç'!B13,2))","v":"111****11"},{"$f":"IF('Yab. Dil. Öğr. Gör. Sonuç'!C13=\"\",\"\",IF(ISERR(FIND(\" \",'Yab. Dil. Öğr. Gör. Sonuç'!C13))=TRUE,LEFT('Yab. Dil. Öğr. Gör. Sonuç'!C13,2)&REPT(\"*\",3),LEFT('Yab. Dil. Öğr. Gör. Sonuç'!C13,2)&REPT(\"*\",3)&\" \"&MID('Yab. Dil. Öğr. Gör. Sonuç'!C13,FIND(\" \",'Yab. Dil. Öğr. Gör. Sonuç'!C13)+1,2)&REPT(\"*\",3)))","v":"Ör*** Ör***"},{"$f":"IF('Yab. Dil. Öğr. Gör. Sonuç'!D13=\"\",\"\",IF(ISERR(FIND(\" \",'Yab. Dil. Öğr. Gör. Sonuç'!D13))=TRUE,LEFT('Yab. Dil. Öğr. Gör. Sonuç'!D13,2)&REPT(\"*\",3),LEFT('Yab. Dil. Öğr. Gör. Sonuç'!D13,2)&REPT(\"*\",3)&\" \"&MID('Yab. Dil. Öğr. Gör. Sonuç'!D13,FIND(\" \",'Yab. Dil. Öğr. Gör. Sonuç'!D13)+1,2)&REPT(\"*\",3)))","v":"Ör***"},{"$f":"IF('Yab. Dil. Öğr. Gör. Sonuç'!E13=\"\",\"\",'Yab. Dil. Öğr. Gör. Sonuç'!E13)","v":85.030479999999997},{"$f":"IF('Yab. Dil. Öğr. Gör. Sonuç'!F13=\"\",\"\",'Yab. Dil. Öğr. Gör. Sonuç'!F13)","v":25.509143999999999},{"$f":"IF('Yab. Dil. Öğr. Gör. Sonuç'!G13=\"\",\"\",'Yab. Dil. Öğr. Gör. Sonuç'!G13)","v":88},{"$f":"IF('Yab. Dil. Öğr. Gör. Sonuç'!H13=\"\",\"\",'Yab. Dil. Öğr. Gör. Sonuç'!H13)","v":26.4},{"$f":"IF('Yab. Dil. Öğr. Gör. Sonuç'!I13=\"\",\"\",'Yab. Dil. Öğr. Gör. Sonuç'!I13)","v":76.66},{"$f":"IF('Yab. Dil. Öğr. Gör. Sonuç'!J13=\"\",\"\",'Yab. Dil. Öğr. Gör. Sonuç'!J13)","v":7.6660000000000004},{"$f":"IF('Yab. Dil. Öğr. Gör. Sonuç'!K13=\"\",\"\",'Yab. Dil. Öğr. Gör. Sonuç'!K13)","v":63},{"$f":"IF('Yab. Dil. Öğr. Gör. Sonuç'!L13=\"\",\"\",'Yab. Dil. Öğr. Gör. Sonuç'!L13)","v":18.899999999999999},{"$f":"IF('Yab. Dil. Öğr. Gör. Sonuç'!M13=\"\",\"\",'Yab. Dil. Öğr. Gör. Sonuç'!M13)","v":78.475144},{"$f":"IF('Yab. Dil. Öğr. Gör. Sonuç'!N13=\"\",\"\",'Yab. Dil. Öğr. Gör. Sonuç'!N13)","v":"BAŞARILI (YEDEK)"}]
[{"$f":"IF('Yab. Dil. Öğr. Gör. Sonuç'!A14=\"\",\"\",'Yab. Dil. Öğr. Gör. Sonuç'!A14)","v":3},{"$f":"IF('Yab. Dil. Öğr. Gör. Sonuç'!B14=\"\",\"\",LEFT('Yab. Dil. Öğr. Gör. Sonuç'!B14,3)&REPT(\"*\",4)&RIGHT('Yab. Dil. Öğr. Gör. Sonuç'!B14,2))","v":"111****11"},{"$f":"IF('Yab. Dil. Öğr. Gör. Sonuç'!C14=\"\",\"\",IF(ISERR(FIND(\" \",'Yab. Dil. Öğr. Gör. Sonuç'!C14))=TRUE,LEFT('Yab. Dil. Öğr. Gör. Sonuç'!C14,2)&REPT(\"*\",3),LEFT('Yab. Dil. Öğr. Gör. Sonuç'!C14,2)&REPT(\"*\",3)&\" \"&MID('Yab. Dil. Öğr. Gör. Sonuç'!C14,FIND(\" \",'Yab. Dil. Öğr. Gör. Sonuç'!C14)+1,2)&REPT(\"*\",3)))","v":"Ör***"},{"$f":"IF('Yab. Dil. Öğr. Gör. Sonuç'!D14=\"\",\"\",IF(ISERR(FIND(\" \",'Yab. Dil. Öğr. Gör. Sonuç'!D14))=TRUE,LEFT('Yab. Dil. Öğr. Gör. Sonuç'!D14,2)&REPT(\"*\",3),LEFT('Yab. Dil. Öğr. Gör. Sonuç'!D14,2)&REPT(\"*\",3)&\" \"&MID('Yab. Dil. Öğr. Gör. Sonuç'!D14,FIND(\" \",'Yab. Dil. Öğr. Gör. Sonuç'!D14)+1,2)&REPT(\"*\",3)))","v":"Ör*** Ör***"},{"$f":"IF('Yab. Dil. Öğr. Gör. Sonuç'!E14=\"\",\"\",'Yab. Dil. Öğr. Gör. Sonuç'!E14)","v":84.431349999999995},{"$f":"IF('Yab. Dil. Öğr. Gör. Sonuç'!F14=\"\",\"\",'Yab. Dil. Öğr. Gör. Sonuç'!F14)","v":25.329404999999998},{"$f":"IF('Yab. Dil. Öğr. Gör. Sonuç'!G14=\"\",\"\",'Yab. Dil. Öğr. Gör. Sonuç'!G14)","v":85},{"$f":"IF('Yab. Dil. Öğr. Gör. Sonuç'!H14=\"\",\"\",'Yab. Dil. Öğr. Gör. Sonuç'!H14)","v":25.5},{"$f":"IF('Yab. Dil. Öğr. Gör. Sonuç'!I14=\"\",\"\",'Yab. Dil. Öğr. Gör. Sonuç'!I14)","v":83.66},{"$f":"IF('Yab. Dil. Öğr. Gör. Sonuç'!J14=\"\",\"\",'Yab. Dil. Öğr. Gör. Sonuç'!J14)","v":8.3659999999999997},{"$f":"IF('Yab. Dil. Öğr. Gör. Sonuç'!K14=\"\",\"\",'Yab. Dil. Öğr. Gör. Sonuç'!K14)","v":45},{"$f":"IF('Yab. Dil. Öğr. Gör. Sonuç'!L14=\"\",\"\",'Yab. Dil. Öğr. Gör. Sonuç'!L14)","v":13.5},{"$f":"IF('Yab. Dil. Öğr. Gör. Sonuç'!M14=\"\",\"\",'Yab. Dil. Öğr. Gör. Sonuç'!M14)","v":72.695404999999994},{"$f":"IF('Yab. Dil. Öğr. Gör. Sonuç'!N14=\"\",\"\",'Yab. Dil. Öğr. Gör. Sonuç'!N14)","v":"YÖNETMELİK GEREĞİ ELENDİ*"}]
[{"$f":"IF('Yab. Dil. Öğr. Gör. Sonuç'!A15=\"\",\"\",'Yab. Dil. Öğr. Gör. Sonuç'!A15)","v":4},{"$f":"IF('Yab. Dil. Öğr. Gör. Sonuç'!B15=\"\",\"\",LEFT('Yab. Dil. Öğr. Gör. Sonuç'!B15,3)&REPT(\"*\",4)&RIGHT('Yab. Dil. Öğr. Gör. Sonuç'!B15,2))","v":"111****11"},{"$f":"IF('Yab. Dil. Öğr. Gör. Sonuç'!C15=\"\",\"\",IF(ISERR(FIND(\" \",'Yab. Dil. Öğr. Gör. Sonuç'!C15))=TRUE,LEFT('Yab. Dil. Öğr. Gör. Sonuç'!C15,2)&REPT(\"*\",3),LEFT('Yab. Dil. Öğr. Gör. Sonuç'!C15,2)&REPT(\"*\",3)&\" \"&MID('Yab. Dil. Öğr. Gör. Sonuç'!C15,FIND(\" \",'Yab. Dil. Öğr. Gör. Sonuç'!C15)+1,2)&REPT(\"*\",3)))","v":"Ör*** Ör***"},{"$f":"IF('Yab. Dil. Öğr. Gör. Sonuç'!D15=\"\",\"\",IF(ISERR(FIND(\" \",'Yab. Dil. Öğr. Gör. Sonuç'!D15))=TRUE,LEFT('Yab. Dil. Öğr. Gör. Sonuç'!D15,2)&REPT(\"*\",3),LEFT('Yab. Dil. Öğr. Gör. Sonuç'!D15,2)&REPT(\"*\",3)&\" \"&MID('Yab. Dil. Öğr. Gör. Sonuç'!D15,FIND(\" \",'Yab. Dil. Öğr. Gör. Sonuç'!D15)+1,2)&REPT(\"*\",3)))","v":"Ör*** Ör***"},{"$f":"IF('Yab. Dil. Öğr. Gör. Sonuç'!E15=\"\",\"\",'Yab. Dil. Öğr. Gör. Sonuç'!E15)","v":72},{"$f":"IF('Yab. Dil. Öğr. Gör. Sonuç'!F15=\"\",\"\",'Yab. Dil. Öğr. Gör. Sonuç'!F15)","v":21.599999999999998},{"$f":"IF('Yab. Dil. Öğr. Gör. Sonuç'!G15=\"\",\"\",'Yab. Dil. Öğr. Gör. Sonuç'!G15)","v":85},{"$f":"IF('Yab. Dil. Öğr. Gör. Sonuç'!H15=\"\",\"\",'Yab. Dil. Öğr. Gör. Sonuç'!H15)","v":25.5},{"$f":"IF('Yab. Dil. Öğr. Gör. Sonuç'!I15=\"\",\"\",'Yab. Dil. Öğr. Gör. Sonuç'!I15)","v":76.66},{"$f":"IF('Yab. Dil. Öğr. Gör. Sonuç'!J15=\"\",\"\",'Yab. Dil. Öğr. Gör. Sonuç'!J15)","v":7.6660000000000004},{"$f":"IF('Yab. Dil. Öğr. Gör. Sonuç'!K15=\"\",\"\",'Yab. Dil. Öğr. Gör. Sonuç'!K15)","v":30},{"$f":"IF('Yab. Dil. Öğr. Gör. Sonuç'!L15=\"\",\"\",'Yab. Dil. Öğr. Gör. Sonuç'!L15)","v":9},{"$f":"IF('Yab. Dil. Öğr. Gör. Sonuç'!M15=\"\",\"\",'Yab. Dil. Öğr. Gör. Sonuç'!M15)","v":63.765999999999991},{"$f":"IF('Yab. Dil. Öğr. Gör. Sonuç'!N15=\"\",\"\",'Yab. Dil. Öğr. Gör. Sonuç'!N15)","v":"BAŞARISIZ**"}]
[{"$f":"IF('Yab. Dil. Öğr. Gör. Sonuç'!A16=\"\",\"\",'Yab. Dil. Öğr. Gör. Sonuç'!A16)","v":5},{"$f":"IF('Yab. Dil. Öğr. Gör. Sonuç'!B16=\"\",\"\",LEFT('Yab. Dil. Öğr. Gör. Sonuç'!B16,3)&REPT(\"*\",4)&RIGHT('Yab. Dil. Öğr. Gör. Sonuç'!B16,2))","v":"111****11"},{"$f":"IF('Yab. Dil. Öğr. Gör. Sonuç'!C16=\"\",\"\",IF(ISERR(FIND(\" \",'Yab. Dil. Öğr. Gör. Sonuç'!C16))=TRUE,LEFT('Yab. Dil. Öğr. Gör. Sonuç'!C16,2)&REPT(\"*\",3),LEFT('Yab. Dil. Öğr. Gör. Sonuç'!C16,2)&REPT(\"*\",3)&\" \"&MID('Yab. Dil. Öğr. Gör. Sonuç'!C16,FIND(\" \",'Yab. Dil. Öğr. Gör. Sonuç'!C16)+1,2)&REPT(\"*\",3)))","v":"Ör***"},{"$f":"IF('Yab. Dil. Öğr. Gör. Sonuç'!D16=\"\",\"\",IF(ISERR(FIND(\" \",'Yab. Dil. Öğr. Gör. Sonuç'!D16))=TRUE,LEFT('Yab. Dil. Öğr. Gör. Sonuç'!D16,2)&REPT(\"*\",3),LEFT('Yab. Dil. Öğr. Gör. Sonuç'!D16,2)&REPT(\"*\",3)&\" \"&MID('Yab. Dil. Öğr. Gör. Sonuç'!D16,FIND(\" \",'Yab. Dil. Öğr. Gör. Sonuç'!D16)+1,2)&REPT(\"*\",3)))","v":"Ör***"},{"$f":"IF('Yab. Dil. Öğr. Gör. Sonuç'!E16=\"\",\"\",'Yab. Dil. Öğr. Gör. Sonuç'!E16)","v":84.431349999999995},{"$f":"IF('Yab. Dil. Öğr. Gör. Sonuç'!F16=\"\",\"\",'Yab. Dil. Öğr. Gör. Sonuç'!F16)","v":25.329404999999998},{"$f":"IF('Yab. Dil. Öğr. Gör. Sonuç'!G16=\"\",\"\",'Yab. Dil. Öğr. Gör. Sonuç'!G16)","v":88},{"$f":"IF('Yab. Dil. Öğr. Gör. Sonuç'!H16=\"\",\"\",'Yab. Dil. Öğr. Gör. Sonuç'!H16)","v":26.4},{"$f":"IF('Yab. Dil. Öğr. Gör. Sonuç'!I16=\"\",\"\",'Yab. Dil. Öğr. Gör. Sonuç'!I16)","v":83.66},{"$f":"IF('Yab. Dil. Öğr. Gör. Sonuç'!J16=\"\",\"\",'Yab. Dil. Öğr. Gör. Sonuç'!J16)","v":8.3659999999999997},{"$f":"IF('Yab. Dil. Öğr. Gör. Sonuç'!K16=\"\",\"\",'Yab. Dil. Öğr. Gör. Sonuç'!K16)","v":"Sınava Girmedi"},{"$f":"IF('Yab. Dil. Öğr. Gör. Sonuç'!L16=\"\",\"\",'Yab. Dil. Öğr. Gör. Sonuç'!L16)","v":"-"},{"$f":"IF('Yab. Dil. Öğr. Gör. Sonuç'!M16=\"\",\"\",'Yab. Dil. Öğr. Gör. Sonuç'!M16)","v":"-"},{"$f":"IF('Yab. Dil. Öğr. Gör. Sonuç'!N16=\"\",\"\",'Yab. Dil. Öğr. Gör. Sonuç'!N16)","v":"SINAVA GİRMEDİ"}]
[{"$f":"IF('Yab. Dil. Öğr. Gör. Sonuç'!A17=\"\",\"\",'Yab. Dil. Öğr. Gör. Sonuç'!A17)","v":""},{"$f":"IF('Yab. Dil. Öğr. Gör. Sonuç'!B17=\"\",\"\",LEFT('Yab. Dil. Öğr. Gör. Sonuç'!B17,3)&REPT(\"*\",4)&RIGHT('Yab. Dil. Öğr. Gör. Sonuç'!B17,2))","v":""},{"$f":"IF('Yab. Dil. Öğr. Gör. Sonuç'!C17=\"\",\"\",IF(ISERR(FIND(\" \",'Yab. Dil. Öğr. Gör. Sonuç'!C17))=TRUE,LEFT('Yab. Dil. Öğr. Gör. Sonuç'!C17,2)&REPT(\"*\",3),LEFT('Yab. Dil. Öğr. Gör. Sonuç'!C17,2)&REPT(\"*\",3)&\" \"&MID('Yab. Dil. Öğr. Gör. Sonuç'!C17,FIND(\" \",'Yab. Dil. Öğr. Gör. Sonuç'!C17)+1,2)&REPT(\"*\",3)))","v":""},{"$f":"IF('Yab. Dil. Öğr. Gör. Sonuç'!D17=\"\",\"\",IF(ISERR(FIND(\" \",'Yab. Dil. Öğr. Gör. Sonuç'!D17))=TRUE,LEFT('Yab. Dil. Öğr. Gör. Sonuç'!D17,2)&REPT(\"*\",3),LEFT('Yab. Dil. Öğr. Gör. Sonuç'!D17,2)&REPT(\"*\",3)&\" \"&MID('Yab. Dil. Öğr. Gör. Sonuç'!D17,FIND(\" \",'Yab. Dil. Öğr. Gör. Sonuç'!D17)+1,2)&REPT(\"*\",3)))","v":""},{"$f":"IF('Yab. Dil. Öğr. Gör. Sonuç'!E17=\"\",\"\",'Yab. Dil. Öğr. Gör. Sonuç'!E17)","v":""},{"$f":"IF('Yab. Dil. Öğr. Gör. Sonuç'!F17=\"\",\"\",'Yab. Dil. Öğr. Gör. Sonuç'!F17)","v":""},{"$f":"IF('Yab. Dil. Öğr. Gör. Sonuç'!G17=\"\",\"\",'Yab. Dil. Öğr. Gör. Sonuç'!G17)","v":""},{"$f":"IF('Yab. Dil. Öğr. Gör. Sonuç'!H17=\"\",\"\",'Yab. Dil. Öğr. Gör. Sonuç'!H17)","v":""},{"$f":"IF('Yab. Dil. Öğr. Gör. Sonuç'!I17=\"\",\"\",'Yab. Dil. Öğr. Gör. Sonuç'!I17)","v":""},{"$f":"IF('Yab. Dil. Öğr. Gör. Sonuç'!J17=\"\",\"\",'Yab. Dil. Öğr. Gör. Sonuç'!J17)","v":""},{"$f":"IF('Yab. Dil. Öğr. Gör. Sonuç'!K17=\"\",\"\",'Yab. Dil. Öğr. Gör. Sonuç'!K17)","v":""},{"$f":"IF('Yab. Dil. Öğr. Gör. Sonuç'!L17=\"\",\"\",'Yab. Dil. Öğr. Gör. Sonuç'!L17)","v":""},{"$f":"IF('Yab. Dil. Öğr. Gör. Sonuç'!M17=\"\",\"\",'Yab. Dil. Öğr. Gör. Sonuç'!M17)","v":""},{"$f":"IF('Yab. Dil. Öğr. Gör. Sonuç'!N17=\"\",\"\",'Yab. Dil. Öğr. Gör. Sonuç'!N17)","v":""}]
[{"$f":"IF('Yab. Dil. Öğr. Gör. Sonuç'!A18=\"\",\"\",'Yab. Dil. Öğr. Gör. Sonuç'!A18)","v":""},{"$f":"IF('Yab. Dil. Öğr. Gör. Sonuç'!B18=\"\",\"\",LEFT('Yab. Dil. Öğr. Gör. Sonuç'!B18,3)&REPT(\"*\",4)&RIGHT('Yab. Dil. Öğr. Gör. Sonuç'!B18,2))","v":""},{"$f":"IF('Yab. Dil. Öğr. Gör. Sonuç'!C18=\"\",\"\",IF(ISERR(FIND(\" \",'Yab. Dil. Öğr. Gör. Sonuç'!C18))=TRUE,LEFT('Yab. Dil. Öğr. Gör. Sonuç'!C18,2)&REPT(\"*\",3),LEFT('Yab. Dil. Öğr. Gör. Sonuç'!C18,2)&REPT(\"*\",3)&\" \"&MID('Yab. Dil. Öğr. Gör. Sonuç'!C18,FIND(\" \",'Yab. Dil. Öğr. Gör. Sonuç'!C18)+1,2)&REPT(\"*\",3)))","v":""},{"$f":"IF('Yab. Dil. Öğr. Gör. Sonuç'!D18=\"\",\"\",IF(ISERR(FIND(\" \",'Yab. Dil. Öğr. Gör. Sonuç'!D18))=TRUE,LEFT('Yab. Dil. Öğr. Gör. Sonuç'!D18,2)&REPT(\"*\",3),LEFT('Yab. Dil. Öğr. Gör. Sonuç'!D18,2)&REPT(\"*\",3)&\" \"&MID('Yab. Dil. Öğr. Gör. Sonuç'!D18,FIND(\" \",'Yab. Dil. Öğr. Gör. Sonuç'!D18)+1,2)&REPT(\"*\",3)))","v":""},{"$f":"IF('Yab. Dil. Öğr. Gör. Sonuç'!E18=\"\",\"\",'Yab. Dil. Öğr. Gör. Sonuç'!E18)","v":""},{"$f":"IF('Yab. Dil. Öğr. Gör. Sonuç'!F18=\"\",\"\",'Yab. Dil. Öğr. Gör. Sonuç'!F18)","v":""},{"$f":"IF('Yab. Dil. Öğr. Gör. Sonuç'!G18=\"\",\"\",'Yab. Dil. Öğr. Gör. Sonuç'!G18)","v":""},{"$f":"IF('Yab. Dil. Öğr. Gör. Sonuç'!H18=\"\",\"\",'Yab. Dil. Öğr. Gör. Sonuç'!H18)","v":""},{"$f":"IF('Yab. Dil. Öğr. Gör. Sonuç'!I18=\"\",\"\",'Yab. Dil. Öğr. Gör. Sonuç'!I18)","v":""},{"$f":"IF('Yab. Dil. Öğr. Gör. Sonuç'!J18=\"\",\"\",'Yab. Dil. Öğr. Gör. Sonuç'!J18)","v":""},{"$f":"IF('Yab. Dil. Öğr. Gör. Sonuç'!K18=\"\",\"\",'Yab. Dil. Öğr. Gör. Sonuç'!K18)","v":""},{"$f":"IF('Yab. Dil. Öğr. Gör. Sonuç'!L18=\"\",\"\",'Yab. Dil. Öğr. Gör. Sonuç'!L18)","v":""},{"$f":"IF('Yab. Dil. Öğr. Gör. Sonuç'!M18=\"\",\"\",'Yab. Dil. Öğr. Gör. Sonuç'!M18)","v":""},{"$f":"IF('Yab. Dil. Öğr. Gör. Sonuç'!N18=\"\",\"\",'Yab. Dil. Öğr. Gör. Sonuç'!N18)","v":""}]
[{"$f":"IF('Yab. Dil. Öğr. Gör. Sonuç'!A19=\"\",\"\",'Yab. Dil. Öğr. Gör. Sonuç'!A19)","v":""},{"$f":"IF('Yab. Dil. Öğr. Gör. Sonuç'!B19=\"\",\"\",LEFT('Yab. Dil. Öğr. Gör. Sonuç'!B19,3)&REPT(\"*\",4)&RIGHT('Yab. Dil. Öğr. Gör. Sonuç'!B19,2))","v":""},{"$f":"IF('Yab. Dil. Öğr. Gör. Sonuç'!C19=\"\",\"\",IF(ISERR(FIND(\" \",'Yab. Dil. Öğr. Gör. Sonuç'!C19))=TRUE,LEFT('Yab. Dil. Öğr. Gör. Sonuç'!C19,2)&REPT(\"*\",3),LEFT('Yab. Dil. Öğr. Gör. Sonuç'!C19,2)&REPT(\"*\",3)&\" \"&MID('Yab. Dil. Öğr. Gör. Sonuç'!C19,FIND(\" \",'Yab. Dil. Öğr. Gör. Sonuç'!C19)+1,2)&REPT(\"*\",3)))","v":""},{"$f":"IF('Yab. Dil. Öğr. Gör. Sonuç'!D19=\"\",\"\",IF(ISERR(FIND(\" \",'Yab. Dil. Öğr. Gör. Sonuç'!D19))=TRUE,LEFT('Yab. Dil. Öğr. Gör. Sonuç'!D19,2)&REPT(\"*\",3),LEFT('Yab. Dil. Öğr. Gör. Sonuç'!D19,2)&REPT(\"*\",3)&\" \"&MID('Yab. Dil. Öğr. Gör. Sonuç'!D19,FIND(\" \",'Yab. Dil. Öğr. Gör. Sonuç'!D19)+1,2)&REPT(\"*\",3)))","v":""},{"$f":"IF('Yab. Dil. Öğr. Gör. Sonuç'!E19=\"\",\"\",'Yab. Dil. Öğr. Gör. Sonuç'!E19)","v":""},{"$f":"IF('Yab. Dil. Öğr. Gör. Sonuç'!F19=\"\",\"\",'Yab. Dil. Öğr. Gör. Sonuç'!F19)","v":""},{"$f":"IF('Yab. Dil. Öğr. Gör. Sonuç'!G19=\"\",\"\",'Yab. Dil. Öğr. Gör. Sonuç'!G19)","v":""},{"$f":"IF('Yab. Dil. Öğr. Gör. Sonuç'!H19=\"\",\"\",'Yab. Dil. Öğr. Gör. Sonuç'!H19)","v":""},{"$f":"IF('Yab. Dil. Öğr. Gör. Sonuç'!I19=\"\",\"\",'Yab. Dil. Öğr. Gör. Sonuç'!I19)","v":""},{"$f":"IF('Yab. Dil. Öğr. Gör. Sonuç'!J19=\"\",\"\",'Yab. Dil. Öğr. Gör. Sonuç'!J19)","v":""},{"$f":"IF('Yab. Dil. Öğr. Gör. Sonuç'!K19=\"\",\"\",'Yab. Dil. Öğr. Gör. Sonuç'!K19)","v":""},{"$f":"IF('Yab. Dil. Öğr. Gör. Sonuç'!L19=\"\",\"\",'Yab. Dil. Öğr. Gör. Sonuç'!L19)","v":""},{"$f":"IF('Yab. Dil. Öğr. Gör. Sonuç'!M19=\"\",\"\",'Yab. Dil. Öğr. Gör. Sonuç'!M19)","v":""},{"$f":"IF('Yab. Dil. Öğr. Gör. Sonuç'!N19=\"\",\"\",'Yab. Dil. Öğr. Gör. Sonuç'!N19)","v":""}]
[{"$f":"IF('Yab. Dil. Öğr. Gör. Sonuç'!A20=\"\",\"\",'Yab. Dil. Öğr. Gör. Sonuç'!A20)","v":""},{"$f":"IF('Yab. Dil. Öğr. Gör. Sonuç'!B20=\"\",\"\",LEFT('Yab. Dil. Öğr. Gör. Sonuç'!B20,3)&REPT(\"*\",4)&RIGHT('Yab. Dil. Öğr. Gör. Sonuç'!B20,2))","v":""},{"$f":"IF('Yab. Dil. Öğr. Gör. Sonuç'!C20=\"\",\"\",IF(ISERR(FIND(\" \",'Yab. Dil. Öğr. Gör. Sonuç'!C20))=TRUE,LEFT('Yab. Dil. Öğr. Gör. Sonuç'!C20,2)&REPT(\"*\",3),LEFT('Yab. Dil. Öğr. Gör. Sonuç'!C20,2)&REPT(\"*\",3)&\" \"&MID('Yab. Dil. Öğr. Gör. Sonuç'!C20,FIND(\" \",'Yab. Dil. Öğr. Gör. Sonuç'!C20)+1,2)&REPT(\"*\",3)))","v":""},{"$f":"IF('Yab. Dil. Öğr. Gör. Sonuç'!D20=\"\",\"\",IF(ISERR(FIND(\" \",'Yab. Dil. Öğr. Gör. Sonuç'!D20))=TRUE,LEFT('Yab. Dil. Öğr. Gör. Sonuç'!D20,2)&REPT(\"*\",3),LEFT('Yab. Dil. Öğr. Gör. Sonuç'!D20,2)&REPT(\"*\",3)&\" \"&MID('Yab. Dil. Öğr. Gör. Sonuç'!D20,FIND(\" \",'Yab. Dil. Öğr. Gör. Sonuç'!D20)+1,2)&REPT(\"*\",3)))","v":""},{"$f":"IF('Yab. Dil. Öğr. Gör. Sonuç'!E20=\"\",\"\",'Yab. Dil. Öğr. Gör. Sonuç'!E20)","v":""},{"$f":"IF('Yab. Dil. Öğr. Gör. Sonuç'!F20=\"\",\"\",'Yab. Dil. Öğr. Gör. Sonuç'!F20)","v":""},{"$f":"IF('Yab. Dil. Öğr. Gör. Sonuç'!G20=\"\",\"\",'Yab. Dil. Öğr. Gör. Sonuç'!G20)","v":""},{"$f":"IF('Yab. Dil. Öğr. Gör. Sonuç'!H20=\"\",\"\",'Yab. Dil. Öğr. Gör. Sonuç'!H20)","v":""},{"$f":"IF('Yab. Dil. Öğr. Gör. Sonuç'!I20=\"\",\"\",'Yab. Dil. Öğr. Gör. Sonuç'!I20)","v":""},{"$f":"IF('Yab. Dil. Öğr. Gör. Sonuç'!J20=\"\",\"\",'Yab. Dil. Öğr. Gör. Sonuç'!J20)","v":""},{"$f":"IF('Yab. Dil. Öğr. Gör. Sonuç'!K20=\"\",\"\",'Yab. Dil. Öğr. Gör. Sonuç'!K20)","v":""},{"$f":"IF('Yab. Dil. Öğr. Gör. Sonuç'!L20=\"\",\"\",'Yab. Dil. Öğr. Gör. Sonuç'!L20)","v":""},{"$f":"IF('Yab. Dil. Öğr. Gör. Sonuç'!M20=\"\",\"\",'Yab. Dil. Öğr. Gör. Sonuç'!M20)","v":""},{"$f":"IF('Yab. Dil. Öğr. Gör. Sonuç'!N20=\"\",\"\",'Yab. Dil. Öğr. Gör. Sonuç'!N20)","v":""}]
[{"$f":"IF('Yab. Dil. Öğr. Gör. Sonuç'!A21=\"\",\"\",'Yab. Dil. Öğr. Gör. Sonuç'!A21)","v":""},{"$f":"IF('Yab. Dil. Öğr. Gör. Sonuç'!B21=\"\",\"\",LEFT('Yab. Dil. Öğr. Gör. Sonuç'!B21,3)&REPT(\"*\",4)&RIGHT('Yab. Dil. Öğr. Gör. Sonuç'!B21,2))","v":""},{"$f":"IF('Yab. Dil. Öğr. Gör. Sonuç'!C21=\"\",\"\",IF(ISERR(FIND(\" \",'Yab. Dil. Öğr. Gör. Sonuç'!C21))=TRUE,LEFT('Yab. Dil. Öğr. Gör. Sonuç'!C21,2)&REPT(\"*\",3),LEFT('Yab. Dil. Öğr. Gör. Sonuç'!C21,2)&REPT(\"*\",3)&\" \"&MID('Yab. Dil. Öğr. Gör. Sonuç'!C21,FIND(\" \",'Yab. Dil. Öğr. Gör. Sonuç'!C21)+1,2)&REPT(\"*\",3)))","v":""},{"$f":"IF('Yab. Dil. Öğr. Gör. Sonuç'!D21=\"\",\"\",IF(ISERR(FIND(\" \",'Yab. Dil. Öğr. Gör. Sonuç'!D21))=TRUE,LEFT('Yab. Dil. Öğr. Gör. Sonuç'!D21,2)&REPT(\"*\",3),LEFT('Yab. Dil. Öğr. Gör. Sonuç'!D21,2)&REPT(\"*\",3)&\" \"&MID('Yab. Dil. Öğr. Gör. Sonuç'!D21,FIND(\" \",'Yab. Dil. Öğr. Gör. Sonuç'!D21)+1,2)&REPT(\"*\",3)))","v":""},{"$f":"IF('Yab. Dil. Öğr. Gör. Sonuç'!E21=\"\",\"\",'Yab. Dil. Öğr. Gör. Sonuç'!E21)","v":""},{"$f":"IF('Yab. Dil. Öğr. Gör. Sonuç'!F21=\"\",\"\",'Yab. Dil. Öğr. Gör. Sonuç'!F21)","v":""},{"$f":"IF('Yab. Dil. Öğr. Gör. Sonuç'!G21=\"\",\"\",'Yab. Dil. Öğr. Gör. Sonuç'!G21)","v":""},{"$f":"IF('Yab. Dil. Öğr. Gör. Sonuç'!H21=\"\",\"\",'Yab. Dil. Öğr. Gör. Sonuç'!H21)","v":""},{"$f":"IF('Yab. Dil. Öğr. Gör. Sonuç'!I21=\"\",\"\",'Yab. Dil. Öğr. Gör. Sonuç'!I21)","v":""},{"$f":"IF('Yab. Dil. Öğr. Gör. Sonuç'!J21=\"\",\"\",'Yab. Dil. Öğr. Gör. Sonuç'!J21)","v":""},{"$f":"IF('Yab. Dil. Öğr. Gör. Sonuç'!K21=\"\",\"\",'Yab. Dil. Öğr. Gör. Sonuç'!K21)","v":""},{"$f":"IF('Yab. Dil. Öğr. Gör. Sonuç'!L21=\"\",\"\",'Yab. Dil. Öğr. Gör. Sonuç'!L21)","v":""},{"$f":"IF('Yab. Dil. Öğr. Gör. Sonuç'!M21=\"\",\"\",'Yab. Dil. Öğr. Gör. Sonuç'!M21)","v":""},{"$f":"IF('Yab. Dil. Öğr. Gör. Sonuç'!N21=\"\",\"\",'Yab. Dil. Öğr. Gör. Sonuç'!N21)","v":""}]
[{"$f":"IF('Yab. Dil. Öğr. Gör. Sonuç'!A22=\"\",\"\",'Yab. Dil. Öğr. Gör. Sonuç'!A22)","v":""},{"$f":"IF('Yab. Dil. Öğr. Gör. Sonuç'!B22=\"\",\"\",LEFT('Yab. Dil. Öğr. Gör. Sonuç'!B22,3)&REPT(\"*\",4)&RIGHT('Yab. Dil. Öğr. Gör. Sonuç'!B22,2))","v":""},{"$f":"IF('Yab. Dil. Öğr. Gör. Sonuç'!C22=\"\",\"\",IF(ISERR(FIND(\" \",'Yab. Dil. Öğr. Gör. Sonuç'!C22))=TRUE,LEFT('Yab. Dil. Öğr. Gör. Sonuç'!C22,2)&REPT(\"*\",3),LEFT('Yab. Dil. Öğr. Gör. Sonuç'!C22,2)&REPT(\"*\",3)&\" \"&MID('Yab. Dil. Öğr. Gör. Sonuç'!C22,FIND(\" \",'Yab. Dil. Öğr. Gör. Sonuç'!C22)+1,2)&REPT(\"*\",3)))","v":""},{"$f":"IF('Yab. Dil. Öğr. Gör. Sonuç'!D22=\"\",\"\",IF(ISERR(FIND(\" \",'Yab. Dil. Öğr. Gör. Sonuç'!D22))=TRUE,LEFT('Yab. Dil. Öğr. Gör. Sonuç'!D22,2)&REPT(\"*\",3),LEFT('Yab. Dil. Öğr. Gör. Sonuç'!D22,2)&REPT(\"*\",3)&\" \"&MID('Yab. Dil. Öğr. Gör. Sonuç'!D22,FIND(\" \",'Yab. Dil. Öğr. Gör. Sonuç'!D22)+1,2)&REPT(\"*\",3)))","v":""},{"$f":"IF('Yab. Dil. Öğr. Gör. Sonuç'!E22=\"\",\"\",'Yab. Dil. Öğr. Gör. Sonuç'!E22)","v":""},{"$f":"IF('Yab. Dil. Öğr. Gör. Sonuç'!F22=\"\",\"\",'Yab. Dil. Öğr. Gör. Sonuç'!F22)","v":""},{"$f":"IF('Yab. Dil. Öğr. Gör. Sonuç'!G22=\"\",\"\",'Yab. Dil. Öğr. Gör. Sonuç'!G22)","v":""},{"$f":"IF('Yab. Dil. Öğr. Gör. Sonuç'!H22=\"\",\"\",'Yab. Dil. Öğr. Gör. Sonuç'!H22)","v":""},{"$f":"IF('Yab. Dil. Öğr. Gör. Sonuç'!I22=\"\",\"\",'Yab. Dil. Öğr. Gör. Sonuç'!I22)","v":""},{"$f":"IF('Yab. Dil. Öğr. Gör. Sonuç'!J22=\"\",\"\",'Yab. Dil. Öğr. Gör. Sonuç'!J22)","v":""},{"$f":"IF('Yab. Dil. Öğr. Gör. Sonuç'!K22=\"\",\"\",'Yab. Dil. Öğr. Gör. Sonuç'!K22)","v":""},{"$f":"IF('Yab. Dil. Öğr. Gör. Sonuç'!L22=\"\",\"\",'Yab. Dil. Öğr. Gör. Sonuç'!L22)","v":""},{"$f":"IF('Yab. Dil. Öğr. Gör. Sonuç'!M22=\"\",\"\",'Yab. Dil. Öğr. Gör. Sonuç'!M22)","v":""},{"$f":"IF('Yab. Dil. Öğr. Gör. Sonuç'!N22=\"\",\"\",'Yab. Dil. Öğr. Gör. Sonuç'!N22)","v":""}]
[{"$f":"IF('Yab. Dil. Öğr. Gör. Sonuç'!A23=\"\",\"\",'Yab. Dil. Öğr. Gör. Sonuç'!A23)","v":""},{"$f":"IF('Yab. Dil. Öğr. Gör. Sonuç'!B23=\"\",\"\",LEFT('Yab. Dil. Öğr. Gör. Sonuç'!B23,3)&REPT(\"*\",4)&RIGHT('Yab. Dil. Öğr. Gör. Sonuç'!B23,2))","v":""},{"$f":"IF('Yab. Dil. Öğr. Gör. Sonuç'!C23=\"\",\"\",IF(ISERR(FIND(\" \",'Yab. Dil. Öğr. Gör. Sonuç'!C23))=TRUE,LEFT('Yab. Dil. Öğr. Gör. Sonuç'!C23,2)&REPT(\"*\",3),LEFT('Yab. Dil. Öğr. Gör. Sonuç'!C23,2)&REPT(\"*\",3)&\" \"&MID('Yab. Dil. Öğr. Gör. Sonuç'!C23,FIND(\" \",'Yab. Dil. Öğr. Gör. Sonuç'!C23)+1,2)&REPT(\"*\",3)))","v":""},{"$f":"IF('Yab. Dil. Öğr. Gör. Sonuç'!D23=\"\",\"\",IF(ISERR(FIND(\" \",'Yab. Dil. Öğr. Gör. Sonuç'!D23))=TRUE,LEFT('Yab. Dil. Öğr. Gör. Sonuç'!D23,2)&REPT(\"*\",3),LEFT('Yab. Dil. Öğr. Gör. Sonuç'!D23,2)&REPT(\"*\",3)&\" \"&MID('Yab. Dil. Öğr. Gör. Sonuç'!D23,FIND(\" \",'Yab. Dil. Öğr. Gör. Sonuç'!D23)+1,2)&REPT(\"*\",3)))","v":""},{"$f":"IF('Yab. Dil. Öğr. Gör. Sonuç'!E23=\"\",\"\",'Yab. Dil. Öğr. Gör. Sonuç'!E23)","v":""},{"$f":"IF('Yab. Dil. Öğr. Gör. Sonuç'!F23=\"\",\"\",'Yab. Dil. Öğr. Gör. Sonuç'!F23)","v":""},{"$f":"IF('Yab. Dil. Öğr. Gör. Sonuç'!G23=\"\",\"\",'Yab. Dil. Öğr. Gör. Sonuç'!G23)","v":""},{"$f":"IF('Yab. Dil. Öğr. Gör. Sonuç'!H23=\"\",\"\",'Yab. Dil. Öğr. Gör. Sonuç'!H23)","v":""},{"$f":"IF('Yab. Dil. Öğr. Gör. Sonuç'!I23=\"\",\"\",'Yab. Dil. Öğr. Gör. Sonuç'!I23)","v":""},{"$f":"IF('Yab. Dil. Öğr. Gör. Sonuç'!J23=\"\",\"\",'Yab. Dil. Öğr. Gör. Sonuç'!J23)","v":""},{"$f":"IF('Yab. Dil. Öğr. Gör. Sonuç'!K23=\"\",\"\",'Yab. Dil. Öğr. Gör. Sonuç'!K23)","v":""},{"$f":"IF('Yab. Dil. Öğr. Gör. Sonuç'!L23=\"\",\"\",'Yab. Dil. Öğr. Gör. Sonuç'!L23)","v":""},{"$f":"IF('Yab. Dil. Öğr. Gör. Sonuç'!M23=\"\",\"\",'Yab. Dil. Öğr. Gör. Sonuç'!M23)","v":""},{"$f":"IF('Yab. Dil. Öğr. Gör. Sonuç'!N23=\"\",\"\",'Yab. Dil. Öğr. Gör. Sonuç'!N23)","v":""}]
[{"$f":"IF('Yab. Dil. Öğr. Gör. Sonuç'!A24=\"\",\"\",'Yab. Dil. Öğr. Gör. Sonuç'!A24)","v":""},{"$f":"IF('Yab. Dil. Öğr. Gör. Sonuç'!B24=\"\",\"\",LEFT('Yab. Dil. Öğr. Gör. Sonuç'!B24,3)&REPT(\"*\",4)&RIGHT('Yab. Dil. Öğr. Gör. Sonuç'!B24,2))","v":""},{"$f":"IF('Yab. Dil. Öğr. Gör. Sonuç'!C24=\"\",\"\",IF(ISERR(FIND(\" \",'Yab. Dil. Öğr. Gör. Sonuç'!C24))=TRUE,LEFT('Yab. Dil. Öğr. Gör. Sonuç'!C24,2)&REPT(\"*\",3),LEFT('Yab. Dil. Öğr. Gör. Sonuç'!C24,2)&REPT(\"*\",3)&\" \"&MID('Yab. Dil. Öğr. Gör. Sonuç'!C24,FIND(\" \",'Yab. Dil. Öğr. Gör. Sonuç'!C24)+1,2)&REPT(\"*\",3)))","v":""},{"$f":"IF('Yab. Dil. Öğr. Gör. Sonuç'!D24=\"\",\"\",IF(ISERR(FIND(\" \",'Yab. Dil. Öğr. Gör. Sonuç'!D24))=TRUE,LEFT('Yab. Dil. Öğr. Gör. Sonuç'!D24,2)&REPT(\"*\",3),LEFT('Yab. Dil. Öğr. Gör. Sonuç'!D24,2)&REPT(\"*\",3)&\" \"&MID('Yab. Dil. Öğr. Gör. Sonuç'!D24,FIND(\" \",'Yab. Dil. Öğr. Gör. Sonuç'!D24)+1,2)&REPT(\"*\",3)))","v":""},{"$f":"IF('Yab. Dil. Öğr. Gör. Sonuç'!E24=\"\",\"\",'Yab. Dil. Öğr. Gör. Sonuç'!E24)","v":""},{"$f":"IF('Yab. Dil. Öğr. Gör. Sonuç'!F24=\"\",\"\",'Yab. Dil. Öğr. Gör. Sonuç'!F24)","v":""},{"$f":"IF('Yab. Dil. Öğr. Gör. Sonuç'!G24=\"\",\"\",'Yab. Dil. Öğr. Gör. Sonuç'!G24)","v":""},{"$f":"IF('Yab. Dil. Öğr. Gör. Sonuç'!H24=\"\",\"\",'Yab. Dil. Öğr. Gör. Sonuç'!H24)","v":""},{"$f":"IF('Yab. Dil. Öğr. Gör. Sonuç'!I24=\"\",\"\",'Yab. Dil. Öğr. Gör. Sonuç'!I24)","v":""},{"$f":"IF('Yab. Dil. Öğr. Gör. Sonuç'!J24=\"\",\"\",'Yab. Dil. Öğr. Gör. Sonuç'!J24)","v":""},{"$f":"IF('Yab. Dil. Öğr. Gör. Sonuç'!K24=\"\",\"\",'Yab. Dil. Öğr. Gör. Sonuç'!K24)","v":""},{"$f":"IF('Yab. Dil. Öğr. Gör. Sonuç'!L24=\"\",\"\",'Yab. Dil. Öğr. Gör. Sonuç'!L24)","v":""},{"$f":"IF('Yab. Dil. Öğr. Gör. Sonuç'!M24=\"\",\"\",'Yab. Dil. Öğr. Gör. Sonuç'!M24)","v":""},{"$f":"IF('Yab. Dil. Öğr. Gör. Sonuç'!N24=\"\",\"\",'Yab. Dil. Öğr. Gör. Sonuç'!N24)","v":""}]
[{"$f":"IF('Yab. Dil. Öğr. Gör. Sonuç'!A25=\"\",\"\",'Yab. Dil. Öğr. Gör. Sonuç'!A25)","v":""},{"$f":"IF('Yab. Dil. Öğr. Gör. Sonuç'!B25=\"\",\"\",LEFT('Yab. Dil. Öğr. Gör. Sonuç'!B25,3)&REPT(\"*\",4)&RIGHT('Yab. Dil. Öğr. Gör. Sonuç'!B25,2))","v":""},{"$f":"IF('Yab. Dil. Öğr. Gör. Sonuç'!C25=\"\",\"\",IF(ISERR(FIND(\" \",'Yab. Dil. Öğr. Gör. Sonuç'!C25))=TRUE,LEFT('Yab. Dil. Öğr. Gör. Sonuç'!C25,2)&REPT(\"*\",3),LEFT('Yab. Dil. Öğr. Gör. Sonuç'!C25,2)&REPT(\"*\",3)&\" \"&MID('Yab. Dil. Öğr. Gör. Sonuç'!C25,FIND(\" \",'Yab. Dil. Öğr. Gör. Sonuç'!C25)+1,2)&REPT(\"*\",3)))","v":""},{"$f":"IF('Yab. Dil. Öğr. Gör. Sonuç'!D25=\"\",\"\",IF(ISERR(FIND(\" \",'Yab. Dil. Öğr. Gör. Sonuç'!D25))=TRUE,LEFT('Yab. Dil. Öğr. Gör. Sonuç'!D25,2)&REPT(\"*\",3),LEFT('Yab. Dil. Öğr. Gör. Sonuç'!D25,2)&REPT(\"*\",3)&\" \"&MID('Yab. Dil. Öğr. Gör. Sonuç'!D25,FIND(\" \",'Yab. Dil. Öğr. Gör. Sonuç'!D25)+1,2)&REPT(\"*\",3)))","v":""},{"$f":"IF('Yab. Dil. Öğr. Gör. Sonuç'!E25=\"\",\"\",'Yab. Dil. Öğr. Gör. Sonuç'!E25)","v":""},{"$f":"IF('Yab. Dil. Öğr. Gör. Sonuç'!F25=\"\",\"\",'Yab. Dil. Öğr. Gör. Sonuç'!F25)","v":""},{"$f":"IF('Yab. Dil. Öğr. Gör. Sonuç'!G25=\"\",\"\",'Yab. Dil. Öğr. Gör. Sonuç'!G25)","v":""},{"$f":"IF('Yab. Dil. Öğr. Gör. Sonuç'!H25=\"\",\"\",'Yab. Dil. Öğr. Gör. Sonuç'!H25)","v":""},{"$f":"IF('Yab. Dil. Öğr. Gör. Sonuç'!I25=\"\",\"\",'Yab. Dil. Öğr. Gör. Sonuç'!I25)","v":""},{"$f":"IF('Yab. Dil. Öğr. Gör. Sonuç'!J25=\"\",\"\",'Yab. Dil. Öğr. Gör. Sonuç'!J25)","v":""},{"$f":"IF('Yab. Dil. Öğr. Gör. Sonuç'!K25=\"\",\"\",'Yab. Dil. Öğr. Gör. Sonuç'!K25)","v":""},{"$f":"IF('Yab. Dil. Öğr. Gör. Sonuç'!L25=\"\",\"\",'Yab. Dil. Öğr. Gör. Sonuç'!L25)","v":""},{"$f":"IF('Yab. Dil. Öğr. Gör. Sonuç'!M25=\"\",\"\",'Yab. Dil. Öğr. Gör. Sonuç'!M25)","v":""},{"$f":"IF('Yab. Dil. Öğr. Gör. Sonuç'!N25=\"\",\"\",'Yab. Dil. Öğr. Gör. Sonuç'!N25)","v":""}]
[{"$f":"IF('Yab. Dil. Öğr. Gör. Sonuç'!A26=\"\",\"\",'Yab. Dil. Öğr. Gör. Sonuç'!A26)","v":""},{"$f":"IF('Yab. Dil. Öğr. Gör. Sonuç'!B26=\"\",\"\",LEFT('Yab. Dil. Öğr. Gör. Sonuç'!B26,3)&REPT(\"*\",4)&RIGHT('Yab. Dil. Öğr. Gör. Sonuç'!B26,2))","v":""},{"$f":"IF('Yab. Dil. Öğr. Gör. Sonuç'!C26=\"\",\"\",IF(ISERR(FIND(\" \",'Yab. Dil. Öğr. Gör. Sonuç'!C26))=TRUE,LEFT('Yab. Dil. Öğr. Gör. Sonuç'!C26,2)&REPT(\"*\",3),LEFT('Yab. Dil. Öğr. Gör. Sonuç'!C26,2)&REPT(\"*\",3)&\" \"&MID('Yab. Dil. Öğr. Gör. Sonuç'!C26,FIND(\" \",'Yab. Dil. Öğr. Gör. Sonuç'!C26)+1,2)&REPT(\"*\",3)))","v":""},{"$f":"IF('Yab. Dil. Öğr. Gör. Sonuç'!D26=\"\",\"\",IF(ISERR(FIND(\" \",'Yab. Dil. Öğr. Gör. Sonuç'!D26))=TRUE,LEFT('Yab. Dil. Öğr. Gör. Sonuç'!D26,2)&REPT(\"*\",3),LEFT('Yab. Dil. Öğr. Gör. Sonuç'!D26,2)&REPT(\"*\",3)&\" \"&MID('Yab. Dil. Öğr. Gör. Sonuç'!D26,FIND(\" \",'Yab. Dil. Öğr. Gör. Sonuç'!D26)+1,2)&REPT(\"*\",3)))","v":""},{"$f":"IF('Yab. Dil. Öğr. Gör. Sonuç'!E26=\"\",\"\",'Yab. Dil. Öğr. Gör. Sonuç'!E26)","v":""},{"$f":"IF('Yab. Dil. Öğr. Gör. Sonuç'!F26=\"\",\"\",'Yab. Dil. Öğr. Gör. Sonuç'!F26)","v":""},{"$f":"IF('Yab. Dil. Öğr. Gör. Sonuç'!G26=\"\",\"\",'Yab. Dil. Öğr. Gör. Sonuç'!G26)","v":""},{"$f":"IF('Yab. Dil. Öğr. Gör. Sonuç'!H26=\"\",\"\",'Yab. Dil. Öğr. Gör. Sonuç'!H26)","v":""},{"$f":"IF('Yab. Dil. Öğr. Gör. Sonuç'!I26=\"\",\"\",'Yab. Dil. Öğr. Gör. Sonuç'!I26)","v":""},{"$f":"IF('Yab. Dil. Öğr. Gör. Sonuç'!J26=\"\",\"\",'Yab. Dil. Öğr. Gör. Sonuç'!J26)","v":""},{"$f":"IF('Yab. Dil. Öğr. Gör. Sonuç'!K26=\"\",\"\",'Yab. Dil. Öğr. Gör. Sonuç'!K26)","v":""},{"$f":"IF('Yab. Dil. Öğr. Gör. Sonuç'!L26=\"\",\"\",'Yab. Dil. Öğr. Gör. Sonuç'!L26)","v":""},{"$f":"IF('Yab. Dil. Öğr. Gör. Sonuç'!M26=\"\",\"\",'Yab. Dil. Öğr. Gör. Sonuç'!M26)","v":""},{"$f":"IF('Yab. Dil. Öğr. Gör. Sonuç'!N26=\"\",\"\",'Yab. Dil. Öğr. Gör. Sonuç'!N26)","v":""}]
[{"$f":"IF('Yab. Dil. Öğr. Gör. Sonuç'!A27=\"\",\"\",'Yab. Dil. Öğr. Gör. Sonuç'!A27)","v":""},{"$f":"IF('Yab. Dil. Öğr. Gör. Sonuç'!B27=\"\",\"\",LEFT('Yab. Dil. Öğr. Gör. Sonuç'!B27,3)&REPT(\"*\",4)&RIGHT('Yab. Dil. Öğr. Gör. Sonuç'!B27,2))","v":""},{"$f":"IF('Yab. Dil. Öğr. Gör. Sonuç'!C27=\"\",\"\",IF(ISERR(FIND(\" \",'Yab. Dil. Öğr. Gör. Sonuç'!C27))=TRUE,LEFT('Yab. Dil. Öğr. Gör. Sonuç'!C27,2)&REPT(\"*\",3),LEFT('Yab. Dil. Öğr. Gör. Sonuç'!C27,2)&REPT(\"*\",3)&\" \"&MID('Yab. Dil. Öğr. Gör. Sonuç'!C27,FIND(\" \",'Yab. Dil. Öğr. Gör. Sonuç'!C27)+1,2)&REPT(\"*\",3)))","v":""},{"$f":"IF('Yab. Dil. Öğr. Gör. Sonuç'!D27=\"\",\"\",IF(ISERR(FIND(\" \",'Yab. Dil. Öğr. Gör. Sonuç'!D27))=TRUE,LEFT('Yab. Dil. Öğr. Gör. Sonuç'!D27,2)&REPT(\"*\",3),LEFT('Yab. Dil. Öğr. Gör. Sonuç'!D27,2)&REPT(\"*\",3)&\" \"&MID('Yab. Dil. Öğr. Gör. Sonuç'!D27,FIND(\" \",'Yab. Dil. Öğr. Gör. Sonuç'!D27)+1,2)&REPT(\"*\",3)))","v":""},{"$f":"IF('Yab. Dil. Öğr. Gör. Sonuç'!E27=\"\",\"\",'Yab. Dil. Öğr. Gör. Sonuç'!E27)","v":""},{"$f":"IF('Yab. Dil. Öğr. Gör. Sonuç'!F27=\"\",\"\",'Yab. Dil. Öğr. Gör. Sonuç'!F27)","v":""},{"$f":"IF('Yab. Dil. Öğr. Gör. Sonuç'!G27=\"\",\"\",'Yab. Dil. Öğr. Gör. Sonuç'!G27)","v":""},{"$f":"IF('Yab. Dil. Öğr. Gör. Sonuç'!H27=\"\",\"\",'Yab. Dil. Öğr. Gör. Sonuç'!H27)","v":""},{"$f":"IF('Yab. Dil. Öğr. Gör. Sonuç'!I27=\"\",\"\",'Yab. Dil. Öğr. Gör. Sonuç'!I27)","v":""},{"$f":"IF('Yab. Dil. Öğr. Gör. Sonuç'!J27=\"\",\"\",'Yab. Dil. Öğr. Gör. Sonuç'!J27)","v":""},{"$f":"IF('Yab. Dil. Öğr. Gör. Sonuç'!K27=\"\",\"\",'Yab. Dil. Öğr. Gör. Sonuç'!K27)","v":""},{"$f":"IF('Yab. Dil. Öğr. Gör. Sonuç'!L27=\"\",\"\",'Yab. Dil. Öğr. Gör. Sonuç'!L27)","v":""},{"$f":"IF('Yab. Dil. Öğr. Gör. Sonuç'!M27=\"\",\"\",'Yab. Dil. Öğr. Gör. Sonuç'!M27)","v":""},{"$f":"IF('Yab. Dil. Öğr. Gör. Sonuç'!N27=\"\",\"\",'Yab. Dil. Öğr. Gör. Sonuç'!N27)","v":""}]
[{"$f":"IF('Yab. Dil. Öğr. Gör. Sonuç'!A28=\"\",\"\",'Yab. Dil. Öğr. Gör. Sonuç'!A28)","v":""},{"$f":"IF('Yab. Dil. Öğr. Gör. Sonuç'!B28=\"\",\"\",LEFT('Yab. Dil. Öğr. Gör. Sonuç'!B28,3)&REPT(\"*\",4)&RIGHT('Yab. Dil. Öğr. Gör. Sonuç'!B28,2))","v":""},{"$f":"IF('Yab. Dil. Öğr. Gör. Sonuç'!C28=\"\",\"\",IF(ISERR(FIND(\" \",'Yab. Dil. Öğr. Gör. Sonuç'!C28))=TRUE,LEFT('Yab. Dil. Öğr. Gör. Sonuç'!C28,2)&REPT(\"*\",3),LEFT('Yab. Dil. Öğr. Gör. Sonuç'!C28,2)&REPT(\"*\",3)&\" \"&MID('Yab. Dil. Öğr. Gör. Sonuç'!C28,FIND(\" \",'Yab. Dil. Öğr. Gör. Sonuç'!C28)+1,2)&REPT(\"*\",3)))","v":""},{"$f":"IF('Yab. Dil. Öğr. Gör. Sonuç'!D28=\"\",\"\",IF(ISERR(FIND(\" \",'Yab. Dil. Öğr. Gör. Sonuç'!D28))=TRUE,LEFT('Yab. Dil. Öğr. Gör. Sonuç'!D28,2)&REPT(\"*\",3),LEFT('Yab. Dil. Öğr. Gör. Sonuç'!D28,2)&REPT(\"*\",3)&\" \"&MID('Yab. Dil. Öğr. Gör. Sonuç'!D28,FIND(\" \",'Yab. Dil. Öğr. Gör. Sonuç'!D28)+1,2)&REPT(\"*\",3)))","v":""},{"$f":"IF('Yab. Dil. Öğr. Gör. Sonuç'!E28=\"\",\"\",'Yab. Dil. Öğr. Gör. Sonuç'!E28)","v":""},{"$f":"IF('Yab. Dil. Öğr. Gör. Sonuç'!F28=\"\",\"\",'Yab. Dil. Öğr. Gör. Sonuç'!F28)","v":""},{"$f":"IF('Yab. Dil. Öğr. Gör. Sonuç'!G28=\"\",\"\",'Yab. Dil. Öğr. Gör. Sonuç'!G28)","v":""},{"$f":"IF('Yab. Dil. Öğr. Gör. Sonuç'!H28=\"\",\"\",'Yab. Dil. Öğr. Gör. Sonuç'!H28)","v":""},{"$f":"IF('Yab. Dil. Öğr. Gör. Sonuç'!I28=\"\",\"\",'Yab. Dil. Öğr. Gör. Sonuç'!I28)","v":""},{"$f":"IF('Yab. Dil. Öğr. Gör. Sonuç'!J28=\"\",\"\",'Yab. Dil. Öğr. Gör. Sonuç'!J28)","v":""},{"$f":"IF('Yab. Dil. Öğr. Gör. Sonuç'!K28=\"\",\"\",'Yab. Dil. Öğr. Gör. Sonuç'!K28)","v":""},{"$f":"IF('Yab. Dil. Öğr. Gör. Sonuç'!L28=\"\",\"\",'Yab. Dil. Öğr. Gör. Sonuç'!L28)","v":""},{"$f":"IF('Yab. Dil. Öğr. Gör. Sonuç'!M28=\"\",\"\",'Yab. Dil. Öğr. Gör. Sonuç'!M28)","v":""},{"$f":"IF('Yab. Dil. Öğr. Gör. Sonuç'!N28=\"\",\"\",'Yab. Dil. Öğr. Gör. Sonuç'!N28)","v":""}]
[{"$f":"IF('Yab. Dil. Öğr. Gör. Sonuç'!A29=\"\",\"\",'Yab. Dil. Öğr. Gör. Sonuç'!A29)","v":""},{"$f":"IF('Yab. Dil. Öğr. Gör. Sonuç'!B29=\"\",\"\",LEFT('Yab. Dil. Öğr. Gör. Sonuç'!B29,3)&REPT(\"*\",4)&RIGHT('Yab. Dil. Öğr. Gör. Sonuç'!B29,2))","v":""},{"$f":"IF('Yab. Dil. Öğr. Gör. Sonuç'!C29=\"\",\"\",IF(ISERR(FIND(\" \",'Yab. Dil. Öğr. Gör. Sonuç'!C29))=TRUE,LEFT('Yab. Dil. Öğr. Gör. Sonuç'!C29,2)&REPT(\"*\",3),LEFT('Yab. Dil. Öğr. Gör. Sonuç'!C29,2)&REPT(\"*\",3)&\" \"&MID('Yab. Dil. Öğr. Gör. Sonuç'!C29,FIND(\" \",'Yab. Dil. Öğr. Gör. Sonuç'!C29)+1,2)&REPT(\"*\",3)))","v":""},{"$f":"IF('Yab. Dil. Öğr. Gör. Sonuç'!D29=\"\",\"\",IF(ISERR(FIND(\" \",'Yab. Dil. Öğr. Gör. Sonuç'!D29))=TRUE,LEFT('Yab. Dil. Öğr. Gör. Sonuç'!D29,2)&REPT(\"*\",3),LEFT('Yab. Dil. Öğr. Gör. Sonuç'!D29,2)&REPT(\"*\",3)&\" \"&MID('Yab. Dil. Öğr. Gör. Sonuç'!D29,FIND(\" \",'Yab. Dil. Öğr. Gör. Sonuç'!D29)+1,2)&REPT(\"*\",3)))","v":""},{"$f":"IF('Yab. Dil. Öğr. Gör. Sonuç'!E29=\"\",\"\",'Yab. Dil. Öğr. Gör. Sonuç'!E29)","v":""},{"$f":"IF('Yab. Dil. Öğr. Gör. Sonuç'!F29=\"\",\"\",'Yab. Dil. Öğr. Gör. Sonuç'!F29)","v":""},{"$f":"IF('Yab. Dil. Öğr. Gör. Sonuç'!G29=\"\",\"\",'Yab. Dil. Öğr. Gör. Sonuç'!G29)","v":""},{"$f":"IF('Yab. Dil. Öğr. Gör. Sonuç'!H29=\"\",\"\",'Yab. Dil. Öğr. Gör. Sonuç'!H29)","v":""},{"$f":"IF('Yab. Dil. Öğr. Gör. Sonuç'!I29=\"\",\"\",'Yab. Dil. Öğr. Gör. Sonuç'!I29)","v":""},{"$f":"IF('Yab. Dil. Öğr. Gör. Sonuç'!J29=\"\",\"\",'Yab. Dil. Öğr. Gör. Sonuç'!J29)","v":""},{"$f":"IF('Yab. Dil. Öğr. Gör. Sonuç'!K29=\"\",\"\",'Yab. Dil. Öğr. Gör. Sonuç'!K29)","v":""},{"$f":"IF('Yab. Dil. Öğr. Gör. Sonuç'!L29=\"\",\"\",'Yab. Dil. Öğr. Gör. Sonuç'!L29)","v":""},{"$f":"IF('Yab. Dil. Öğr. Gör. Sonuç'!M29=\"\",\"\",'Yab. Dil. Öğr. Gör. Sonuç'!M29)","v":""},{"$f":"IF('Yab. Dil. Öğr. Gör. Sonuç'!N29=\"\",\"\",'Yab. Dil. Öğr. Gör. Sonuç'!N29)","v":""}]
[{"$f":"IF('Yab. Dil. Öğr. Gör. Sonuç'!A30=\"\",\"\",'Yab. Dil. Öğr. Gör. Sonuç'!A30)","v":""},{"$f":"IF('Yab. Dil. Öğr. Gör. Sonuç'!B30=\"\",\"\",LEFT('Yab. Dil. Öğr. Gör. Sonuç'!B30,3)&REPT(\"*\",4)&RIGHT('Yab. Dil. Öğr. Gör. Sonuç'!B30,2))","v":""},{"$f":"IF('Yab. Dil. Öğr. Gör. Sonuç'!C30=\"\",\"\",IF(ISERR(FIND(\" \",'Yab. Dil. Öğr. Gör. Sonuç'!C30))=TRUE,LEFT('Yab. Dil. Öğr. Gör. Sonuç'!C30,2)&REPT(\"*\",3),LEFT('Yab. Dil. Öğr. Gör. Sonuç'!C30,2)&REPT(\"*\",3)&\" \"&MID('Yab. Dil. Öğr. Gör. Sonuç'!C30,FIND(\" \",'Yab. Dil. Öğr. Gör. Sonuç'!C30)+1,2)&REPT(\"*\",3)))","v":""},{"$f":"IF('Yab. Dil. Öğr. Gör. Sonuç'!D30=\"\",\"\",IF(ISERR(FIND(\" \",'Yab. Dil. Öğr. Gör. Sonuç'!D30))=TRUE,LEFT('Yab. Dil. Öğr. Gör. Sonuç'!D30,2)&REPT(\"*\",3),LEFT('Yab. Dil. Öğr. Gör. Sonuç'!D30,2)&REPT(\"*\",3)&\" \"&MID('Yab. Dil. Öğr. Gör. Sonuç'!D30,FIND(\" \",'Yab. Dil. Öğr. Gör. Sonuç'!D30)+1,2)&REPT(\"*\",3)))","v":""},{"$f":"IF('Yab. Dil. Öğr. Gör. Sonuç'!E30=\"\",\"\",'Yab. Dil. Öğr. Gör. Sonuç'!E30)","v":""},{"$f":"IF('Yab. Dil. Öğr. Gör. Sonuç'!F30=\"\",\"\",'Yab. Dil. Öğr. Gör. Sonuç'!F30)","v":""},{"$f":"IF('Yab. Dil. Öğr. Gör. Sonuç'!G30=\"\",\"\",'Yab. Dil. Öğr. Gör. Sonuç'!G30)","v":""},{"$f":"IF('Yab. Dil. Öğr. Gör. Sonuç'!H30=\"\",\"\",'Yab. Dil. Öğr. Gör. Sonuç'!H30)","v":""},{"$f":"IF('Yab. Dil. Öğr. Gör. Sonuç'!I30=\"\",\"\",'Yab. Dil. Öğr. Gör. Sonuç'!I30)","v":""},{"$f":"IF('Yab. Dil. Öğr. Gör. Sonuç'!J30=\"\",\"\",'Yab. Dil. Öğr. Gör. Sonuç'!J30)","v":""},{"$f":"IF('Yab. Dil. Öğr. Gör. Sonuç'!K30=\"\",\"\",'Yab. Dil. Öğr. Gör. Sonuç'!K30)","v":""},{"$f":"IF('Yab. Dil. Öğr. Gör. Sonuç'!L30=\"\",\"\",'Yab. Dil. Öğr. Gör. Sonuç'!L30)","v":""},{"$f":"IF('Yab. Dil. Öğr. Gör. Sonuç'!M30=\"\",\"\",'Yab. Dil. Öğr. Gör. Sonuç'!M30)","v":""},{"$f":"IF('Yab. Dil. Öğr. Gör. Sonuç'!N30=\"\",\"\",'Yab. Dil. Öğr. Gör. Sonuç'!N30)","v":""}]
[{"$f":"IF('Yab. Dil. Öğr. Gör. Sonuç'!A31=\"\",\"\",'Yab. Dil. Öğr. Gör. Sonuç'!A31)","v":""},{"$f":"IF('Yab. Dil. Öğr. Gör. Sonuç'!B31=\"\",\"\",LEFT('Yab. Dil. Öğr. Gör. Sonuç'!B31,3)&REPT(\"*\",4)&RIGHT('Yab. Dil. Öğr. Gör. Sonuç'!B31,2))","v":""},{"$f":"IF('Yab. Dil. Öğr. Gör. Sonuç'!C31=\"\",\"\",IF(ISERR(FIND(\" \",'Yab. Dil. Öğr. Gör. Sonuç'!C31))=TRUE,LEFT('Yab. Dil. Öğr. Gör. Sonuç'!C31,2)&REPT(\"*\",3),LEFT('Yab. Dil. Öğr. Gör. Sonuç'!C31,2)&REPT(\"*\",3)&\" \"&MID('Yab. Dil. Öğr. Gör. Sonuç'!C31,FIND(\" \",'Yab. Dil. Öğr. Gör. Sonuç'!C31)+1,2)&REPT(\"*\",3)))","v":""},{"$f":"IF('Yab. Dil. Öğr. Gör. Sonuç'!D31=\"\",\"\",IF(ISERR(FIND(\" \",'Yab. Dil. Öğr. Gör. Sonuç'!D31))=TRUE,LEFT('Yab. Dil. Öğr. Gör. Sonuç'!D31,2)&REPT(\"*\",3),LEFT('Yab. Dil. Öğr. Gör. Sonuç'!D31,2)&REPT(\"*\",3)&\" \"&MID('Yab. Dil. Öğr. Gör. Sonuç'!D31,FIND(\" \",'Yab. Dil. Öğr. Gör. Sonuç'!D31)+1,2)&REPT(\"*\",3)))","v":""},{"$f":"IF('Yab. Dil. Öğr. Gör. Sonuç'!E31=\"\",\"\",'Yab. Dil. Öğr. Gör. Sonuç'!E31)","v":""},{"$f":"IF('Yab. Dil. Öğr. Gör. Sonuç'!F31=\"\",\"\",'Yab. Dil. Öğr. Gör. Sonuç'!F31)","v":""},{"$f":"IF('Yab. Dil. Öğr. Gör. Sonuç'!G31=\"\",\"\",'Yab. Dil. Öğr. Gör. Sonuç'!G31)","v":""},{"$f":"IF('Yab. Dil. Öğr. Gör. Sonuç'!H31=\"\",\"\",'Yab. Dil. Öğr. Gör. Sonuç'!H31)","v":""},{"$f":"IF('Yab. Dil. Öğr. Gör. Sonuç'!I31=\"\",\"\",'Yab. Dil. Öğr. Gör. Sonuç'!I31)","v":""},{"$f":"IF('Yab. Dil. Öğr. Gör. Sonuç'!J31=\"\",\"\",'Yab. Dil. Öğr. Gör. Sonuç'!J31)","v":""},{"$f":"IF('Yab. Dil. Öğr. Gör. Sonuç'!K31=\"\",\"\",'Yab. Dil. Öğr. Gör. Sonuç'!K31)","v":""},{"$f":"IF('Yab. Dil. Öğr. Gör. Sonuç'!L31=\"\",\"\",'Yab. Dil. Öğr. Gör. Sonuç'!L31)","v":""},{"$f":"IF('Yab. Dil. Öğr. Gör. Sonuç'!M31=\"\",\"\",'Yab. Dil. Öğr. Gör. Sonuç'!M31)","v":""},{"$f":"IF('Yab. Dil. Öğr. Gör. Sonuç'!N31=\"\",\"\",'Yab. Dil. Öğr. Gör. Sonuç'!N31)","v":""}]
[{"$f":"IF('Yab. Dil. Öğr. Gör. Sonuç'!A32=\"\",\"\",'Yab. Dil. Öğr. Gör. Sonuç'!A32)","v":""},{"$f":"IF('Yab. Dil. Öğr. Gör. Sonuç'!B32=\"\",\"\",LEFT('Yab. Dil. Öğr. Gör. Sonuç'!B32,3)&REPT(\"*\",4)&RIGHT('Yab. Dil. Öğr. Gör. Sonuç'!B32,2))","v":""},{"$f":"IF('Yab. Dil. Öğr. Gör. Sonuç'!C32=\"\",\"\",IF(ISERR(FIND(\" \",'Yab. Dil. Öğr. Gör. Sonuç'!C32))=TRUE,LEFT('Yab. Dil. Öğr. Gör. Sonuç'!C32,2)&REPT(\"*\",3),LEFT('Yab. Dil. Öğr. Gör. Sonuç'!C32,2)&REPT(\"*\",3)&\" \"&MID('Yab. Dil. Öğr. Gör. Sonuç'!C32,FIND(\" \",'Yab. Dil. Öğr. Gör. Sonuç'!C32)+1,2)&REPT(\"*\",3)))","v":""},{"$f":"IF('Yab. Dil. Öğr. Gör. Sonuç'!D32=\"\",\"\",IF(ISERR(FIND(\" \",'Yab. Dil. Öğr. Gör. Sonuç'!D32))=TRUE,LEFT('Yab. Dil. Öğr. Gör. Sonuç'!D32,2)&REPT(\"*\",3),LEFT('Yab. Dil. Öğr. Gör. Sonuç'!D32,2)&REPT(\"*\",3)&\" \"&MID('Yab. Dil. Öğr. Gör. Sonuç'!D32,FIND(\" \",'Yab. Dil. Öğr. Gör. Sonuç'!D32)+1,2)&REPT(\"*\",3)))","v":""},{"$f":"IF('Yab. Dil. Öğr. Gör. Sonuç'!E32=\"\",\"\",'Yab. Dil. Öğr. Gör. Sonuç'!E32)","v":""},{"$f":"IF('Yab. Dil. Öğr. Gör. Sonuç'!F32=\"\",\"\",'Yab. Dil. Öğr. Gör. Sonuç'!F32)","v":""},{"$f":"IF('Yab. Dil. Öğr. Gör. Sonuç'!G32=\"\",\"\",'Yab. Dil. Öğr. Gör. Sonuç'!G32)","v":""},{"$f":"IF('Yab. Dil. Öğr. Gör. Sonuç'!H32=\"\",\"\",'Yab. Dil. Öğr. Gör. Sonuç'!H32)","v":""},{"$f":"IF('Yab. Dil. Öğr. Gör. Sonuç'!I32=\"\",\"\",'Yab. Dil. Öğr. Gör. Sonuç'!I32)","v":""},{"$f":"IF('Yab. Dil. Öğr. Gör. Sonuç'!J32=\"\",\"\",'Yab. Dil. Öğr. Gör. Sonuç'!J32)","v":""},{"$f":"IF('Yab. Dil. Öğr. Gör. Sonuç'!K32=\"\",\"\",'Yab. Dil. Öğr. Gör. Sonuç'!K32)","v":""},{"$f":"IF('Yab. Dil. Öğr. Gör. Sonuç'!L32=\"\",\"\",'Yab. Dil. Öğr. Gör. Sonuç'!L32)","v":""},{"$f":"IF('Yab. Dil. Öğr. Gör. Sonuç'!M32=\"\",\"\",'Yab. Dil. Öğr. Gör. Sonuç'!M32)","v":""},{"$f":"IF('Yab. Dil. Öğr. Gör. Sonuç'!N32=\"\",\"\",'Yab. Dil. Öğr. Gör. Sonuç'!N32)","v":""}]
[{"$f":"IF('Yab. Dil. Öğr. Gör. Sonuç'!A33=\"\",\"\",'Yab. Dil. Öğr. Gör. Sonuç'!A33)","v":""},{"$f":"IF('Yab. Dil. Öğr. Gör. Sonuç'!B33=\"\",\"\",LEFT('Yab. Dil. Öğr. Gör. Sonuç'!B33,3)&REPT(\"*\",4)&RIGHT('Yab. Dil. Öğr. Gör. Sonuç'!B33,2))","v":""},{"$f":"IF('Yab. Dil. Öğr. Gör. Sonuç'!C33=\"\",\"\",IF(ISERR(FIND(\" \",'Yab. Dil. Öğr. Gör. Sonuç'!C33))=TRUE,LEFT('Yab. Dil. Öğr. Gör. Sonuç'!C33,2)&REPT(\"*\",3),LEFT('Yab. Dil. Öğr. Gör. Sonuç'!C33,2)&REPT(\"*\",3)&\" \"&MID('Yab. Dil. Öğr. Gör. Sonuç'!C33,FIND(\" \",'Yab. Dil. Öğr. Gör. Sonuç'!C33)+1,2)&REPT(\"*\",3)))","v":""},{"$f":"IF('Yab. Dil. Öğr. Gör. Sonuç'!D33=\"\",\"\",IF(ISERR(FIND(\" \",'Yab. Dil. Öğr. Gör. Sonuç'!D33))=TRUE,LEFT('Yab. Dil. Öğr. Gör. Sonuç'!D33,2)&REPT(\"*\",3),LEFT('Yab. Dil. Öğr. Gör. Sonuç'!D33,2)&REPT(\"*\",3)&\" \"&MID('Yab. Dil. Öğr. Gör. Sonuç'!D33,FIND(\" \",'Yab. Dil. Öğr. Gör. Sonuç'!D33)+1,2)&REPT(\"*\",3)))","v":""},{"$f":"IF('Yab. Dil. Öğr. Gör. Sonuç'!E33=\"\",\"\",'Yab. Dil. Öğr. Gör. Sonuç'!E33)","v":""},{"$f":"IF('Yab. Dil. Öğr. Gör. Sonuç'!F33=\"\",\"\",'Yab. Dil. Öğr. Gör. Sonuç'!F33)","v":""},{"$f":"IF('Yab. Dil. Öğr. Gör. Sonuç'!G33=\"\",\"\",'Yab. Dil. Öğr. Gör. Sonuç'!G33)","v":""},{"$f":"IF('Yab. Dil. Öğr. Gör. Sonuç'!H33=\"\",\"\",'Yab. Dil. Öğr. Gör. Sonuç'!H33)","v":""},{"$f":"IF('Yab. Dil. Öğr. Gör. Sonuç'!I33=\"\",\"\",'Yab. Dil. Öğr. Gör. Sonuç'!I33)","v":""},{"$f":"IF('Yab. Dil. Öğr. Gör. Sonuç'!J33=\"\",\"\",'Yab. Dil. Öğr. Gör. Sonuç'!J33)","v":""},{"$f":"IF('Yab. Dil. Öğr. Gör. Sonuç'!K33=\"\",\"\",'Yab. Dil. Öğr. Gör. Sonuç'!K33)","v":""},{"$f":"IF('Yab. Dil. Öğr. Gör. Sonuç'!L33=\"\",\"\",'Yab. Dil. Öğr. Gör. Sonuç'!L33)","v":""},{"$f":"IF('Yab. Dil. Öğr. Gör. Sonuç'!M33=\"\",\"\",'Yab. Dil. Öğr. Gör. Sonuç'!M33)","v":""},{"$f":"IF('Yab. Dil. Öğr. Gör. Sonuç'!N33=\"\",\"\",'Yab. Dil. Öğr. Gör. Sonuç'!N33)","v":""}]
[{"$f":"IF('Yab. Dil. Öğr. Gör. Sonuç'!A34=\"\",\"\",'Yab. Dil. Öğr. Gör. Sonuç'!A34)","v":""},{"$f":"IF('Yab. Dil. Öğr. Gör. Sonuç'!B34=\"\",\"\",LEFT('Yab. Dil. Öğr. Gör. Sonuç'!B34,3)&REPT(\"*\",4)&RIGHT('Yab. Dil. Öğr. Gör. Sonuç'!B34,2))","v":""},{"$f":"IF('Yab. Dil. Öğr. Gör. Sonuç'!C34=\"\",\"\",IF(ISERR(FIND(\" \",'Yab. Dil. Öğr. Gör. Sonuç'!C34))=TRUE,LEFT('Yab. Dil. Öğr. Gör. Sonuç'!C34,2)&REPT(\"*\",3),LEFT('Yab. Dil. Öğr. Gör. Sonuç'!C34,2)&REPT(\"*\",3)&\" \"&MID('Yab. Dil. Öğr. Gör. Sonuç'!C34,FIND(\" \",'Yab. Dil. Öğr. Gör. Sonuç'!C34)+1,2)&REPT(\"*\",3)))","v":""},{"$f":"IF('Yab. Dil. Öğr. Gör. Sonuç'!D34=\"\",\"\",IF(ISERR(FIND(\" \",'Yab. Dil. Öğr. Gör. Sonuç'!D34))=TRUE,LEFT('Yab. Dil. Öğr. Gör. Sonuç'!D34,2)&REPT(\"*\",3),LEFT('Yab. Dil. Öğr. Gör. Sonuç'!D34,2)&REPT(\"*\",3)&\" \"&MID('Yab. Dil. Öğr. Gör. Sonuç'!D34,FIND(\" \",'Yab. Dil. Öğr. Gör. Sonuç'!D34)+1,2)&REPT(\"*\",3)))","v":""},{"$f":"IF('Yab. Dil. Öğr. Gör. Sonuç'!E34=\"\",\"\",'Yab. Dil. Öğr. Gör. Sonuç'!E34)","v":""},{"$f":"IF('Yab. Dil. Öğr. Gör. Sonuç'!F34=\"\",\"\",'Yab. Dil. Öğr. Gör. Sonuç'!F34)","v":""},{"$f":"IF('Yab. Dil. Öğr. Gör. Sonuç'!G34=\"\",\"\",'Yab. Dil. Öğr. Gör. Sonuç'!G34)","v":""},{"$f":"IF('Yab. Dil. Öğr. Gör. Sonuç'!H34=\"\",\"\",'Yab. Dil. Öğr. Gör. Sonuç'!H34)","v":""},{"$f":"IF('Yab. Dil. Öğr. Gör. Sonuç'!I34=\"\",\"\",'Yab. Dil. Öğr. Gör. Sonuç'!I34)","v":""},{"$f":"IF('Yab. Dil. Öğr. Gör. Sonuç'!J34=\"\",\"\",'Yab. Dil. Öğr. Gör. Sonuç'!J34)","v":""},{"$f":"IF('Yab. Dil. Öğr. Gör. Sonuç'!K34=\"\",\"\",'Yab. Dil. Öğr. Gör. Sonuç'!K34)","v":""},{"$f":"IF('Yab. Dil. Öğr. Gör. Sonuç'!L34=\"\",\"\",'Yab. Dil. Öğr. Gör. Sonuç'!L34)","v":""},{"$f":"IF('Yab. Dil. Öğr. Gör. Sonuç'!M34=\"\",\"\",'Yab. Dil. Öğr. Gör. Sonuç'!M34)","v":""},{"$f":"IF('Yab. Dil. Öğr. Gör. Sonuç'!N34=\"\",\"\",'Yab. Dil. Öğr. Gör. Sonuç'!N34)","v":""}]
[{"$f":"IF('Yab. Dil. Öğr. Gör. Sonuç'!A35=\"\",\"\",'Yab. Dil. Öğr. Gör. Sonuç'!A35)","v":""},{"$f":"IF('Yab. Dil. Öğr. Gör. Sonuç'!B35=\"\",\"\",LEFT('Yab. Dil. Öğr. Gör. Sonuç'!B35,3)&REPT(\"*\",4)&RIGHT('Yab. Dil. Öğr. Gör. Sonuç'!B35,2))","v":""},{"$f":"IF('Yab. Dil. Öğr. Gör. Sonuç'!C35=\"\",\"\",IF(ISERR(FIND(\" \",'Yab. Dil. Öğr. Gör. Sonuç'!C35))=TRUE,LEFT('Yab. Dil. Öğr. Gör. Sonuç'!C35,2)&REPT(\"*\",3),LEFT('Yab. Dil. Öğr. Gör. Sonuç'!C35,2)&REPT(\"*\",3)&\" \"&MID('Yab. Dil. Öğr. Gör. Sonuç'!C35,FIND(\" \",'Yab. Dil. Öğr. Gör. Sonuç'!C35)+1,2)&REPT(\"*\",3)))","v":""},{"$f":"IF('Yab. Dil. Öğr. Gör. Sonuç'!D35=\"\",\"\",IF(ISERR(FIND(\" \",'Yab. Dil. Öğr. Gör. Sonuç'!D35))=TRUE,LEFT('Yab. Dil. Öğr. Gör. Sonuç'!D35,2)&REPT(\"*\",3),LEFT('Yab. Dil. Öğr. Gör. Sonuç'!D35,2)&REPT(\"*\",3)&\" \"&MID('Yab. Dil. Öğr. Gör. Sonuç'!D35,FIND(\" \",'Yab. Dil. Öğr. Gör. Sonuç'!D35)+1,2)&REPT(\"*\",3)))","v":""},{"$f":"IF('Yab. Dil. Öğr. Gör. Sonuç'!E35=\"\",\"\",'Yab. Dil. Öğr. Gör. Sonuç'!E35)","v":""},{"$f":"IF('Yab. Dil. Öğr. Gör. Sonuç'!F35=\"\",\"\",'Yab. Dil. Öğr. Gör. Sonuç'!F35)","v":""},{"$f":"IF('Yab. Dil. Öğr. Gör. Sonuç'!G35=\"\",\"\",'Yab. Dil. Öğr. Gör. Sonuç'!G35)","v":""},{"$f":"IF('Yab. Dil. Öğr. Gör. Sonuç'!H35=\"\",\"\",'Yab. Dil. Öğr. Gör. Sonuç'!H35)","v":""},{"$f":"IF('Yab. Dil. Öğr. Gör. Sonuç'!I35=\"\",\"\",'Yab. Dil. Öğr. Gör. Sonuç'!I35)","v":""},{"$f":"IF('Yab. Dil. Öğr. Gör. Sonuç'!J35=\"\",\"\",'Yab. Dil. Öğr. Gör. Sonuç'!J35)","v":""},{"$f":"IF('Yab. Dil. Öğr. Gör. Sonuç'!K35=\"\",\"\",'Yab. Dil. Öğr. Gör. Sonuç'!K35)","v":""},{"$f":"IF('Yab. Dil. Öğr. Gör. Sonuç'!L35=\"\",\"\",'Yab. Dil. Öğr. Gör. Sonuç'!L35)","v":""},{"$f":"IF('Yab. Dil. Öğr. Gör. Sonuç'!M35=\"\",\"\",'Yab. Dil. Öğr. Gör. Sonuç'!M35)","v":""},{"$f":"IF('Yab. Dil. Öğr. Gör. Sonuç'!N35=\"\",\"\",'Yab. Dil. Öğr. Gör. Sonuç'!N35)","v":""}]
[{"$f":"IF('Yab. Dil. Öğr. Gör. Sonuç'!A36=\"\",\"\",'Yab. Dil. Öğr. Gör. Sonuç'!A36)","v":""},{"$f":"IF('Yab. Dil. Öğr. Gör. Sonuç'!B36=\"\",\"\",LEFT('Yab. Dil. Öğr. Gör. Sonuç'!B36,3)&REPT(\"*\",4)&RIGHT('Yab. Dil. Öğr. Gör. Sonuç'!B36,2))","v":""},{"$f":"IF('Yab. Dil. Öğr. Gör. Sonuç'!C36=\"\",\"\",IF(ISERR(FIND(\" \",'Yab. Dil. Öğr. Gör. Sonuç'!C36))=TRUE,LEFT('Yab. Dil. Öğr. Gör. Sonuç'!C36,2)&REPT(\"*\",3),LEFT('Yab. Dil. Öğr. Gör. Sonuç'!C36,2)&REPT(\"*\",3)&\" \"&MID('Yab. Dil. Öğr. Gör. Sonuç'!C36,FIND(\" \",'Yab. Dil. Öğr. Gör. Sonuç'!C36)+1,2)&REPT(\"*\",3)))","v":""},{"$f":"IF('Yab. Dil. Öğr. Gör. Sonuç'!D36=\"\",\"\",IF(ISERR(FIND(\" \",'Yab. Dil. Öğr. Gör. Sonuç'!D36))=TRUE,LEFT('Yab. Dil. Öğr. Gör. Sonuç'!D36,2)&REPT(\"*\",3),LEFT('Yab. Dil. Öğr. Gör. Sonuç'!D36,2)&REPT(\"*\",3)&\" \"&MID('Yab. Dil. Öğr. Gör. Sonuç'!D36,FIND(\" \",'Yab. Dil. Öğr. Gör. Sonuç'!D36)+1,2)&REPT(\"*\",3)))","v":""},{"$f":"IF('Yab. Dil. Öğr. Gör. Sonuç'!E36=\"\",\"\",'Yab. Dil. Öğr. Gör. Sonuç'!E36)","v":""},{"$f":"IF('Yab. Dil. Öğr. Gör. Sonuç'!F36=\"\",\"\",'Yab. Dil. Öğr. Gör. Sonuç'!F36)","v":""},{"$f":"IF('Yab. Dil. Öğr. Gör. Sonuç'!G36=\"\",\"\",'Yab. Dil. Öğr. Gör. Sonuç'!G36)","v":""},{"$f":"IF('Yab. Dil. Öğr. Gör. Sonuç'!H36=\"\",\"\",'Yab. Dil. Öğr. Gör. Sonuç'!H36)","v":""},{"$f":"IF('Yab. Dil. Öğr. Gör. Sonuç'!I36=\"\",\"\",'Yab. Dil. Öğr. Gör. Sonuç'!I36)","v":""},{"$f":"IF('Yab. Dil. Öğr. Gör. Sonuç'!J36=\"\",\"\",'Yab. Dil. Öğr. Gör. Sonuç'!J36)","v":""},{"$f":"IF('Yab. Dil. Öğr. Gör. Sonuç'!K36=\"\",\"\",'Yab. Dil. Öğr. Gör. Sonuç'!K36)","v":""},{"$f":"IF('Yab. Dil. Öğr. Gör. Sonuç'!L36=\"\",\"\",'Yab. Dil. Öğr. Gör. Sonuç'!L36)","v":""},{"$f":"IF('Yab. Dil. Öğr. Gör. Sonuç'!M36=\"\",\"\",'Yab. Dil. Öğr. Gör. Sonuç'!M36)","v":""},{"$f":"IF('Yab. Dil. Öğr. Gör. Sonuç'!N36=\"\",\"\",'Yab. Dil. Öğr. Gör. Sonuç'!N36)","v":""}]
[{"$f":"IF('Yab. Dil. Öğr. Gör. Sonuç'!A37=\"\",\"\",'Yab. Dil. Öğr. Gör. Sonuç'!A37)","v":""},{"$f":"IF('Yab. Dil. Öğr. Gör. Sonuç'!B37=\"\",\"\",LEFT('Yab. Dil. Öğr. Gör. Sonuç'!B37,3)&REPT(\"*\",4)&RIGHT('Yab. Dil. Öğr. Gör. Sonuç'!B37,2))","v":""},{"$f":"IF('Yab. Dil. Öğr. Gör. Sonuç'!C37=\"\",\"\",IF(ISERR(FIND(\" \",'Yab. Dil. Öğr. Gör. Sonuç'!C37))=TRUE,LEFT('Yab. Dil. Öğr. Gör. Sonuç'!C37,2)&REPT(\"*\",3),LEFT('Yab. Dil. Öğr. Gör. Sonuç'!C37,2)&REPT(\"*\",3)&\" \"&MID('Yab. Dil. Öğr. Gör. Sonuç'!C37,FIND(\" \",'Yab. Dil. Öğr. Gör. Sonuç'!C37)+1,2)&REPT(\"*\",3)))","v":""},{"$f":"IF('Yab. Dil. Öğr. Gör. Sonuç'!D37=\"\",\"\",IF(ISERR(FIND(\" \",'Yab. Dil. Öğr. Gör. Sonuç'!D37))=TRUE,LEFT('Yab. Dil. Öğr. Gör. Sonuç'!D37,2)&REPT(\"*\",3),LEFT('Yab. Dil. Öğr. Gör. Sonuç'!D37,2)&REPT(\"*\",3)&\" \"&MID('Yab. Dil. Öğr. Gör. Sonuç'!D37,FIND(\" \",'Yab. Dil. Öğr. Gör. Sonuç'!D37)+1,2)&REPT(\"*\",3)))","v":""},{"$f":"IF('Yab. Dil. Öğr. Gör. Sonuç'!E37=\"\",\"\",'Yab. Dil. Öğr. Gör. Sonuç'!E37)","v":""},{"$f":"IF('Yab. Dil. Öğr. Gör. Sonuç'!F37=\"\",\"\",'Yab. Dil. Öğr. Gör. Sonuç'!F37)","v":""},{"$f":"IF('Yab. Dil. Öğr. Gör. Sonuç'!G37=\"\",\"\",'Yab. Dil. Öğr. Gör. Sonuç'!G37)","v":""},{"$f":"IF('Yab. Dil. Öğr. Gör. Sonuç'!H37=\"\",\"\",'Yab. Dil. Öğr. Gör. Sonuç'!H37)","v":""},{"$f":"IF('Yab. Dil. Öğr. Gör. Sonuç'!I37=\"\",\"\",'Yab. Dil. Öğr. Gör. Sonuç'!I37)","v":""},{"$f":"IF('Yab. Dil. Öğr. Gör. Sonuç'!J37=\"\",\"\",'Yab. Dil. Öğr. Gör. Sonuç'!J37)","v":""},{"$f":"IF('Yab. Dil. Öğr. Gör. Sonuç'!K37=\"\",\"\",'Yab. Dil. Öğr. Gör. Sonuç'!K37)","v":""},{"$f":"IF('Yab. Dil. Öğr. Gör. Sonuç'!L37=\"\",\"\",'Yab. Dil. Öğr. Gör. Sonuç'!L37)","v":""},{"$f":"IF('Yab. Dil. Öğr. Gör. Sonuç'!M37=\"\",\"\",'Yab. Dil. Öğr. Gör. Sonuç'!M37)","v":""},{"$f":"IF('Yab. Dil. Öğr. Gör. Sonuç'!N37=\"\",\"\",'Yab. Dil. Öğr. Gör. Sonuç'!N37)","v":""}]
[{"$f":"IF('Yab. Dil. Öğr. Gör. Sonuç'!A38=\"\",\"\",'Yab. Dil. Öğr. Gör. Sonuç'!A38)","v":""},{"$f":"IF('Yab. Dil. Öğr. Gör. Sonuç'!B38=\"\",\"\",LEFT('Yab. Dil. Öğr. Gör. Sonuç'!B38,3)&REPT(\"*\",4)&RIGHT('Yab. Dil. Öğr. Gör. Sonuç'!B38,2))","v":""},{"$f":"IF('Yab. Dil. Öğr. Gör. Sonuç'!C38=\"\",\"\",IF(ISERR(FIND(\" \",'Yab. Dil. Öğr. Gör. Sonuç'!C38))=TRUE,LEFT('Yab. Dil. Öğr. Gör. Sonuç'!C38,2)&REPT(\"*\",3),LEFT('Yab. Dil. Öğr. Gör. Sonuç'!C38,2)&REPT(\"*\",3)&\" \"&MID('Yab. Dil. Öğr. Gör. Sonuç'!C38,FIND(\" \",'Yab. Dil. Öğr. Gör. Sonuç'!C38)+1,2)&REPT(\"*\",3)))","v":""},{"$f":"IF('Yab. Dil. Öğr. Gör. Sonuç'!D38=\"\",\"\",IF(ISERR(FIND(\" \",'Yab. Dil. Öğr. Gör. Sonuç'!D38))=TRUE,LEFT('Yab. Dil. Öğr. Gör. Sonuç'!D38,2)&REPT(\"*\",3),LEFT('Yab. Dil. Öğr. Gör. Sonuç'!D38,2)&REPT(\"*\",3)&\" \"&MID('Yab. Dil. Öğr. Gör. Sonuç'!D38,FIND(\" \",'Yab. Dil. Öğr. Gör. Sonuç'!D38)+1,2)&REPT(\"*\",3)))","v":""},{"$f":"IF('Yab. Dil. Öğr. Gör. Sonuç'!E38=\"\",\"\",'Yab. Dil. Öğr. Gör. Sonuç'!E38)","v":""},{"$f":"IF('Yab. Dil. Öğr. Gör. Sonuç'!F38=\"\",\"\",'Yab. Dil. Öğr. Gör. Sonuç'!F38)","v":""},{"$f":"IF('Yab. Dil. Öğr. Gör. Sonuç'!G38=\"\",\"\",'Yab. Dil. Öğr. Gör. Sonuç'!G38)","v":""},{"$f":"IF('Yab. Dil. Öğr. Gör. Sonuç'!H38=\"\",\"\",'Yab. Dil. Öğr. Gör. Sonuç'!H38)","v":""},{"$f":"IF('Yab. Dil. Öğr. Gör. Sonuç'!I38=\"\",\"\",'Yab. Dil. Öğr. Gör. Sonuç'!I38)","v":""},{"$f":"IF('Yab. Dil. Öğr. Gör. Sonuç'!J38=\"\",\"\",'Yab. Dil. Öğr. Gör. Sonuç'!J38)","v":""},{"$f":"IF('Yab. Dil. Öğr. Gör. Sonuç'!K38=\"\",\"\",'Yab. Dil. Öğr. Gör. Sonuç'!K38)","v":""},{"$f":"IF('Yab. Dil. Öğr. Gör. Sonuç'!L38=\"\",\"\",'Yab. Dil. Öğr. Gör. Sonuç'!L38)","v":""},{"$f":"IF('Yab. Dil. Öğr. Gör. Sonuç'!M38=\"\",\"\",'Yab. Dil. Öğr. Gör. Sonuç'!M38)","v":""},{"$f":"IF('Yab. Dil. Öğr. Gör. Sonuç'!N38=\"\",\"\",'Yab. Dil. Öğr. Gör. Sonuç'!N38)","v":""}]
[{"$f":"IF('Yab. Dil. Öğr. Gör. Sonuç'!A39=\"\",\"\",'Yab. Dil. Öğr. Gör. Sonuç'!A39)","v":""},{"$f":"IF('Yab. Dil. Öğr. Gör. Sonuç'!B39=\"\",\"\",LEFT('Yab. Dil. Öğr. Gör. Sonuç'!B39,3)&REPT(\"*\",4)&RIGHT('Yab. Dil. Öğr. Gör. Sonuç'!B39,2))","v":""},{"$f":"IF('Yab. Dil. Öğr. Gör. Sonuç'!C39=\"\",\"\",IF(ISERR(FIND(\" \",'Yab. Dil. Öğr. Gör. Sonuç'!C39))=TRUE,LEFT('Yab. Dil. Öğr. Gör. Sonuç'!C39,2)&REPT(\"*\",3),LEFT('Yab. Dil. Öğr. Gör. Sonuç'!C39,2)&REPT(\"*\",3)&\" \"&MID('Yab. Dil. Öğr. Gör. Sonuç'!C39,FIND(\" \",'Yab. Dil. Öğr. Gör. Sonuç'!C39)+1,2)&REPT(\"*\",3)))","v":""},{"$f":"IF('Yab. Dil. Öğr. Gör. Sonuç'!D39=\"\",\"\",IF(ISERR(FIND(\" \",'Yab. Dil. Öğr. Gör. Sonuç'!D39))=TRUE,LEFT('Yab. Dil. Öğr. Gör. Sonuç'!D39,2)&REPT(\"*\",3),LEFT('Yab. Dil. Öğr. Gör. Sonuç'!D39,2)&REPT(\"*\",3)&\" \"&MID('Yab. Dil. Öğr. Gör. Sonuç'!D39,FIND(\" \",'Yab. Dil. Öğr. Gör. Sonuç'!D39)+1,2)&REPT(\"*\",3)))","v":""},{"$f":"IF('Yab. Dil. Öğr. Gör. Sonuç'!E39=\"\",\"\",'Yab. Dil. Öğr. Gör. Sonuç'!E39)","v":""},{"$f":"IF('Yab. Dil. Öğr. Gör. Sonuç'!F39=\"\",\"\",'Yab. Dil. Öğr. Gör. Sonuç'!F39)","v":""},{"$f":"IF('Yab. Dil. Öğr. Gör. Sonuç'!G39=\"\",\"\",'Yab. Dil. Öğr. Gör. Sonuç'!G39)","v":""},{"$f":"IF('Yab. Dil. Öğr. Gör. Sonuç'!H39=\"\",\"\",'Yab. Dil. Öğr. Gör. Sonuç'!H39)","v":""},{"$f":"IF('Yab. Dil. Öğr. Gör. Sonuç'!I39=\"\",\"\",'Yab. Dil. Öğr. Gör. Sonuç'!I39)","v":""},{"$f":"IF('Yab. Dil. Öğr. Gör. Sonuç'!J39=\"\",\"\",'Yab. Dil. Öğr. Gör. Sonuç'!J39)","v":""},{"$f":"IF('Yab. Dil. Öğr. Gör. Sonuç'!K39=\"\",\"\",'Yab. Dil. Öğr. Gör. Sonuç'!K39)","v":""},{"$f":"IF('Yab. Dil. Öğr. Gör. Sonuç'!L39=\"\",\"\",'Yab. Dil. Öğr. Gör. Sonuç'!L39)","v":""},{"$f":"IF('Yab. Dil. Öğr. Gör. Sonuç'!M39=\"\",\"\",'Yab. Dil. Öğr. Gör. Sonuç'!M39)","v":""},{"$f":"IF('Yab. Dil. Öğr. Gör. Sonuç'!N39=\"\",\"\",'Yab. Dil. Öğr. Gör. Sonuç'!N39)","v":""}]
[{"$f":"IF('Yab. Dil. Öğr. Gör. Sonuç'!A40=\"\",\"\",'Yab. Dil. Öğr. Gör. Sonuç'!A40)","v":""},{"$f":"IF('Yab. Dil. Öğr. Gör. Sonuç'!B40=\"\",\"\",LEFT('Yab. Dil. Öğr. Gör. Sonuç'!B40,3)&REPT(\"*\",4)&RIGHT('Yab. Dil. Öğr. Gör. Sonuç'!B40,2))","v":""},{"$f":"IF('Yab. Dil. Öğr. Gör. Sonuç'!C40=\"\",\"\",IF(ISERR(FIND(\" \",'Yab. Dil. Öğr. Gör. Sonuç'!C40))=TRUE,LEFT('Yab. Dil. Öğr. Gör. Sonuç'!C40,2)&REPT(\"*\",3),LEFT('Yab. Dil. Öğr. Gör. Sonuç'!C40,2)&REPT(\"*\",3)&\" \"&MID('Yab. Dil. Öğr. Gör. Sonuç'!C40,FIND(\" \",'Yab. Dil. Öğr. Gör. Sonuç'!C40)+1,2)&REPT(\"*\",3)))","v":""},{"$f":"IF('Yab. Dil. Öğr. Gör. Sonuç'!D40=\"\",\"\",IF(ISERR(FIND(\" \",'Yab. Dil. Öğr. Gör. Sonuç'!D40))=TRUE,LEFT('Yab. Dil. Öğr. Gör. Sonuç'!D40,2)&REPT(\"*\",3),LEFT('Yab. Dil. Öğr. Gör. Sonuç'!D40,2)&REPT(\"*\",3)&\" \"&MID('Yab. Dil. Öğr. Gör. Sonuç'!D40,FIND(\" \",'Yab. Dil. Öğr. Gör. Sonuç'!D40)+1,2)&REPT(\"*\",3)))","v":""},{"$f":"IF('Yab. Dil. Öğr. Gör. Sonuç'!E40=\"\",\"\",'Yab. Dil. Öğr. Gör. Sonuç'!E40)","v":""},{"$f":"IF('Yab. Dil. Öğr. Gör. Sonuç'!F40=\"\",\"\",'Yab. Dil. Öğr. Gör. Sonuç'!F40)","v":""},{"$f":"IF('Yab. Dil. Öğr. Gör. Sonuç'!G40=\"\",\"\",'Yab. Dil. Öğr. Gör. Sonuç'!G40)","v":""},{"$f":"IF('Yab. Dil. Öğr. Gör. Sonuç'!H40=\"\",\"\",'Yab. Dil. Öğr. Gör. Sonuç'!H40)","v":""},{"$f":"IF('Yab. Dil. Öğr. Gör. Sonuç'!I40=\"\",\"\",'Yab. Dil. Öğr. Gör. Sonuç'!I40)","v":""},{"$f":"IF('Yab. Dil. Öğr. Gör. Sonuç'!J40=\"\",\"\",'Yab. Dil. Öğr. Gör. Sonuç'!J40)","v":""},{"$f":"IF('Yab. Dil. Öğr. Gör. Sonuç'!K40=\"\",\"\",'Yab. Dil. Öğr. Gör. Sonuç'!K40)","v":""},{"$f":"IF('Yab. Dil. Öğr. Gör. Sonuç'!L40=\"\",\"\",'Yab. Dil. Öğr. Gör. Sonuç'!L40)","v":""},{"$f":"IF('Yab. Dil. Öğr. Gör. Sonuç'!M40=\"\",\"\",'Yab. Dil. Öğr. Gör. Sonuç'!M40)","v":""},{"$f":"IF('Yab. Dil. Öğr. Gör. Sonuç'!N40=\"\",\"\",'Yab. Dil. Öğr. Gör. Sonuç'!N40)","v":""}]
[{"$f":"IF('Yab. Dil. Öğr. Gör. Sonuç'!A41=\"\",\"\",'Yab. Dil. Öğr. Gör. Sonuç'!A41)","v":""},{"$f":"IF('Yab. Dil. Öğr. Gör. Sonuç'!B41=\"\",\"\",LEFT('Yab. Dil. Öğr. Gör. Sonuç'!B41,3)&REPT(\"*\",4)&RIGHT('Yab. Dil. Öğr. Gör. Sonuç'!B41,2))","v":""},{"$f":"IF('Yab. Dil. Öğr. Gör. Sonuç'!C41=\"\",\"\",IF(ISERR(FIND(\" \",'Yab. Dil. Öğr. Gör. Sonuç'!C41))=TRUE,LEFT('Yab. Dil. Öğr. Gör. Sonuç'!C41,2)&REPT(\"*\",3),LEFT('Yab. Dil. Öğr. Gör. Sonuç'!C41,2)&REPT(\"*\",3)&\" \"&MID('Yab. Dil. Öğr. Gör. Sonuç'!C41,FIND(\" \",'Yab. Dil. Öğr. Gör. Sonuç'!C41)+1,2)&REPT(\"*\",3)))","v":""},{"$f":"IF('Yab. Dil. Öğr. Gör. Sonuç'!D41=\"\",\"\",IF(ISERR(FIND(\" \",'Yab. Dil. Öğr. Gör. Sonuç'!D41))=TRUE,LEFT('Yab. Dil. Öğr. Gör. Sonuç'!D41,2)&REPT(\"*\",3),LEFT('Yab. Dil. Öğr. Gör. Sonuç'!D41,2)&REPT(\"*\",3)&\" \"&MID('Yab. Dil. Öğr. Gör. Sonuç'!D41,FIND(\" \",'Yab. Dil. Öğr. Gör. Sonuç'!D41)+1,2)&REPT(\"*\",3)))","v":""},{"$f":"IF('Yab. Dil. Öğr. Gör. Sonuç'!E41=\"\",\"\",'Yab. Dil. Öğr. Gör. Sonuç'!E41)","v":""},{"$f":"IF('Yab. Dil. Öğr. Gör. Sonuç'!F41=\"\",\"\",'Yab. Dil. Öğr. Gör. Sonuç'!F41)","v":""},{"$f":"IF('Yab. Dil. Öğr. Gör. Sonuç'!G41=\"\",\"\",'Yab. Dil. Öğr. Gör. Sonuç'!G41)","v":""},{"$f":"IF('Yab. Dil. Öğr. Gör. Sonuç'!H41=\"\",\"\",'Yab. Dil. Öğr. Gör. Sonuç'!H41)","v":""},{"$f":"IF('Yab. Dil. Öğr. Gör. Sonuç'!I41=\"\",\"\",'Yab. Dil. Öğr. Gör. Sonuç'!I41)","v":""},{"$f":"IF('Yab. Dil. Öğr. Gör. Sonuç'!J41=\"\",\"\",'Yab. Dil. Öğr. Gör. Sonuç'!J41)","v":""},{"$f":"IF('Yab. Dil. Öğr. Gör. Sonuç'!K41=\"\",\"\",'Yab. Dil. Öğr. Gör. Sonuç'!K41)","v":""},{"$f":"IF('Yab. Dil. Öğr. Gör. Sonuç'!L41=\"\",\"\",'Yab. Dil. Öğr. Gör. Sonuç'!L41)","v":""},{"$f":"IF('Yab. Dil. Öğr. Gör. Sonuç'!M41=\"\",\"\",'Yab. Dil. Öğr. Gör. Sonuç'!M41)","v":""},{"$f":"IF('Yab. Dil. Öğr. Gör. Sonuç'!N41=\"\",\"\",'Yab. Dil. Öğr. Gör. Sonuç'!N41)","v":""}]
[{"$f":"IF('Yab. Dil. Öğr. Gör. Sonuç'!A42=\"\",\"\",'Yab. Dil. Öğr. Gör. Sonuç'!A42)","v":""},{"$f":"IF('Yab. Dil. Öğr. Gör. Sonuç'!B42=\"\",\"\",LEFT('Yab. Dil. Öğr. Gör. Sonuç'!B42,3)&REPT(\"*\",4)&RIGHT('Yab. Dil. Öğr. Gör. Sonuç'!B42,2))","v":""},{"$f":"IF('Yab. Dil. Öğr. Gör. Sonuç'!C42=\"\",\"\",IF(ISERR(FIND(\" \",'Yab. Dil. Öğr. Gör. Sonuç'!C42))=TRUE,LEFT('Yab. Dil. Öğr. Gör. Sonuç'!C42,2)&REPT(\"*\",3),LEFT('Yab. Dil. Öğr. Gör. Sonuç'!C42,2)&REPT(\"*\",3)&\" \"&MID('Yab. Dil. Öğr. Gör. Sonuç'!C42,FIND(\" \",'Yab. Dil. Öğr. Gör. Sonuç'!C42)+1,2)&REPT(\"*\",3)))","v":""},{"$f":"IF('Yab. Dil. Öğr. Gör. Sonuç'!D42=\"\",\"\",IF(ISERR(FIND(\" \",'Yab. Dil. Öğr. Gör. Sonuç'!D42))=TRUE,LEFT('Yab. Dil. Öğr. Gör. Sonuç'!D42,2)&REPT(\"*\",3),LEFT('Yab. Dil. Öğr. Gör. Sonuç'!D42,2)&REPT(\"*\",3)&\" \"&MID('Yab. Dil. Öğr. Gör. Sonuç'!D42,FIND(\" \",'Yab. Dil. Öğr. Gör. Sonuç'!D42)+1,2)&REPT(\"*\",3)))","v":""},{"$f":"IF('Yab. Dil. Öğr. Gör. Sonuç'!E42=\"\",\"\",'Yab. Dil. Öğr. Gör. Sonuç'!E42)","v":""},{"$f":"IF('Yab. Dil. Öğr. Gör. Sonuç'!F42=\"\",\"\",'Yab. Dil. Öğr. Gör. Sonuç'!F42)","v":""},{"$f":"IF('Yab. Dil. Öğr. Gör. Sonuç'!G42=\"\",\"\",'Yab. Dil. Öğr. Gör. Sonuç'!G42)","v":""},{"$f":"IF('Yab. Dil. Öğr. Gör. Sonuç'!H42=\"\",\"\",'Yab. Dil. Öğr. Gör. Sonuç'!H42)","v":""},{"$f":"IF('Yab. Dil. Öğr. Gör. Sonuç'!I42=\"\",\"\",'Yab. Dil. Öğr. Gör. Sonuç'!I42)","v":""},{"$f":"IF('Yab. Dil. Öğr. Gör. Sonuç'!J42=\"\",\"\",'Yab. Dil. Öğr. Gör. Sonuç'!J42)","v":""},{"$f":"IF('Yab. Dil. Öğr. Gör. Sonuç'!K42=\"\",\"\",'Yab. Dil. Öğr. Gör. Sonuç'!K42)","v":""},{"$f":"IF('Yab. Dil. Öğr. Gör. Sonuç'!L42=\"\",\"\",'Yab. Dil. Öğr. Gör. Sonuç'!L42)","v":""},{"$f":"IF('Yab. Dil. Öğr. Gör. Sonuç'!M42=\"\",\"\",'Yab. Dil. Öğr. Gör. Sonuç'!M42)","v":""},{"$f":"IF('Yab. Dil. Öğr. Gör. Sonuç'!N42=\"\",\"\",'Yab. Dil. Öğr. Gör. Sonuç'!N42)","v":""}]
[{"$f":"IF('Yab. Dil. Öğr. Gör. Sonuç'!A43=\"\",\"\",'Yab. Dil. Öğr. Gör. Sonuç'!A43)","v":""},{"$f":"IF('Yab. Dil. Öğr. Gör. Sonuç'!B43=\"\",\"\",LEFT('Yab. Dil. Öğr. Gör. Sonuç'!B43,3)&REPT(\"*\",4)&RIGHT('Yab. Dil. Öğr. Gör. Sonuç'!B43,2))","v":""},{"$f":"IF('Yab. Dil. Öğr. Gör. Sonuç'!C43=\"\",\"\",IF(ISERR(FIND(\" \",'Yab. Dil. Öğr. Gör. Sonuç'!C43))=TRUE,LEFT('Yab. Dil. Öğr. Gör. Sonuç'!C43,2)&REPT(\"*\",3),LEFT('Yab. Dil. Öğr. Gör. Sonuç'!C43,2)&REPT(\"*\",3)&\" \"&MID('Yab. Dil. Öğr. Gör. Sonuç'!C43,FIND(\" \",'Yab. Dil. Öğr. Gör. Sonuç'!C43)+1,2)&REPT(\"*\",3)))","v":""},{"$f":"IF('Yab. Dil. Öğr. Gör. Sonuç'!D43=\"\",\"\",IF(ISERR(FIND(\" \",'Yab. Dil. Öğr. Gör. Sonuç'!D43))=TRUE,LEFT('Yab. Dil. Öğr. Gör. Sonuç'!D43,2)&REPT(\"*\",3),LEFT('Yab. Dil. Öğr. Gör. Sonuç'!D43,2)&REPT(\"*\",3)&\" \"&MID('Yab. Dil. Öğr. Gör. Sonuç'!D43,FIND(\" \",'Yab. Dil. Öğr. Gör. Sonuç'!D43)+1,2)&REPT(\"*\",3)))","v":""},{"$f":"IF('Yab. Dil. Öğr. Gör. Sonuç'!E43=\"\",\"\",'Yab. Dil. Öğr. Gör. Sonuç'!E43)","v":""},{"$f":"IF('Yab. Dil. Öğr. Gör. Sonuç'!F43=\"\",\"\",'Yab. Dil. Öğr. Gör. Sonuç'!F43)","v":""},{"$f":"IF('Yab. Dil. Öğr. Gör. Sonuç'!G43=\"\",\"\",'Yab. Dil. Öğr. Gör. Sonuç'!G43)","v":""},{"$f":"IF('Yab. Dil. Öğr. Gör. Sonuç'!H43=\"\",\"\",'Yab. Dil. Öğr. Gör. Sonuç'!H43)","v":""},{"$f":"IF('Yab. Dil. Öğr. Gör. Sonuç'!I43=\"\",\"\",'Yab. Dil. Öğr. Gör. Sonuç'!I43)","v":""},{"$f":"IF('Yab. Dil. Öğr. Gör. Sonuç'!J43=\"\",\"\",'Yab. Dil. Öğr. Gör. Sonuç'!J43)","v":""},{"$f":"IF('Yab. Dil. Öğr. Gör. Sonuç'!K43=\"\",\"\",'Yab. Dil. Öğr. Gör. Sonuç'!K43)","v":""},{"$f":"IF('Yab. Dil. Öğr. Gör. Sonuç'!L43=\"\",\"\",'Yab. Dil. Öğr. Gör. Sonuç'!L43)","v":""},{"$f":"IF('Yab. Dil. Öğr. Gör. Sonuç'!M43=\"\",\"\",'Yab. Dil. Öğr. Gör. Sonuç'!M43)","v":""},{"$f":"IF('Yab. Dil. Öğr. Gör. Sonuç'!N43=\"\",\"\",'Yab. Dil. Öğr. Gör. Sonuç'!N43)","v":""}]
[{"$f":"IF('Yab. Dil. Öğr. Gör. Sonuç'!A44=\"\",\"\",'Yab. Dil. Öğr. Gör. Sonuç'!A44)","v":""},{"$f":"IF('Yab. Dil. Öğr. Gör. Sonuç'!B44=\"\",\"\",LEFT('Yab. Dil. Öğr. Gör. Sonuç'!B44,3)&REPT(\"*\",4)&RIGHT('Yab. Dil. Öğr. Gör. Sonuç'!B44,2))","v":""},{"$f":"IF('Yab. Dil. Öğr. Gör. Sonuç'!C44=\"\",\"\",IF(ISERR(FIND(\" \",'Yab. Dil. Öğr. Gör. Sonuç'!C44))=TRUE,LEFT('Yab. Dil. Öğr. Gör. Sonuç'!C44,2)&REPT(\"*\",3),LEFT('Yab. Dil. Öğr. Gör. Sonuç'!C44,2)&REPT(\"*\",3)&\" \"&MID('Yab. Dil. Öğr. Gör. Sonuç'!C44,FIND(\" \",'Yab. Dil. Öğr. Gör. Sonuç'!C44)+1,2)&REPT(\"*\",3)))","v":""},{"$f":"IF('Yab. Dil. Öğr. Gör. Sonuç'!D44=\"\",\"\",IF(ISERR(FIND(\" \",'Yab. Dil. Öğr. Gör. Sonuç'!D44))=TRUE,LEFT('Yab. Dil. Öğr. Gör. Sonuç'!D44,2)&REPT(\"*\",3),LEFT('Yab. Dil. Öğr. Gör. Sonuç'!D44,2)&REPT(\"*\",3)&\" \"&MID('Yab. Dil. Öğr. Gör. Sonuç'!D44,FIND(\" \",'Yab. Dil. Öğr. Gör. Sonuç'!D44)+1,2)&REPT(\"*\",3)))","v":""},{"$f":"IF('Yab. Dil. Öğr. Gör. Sonuç'!E44=\"\",\"\",'Yab. Dil. Öğr. Gör. Sonuç'!E44)","v":""},{"$f":"IF('Yab. Dil. Öğr. Gör. Sonuç'!F44=\"\",\"\",'Yab. Dil. Öğr. Gör. Sonuç'!F44)","v":""},{"$f":"IF('Yab. Dil. Öğr. Gör. Sonuç'!G44=\"\",\"\",'Yab. Dil. Öğr. Gör. Sonuç'!G44)","v":""},{"$f":"IF('Yab. Dil. Öğr. Gör. Sonuç'!H44=\"\",\"\",'Yab. Dil. Öğr. Gör. Sonuç'!H44)","v":""},{"$f":"IF('Yab. Dil. Öğr. Gör. Sonuç'!I44=\"\",\"\",'Yab. Dil. Öğr. Gör. Sonuç'!I44)","v":""},{"$f":"IF('Yab. Dil. Öğr. Gör. Sonuç'!J44=\"\",\"\",'Yab. Dil. Öğr. Gör. Sonuç'!J44)","v":""},{"$f":"IF('Yab. Dil. Öğr. Gör. Sonuç'!K44=\"\",\"\",'Yab. Dil. Öğr. Gör. Sonuç'!K44)","v":""},{"$f":"IF('Yab. Dil. Öğr. Gör. Sonuç'!L44=\"\",\"\",'Yab. Dil. Öğr. Gör. Sonuç'!L44)","v":""},{"$f":"IF('Yab. Dil. Öğr. Gör. Sonuç'!M44=\"\",\"\",'Yab. Dil. Öğr. Gör. Sonuç'!M44)","v":""},{"$f":"IF('Yab. Dil. Öğr. Gör. Sonuç'!N44=\"\",\"\",'Yab. Dil. Öğr. Gör. Sonuç'!N44)","v":""}]
[{"$f":"IF('Yab. Dil. Öğr. Gör. Sonuç'!A45=\"\",\"\",'Yab. Dil. Öğr. Gör. Sonuç'!A45)","v":""},{"$f":"IF('Yab. Dil. Öğr. Gör. Sonuç'!B45=\"\",\"\",LEFT('Yab. Dil. Öğr. Gör. Sonuç'!B45,3)&REPT(\"*\",4)&RIGHT('Yab. Dil. Öğr. Gör. Sonuç'!B45,2))","v":""},{"$f":"IF('Yab. Dil. Öğr. Gör. Sonuç'!C45=\"\",\"\",IF(ISERR(FIND(\" \",'Yab. Dil. Öğr. Gör. Sonuç'!C45))=TRUE,LEFT('Yab. Dil. Öğr. Gör. Sonuç'!C45,2)&REPT(\"*\",3),LEFT('Yab. Dil. Öğr. Gör. Sonuç'!C45,2)&REPT(\"*\",3)&\" \"&MID('Yab. Dil. Öğr. Gör. Sonuç'!C45,FIND(\" \",'Yab. Dil. Öğr. Gör. Sonuç'!C45)+1,2)&REPT(\"*\",3)))","v":""},{"$f":"IF('Yab. Dil. Öğr. Gör. Sonuç'!D45=\"\",\"\",IF(ISERR(FIND(\" \",'Yab. Dil. Öğr. Gör. Sonuç'!D45))=TRUE,LEFT('Yab. Dil. Öğr. Gör. Sonuç'!D45,2)&REPT(\"*\",3),LEFT('Yab. Dil. Öğr. Gör. Sonuç'!D45,2)&REPT(\"*\",3)&\" \"&MID('Yab. Dil. Öğr. Gör. Sonuç'!D45,FIND(\" \",'Yab. Dil. Öğr. Gör. Sonuç'!D45)+1,2)&REPT(\"*\",3)))","v":""},{"$f":"IF('Yab. Dil. Öğr. Gör. Sonuç'!E45=\"\",\"\",'Yab. Dil. Öğr. Gör. Sonuç'!E45)","v":""},{"$f":"IF('Yab. Dil. Öğr. Gör. Sonuç'!F45=\"\",\"\",'Yab. Dil. Öğr. Gör. Sonuç'!F45)","v":""},{"$f":"IF('Yab. Dil. Öğr. Gör. Sonuç'!G45=\"\",\"\",'Yab. Dil. Öğr. Gör. Sonuç'!G45)","v":""},{"$f":"IF('Yab. Dil. Öğr. Gör. Sonuç'!H45=\"\",\"\",'Yab. Dil. Öğr. Gör. Sonuç'!H45)","v":""},{"$f":"IF('Yab. Dil. Öğr. Gör. Sonuç'!I45=\"\",\"\",'Yab. Dil. Öğr. Gör. Sonuç'!I45)","v":""},{"$f":"IF('Yab. Dil. Öğr. Gör. Sonuç'!J45=\"\",\"\",'Yab. Dil. Öğr. Gör. Sonuç'!J45)","v":""},{"$f":"IF('Yab. Dil. Öğr. Gör. Sonuç'!K45=\"\",\"\",'Yab. Dil. Öğr. Gör. Sonuç'!K45)","v":""},{"$f":"IF('Yab. Dil. Öğr. Gör. Sonuç'!L45=\"\",\"\",'Yab. Dil. Öğr. Gör. Sonuç'!L45)","v":""},{"$f":"IF('Yab. Dil. Öğr. Gör. Sonuç'!M45=\"\",\"\",'Yab. Dil. Öğr. Gör. Sonuç'!M45)","v":""},{"$f":"IF('Yab. Dil. Öğr. Gör. Sonuç'!N45=\"\",\"\",'Yab. Dil. Öğr. Gör. Sonuç'!N45)","v":""}]
[{"$f":"IF('Yab. Dil. Öğr. Gör. Sonuç'!A46=\"\",\"\",'Yab. Dil. Öğr. Gör. Sonuç'!A46)","v":""},{"$f":"IF('Yab. Dil. Öğr. Gör. Sonuç'!B46=\"\",\"\",LEFT('Yab. Dil. Öğr. Gör. Sonuç'!B46,3)&REPT(\"*\",4)&RIGHT('Yab. Dil. Öğr. Gör. Sonuç'!B46,2))","v":""},{"$f":"IF('Yab. Dil. Öğr. Gör. Sonuç'!C46=\"\",\"\",IF(ISERR(FIND(\" \",'Yab. Dil. Öğr. Gör. Sonuç'!C46))=TRUE,LEFT('Yab. Dil. Öğr. Gör. Sonuç'!C46,2)&REPT(\"*\",3),LEFT('Yab. Dil. Öğr. Gör. Sonuç'!C46,2)&REPT(\"*\",3)&\" \"&MID('Yab. Dil. Öğr. Gör. Sonuç'!C46,FIND(\" \",'Yab. Dil. Öğr. Gör. Sonuç'!C46)+1,2)&REPT(\"*\",3)))","v":""},{"$f":"IF('Yab. Dil. Öğr. Gör. Sonuç'!D46=\"\",\"\",IF(ISERR(FIND(\" \",'Yab. Dil. Öğr. Gör. Sonuç'!D46))=TRUE,LEFT('Yab. Dil. Öğr. Gör. Sonuç'!D46,2)&REPT(\"*\",3),LEFT('Yab. Dil. Öğr. Gör. Sonuç'!D46,2)&REPT(\"*\",3)&\" \"&MID('Yab. Dil. Öğr. Gör. Sonuç'!D46,FIND(\" \",'Yab. Dil. Öğr. Gör. Sonuç'!D46)+1,2)&REPT(\"*\",3)))","v":""},{"$f":"IF('Yab. Dil. Öğr. Gör. Sonuç'!E46=\"\",\"\",'Yab. Dil. Öğr. Gör. Sonuç'!E46)","v":""},{"$f":"IF('Yab. Dil. Öğr. Gör. Sonuç'!F46=\"\",\"\",'Yab. Dil. Öğr. Gör. Sonuç'!F46)","v":""},{"$f":"IF('Yab. Dil. Öğr. Gör. Sonuç'!G46=\"\",\"\",'Yab. Dil. Öğr. Gör. Sonuç'!G46)","v":""},{"$f":"IF('Yab. Dil. Öğr. Gör. Sonuç'!H46=\"\",\"\",'Yab. Dil. Öğr. Gör. Sonuç'!H46)","v":""},{"$f":"IF('Yab. Dil. Öğr. Gör. Sonuç'!I46=\"\",\"\",'Yab. Dil. Öğr. Gör. Sonuç'!I46)","v":""},{"$f":"IF('Yab. Dil. Öğr. Gör. Sonuç'!J46=\"\",\"\",'Yab. Dil. Öğr. Gör. Sonuç'!J46)","v":""},{"$f":"IF('Yab. Dil. Öğr. Gör. Sonuç'!K46=\"\",\"\",'Yab. Dil. Öğr. Gör. Sonuç'!K46)","v":""},{"$f":"IF('Yab. Dil. Öğr. Gör. Sonuç'!L46=\"\",\"\",'Yab. Dil. Öğr. Gör. Sonuç'!L46)","v":""},{"$f":"IF('Yab. Dil. Öğr. Gör. Sonuç'!M46=\"\",\"\",'Yab. Dil. Öğr. Gör. Sonuç'!M46)","v":""},{"$f":"IF('Yab. Dil. Öğr. Gör. Sonuç'!N46=\"\",\"\",'Yab. Dil. Öğr. Gör. Sonuç'!N46)","v":""}]
[{"$f":"IF('Yab. Dil. Öğr. Gör. Sonuç'!A47=\"\",\"\",'Yab. Dil. Öğr. Gör. Sonuç'!A47)","v":""},{"$f":"IF('Yab. Dil. Öğr. Gör. Sonuç'!B47=\"\",\"\",LEFT('Yab. Dil. Öğr. Gör. Sonuç'!B47,3)&REPT(\"*\",4)&RIGHT('Yab. Dil. Öğr. Gör. Sonuç'!B47,2))","v":""},{"$f":"IF('Yab. Dil. Öğr. Gör. Sonuç'!C47=\"\",\"\",IF(ISERR(FIND(\" \",'Yab. Dil. Öğr. Gör. Sonuç'!C47))=TRUE,LEFT('Yab. Dil. Öğr. Gör. Sonuç'!C47,2)&REPT(\"*\",3),LEFT('Yab. Dil. Öğr. Gör. Sonuç'!C47,2)&REPT(\"*\",3)&\" \"&MID('Yab. Dil. Öğr. Gör. Sonuç'!C47,FIND(\" \",'Yab. Dil. Öğr. Gör. Sonuç'!C47)+1,2)&REPT(\"*\",3)))","v":""},{"$f":"IF('Yab. Dil. Öğr. Gör. Sonuç'!D47=\"\",\"\",IF(ISERR(FIND(\" \",'Yab. Dil. Öğr. Gör. Sonuç'!D47))=TRUE,LEFT('Yab. Dil. Öğr. Gör. Sonuç'!D47,2)&REPT(\"*\",3),LEFT('Yab. Dil. Öğr. Gör. Sonuç'!D47,2)&REPT(\"*\",3)&\" \"&MID('Yab. Dil. Öğr. Gör. Sonuç'!D47,FIND(\" \",'Yab. Dil. Öğr. Gör. Sonuç'!D47)+1,2)&REPT(\"*\",3)))","v":""},{"$f":"IF('Yab. Dil. Öğr. Gör. Sonuç'!E47=\"\",\"\",'Yab. Dil. Öğr. Gör. Sonuç'!E47)","v":""},{"$f":"IF('Yab. Dil. Öğr. Gör. Sonuç'!F47=\"\",\"\",'Yab. Dil. Öğr. Gör. Sonuç'!F47)","v":""},{"$f":"IF('Yab. Dil. Öğr. Gör. Sonuç'!G47=\"\",\"\",'Yab. Dil. Öğr. Gör. Sonuç'!G47)","v":""},{"$f":"IF('Yab. Dil. Öğr. Gör. Sonuç'!H47=\"\",\"\",'Yab. Dil. Öğr. Gör. Sonuç'!H47)","v":""},{"$f":"IF('Yab. Dil. Öğr. Gör. Sonuç'!I47=\"\",\"\",'Yab. Dil. Öğr. Gör. Sonuç'!I47)","v":""},{"$f":"IF('Yab. Dil. Öğr. Gör. Sonuç'!J47=\"\",\"\",'Yab. Dil. Öğr. Gör. Sonuç'!J47)","v":""},{"$f":"IF('Yab. Dil. Öğr. Gör. Sonuç'!K47=\"\",\"\",'Yab. Dil. Öğr. Gör. Sonuç'!K47)","v":""},{"$f":"IF('Yab. Dil. Öğr. Gör. Sonuç'!L47=\"\",\"\",'Yab. Dil. Öğr. Gör. Sonuç'!L47)","v":""},{"$f":"IF('Yab. Dil. Öğr. Gör. Sonuç'!M47=\"\",\"\",'Yab. Dil. Öğr. Gör. Sonuç'!M47)","v":""},{"$f":"IF('Yab. Dil. Öğr. Gör. Sonuç'!N47=\"\",\"\",'Yab. Dil. Öğr. Gör. Sonuç'!N47)","v":""}]
[{"$f":"IF('Yab. Dil. Öğr. Gör. Sonuç'!A48=\"\",\"\",'Yab. Dil. Öğr. Gör. Sonuç'!A48)","v":""},{"$f":"IF('Yab. Dil. Öğr. Gör. Sonuç'!B48=\"\",\"\",LEFT('Yab. Dil. Öğr. Gör. Sonuç'!B48,3)&REPT(\"*\",4)&RIGHT('Yab. Dil. Öğr. Gör. Sonuç'!B48,2))","v":""},{"$f":"IF('Yab. Dil. Öğr. Gör. Sonuç'!C48=\"\",\"\",IF(ISERR(FIND(\" \",'Yab. Dil. Öğr. Gör. Sonuç'!C48))=TRUE,LEFT('Yab. Dil. Öğr. Gör. Sonuç'!C48,2)&REPT(\"*\",3),LEFT('Yab. Dil. Öğr. Gör. Sonuç'!C48,2)&REPT(\"*\",3)&\" \"&MID('Yab. Dil. Öğr. Gör. Sonuç'!C48,FIND(\" \",'Yab. Dil. Öğr. Gör. Sonuç'!C48)+1,2)&REPT(\"*\",3)))","v":""},{"$f":"IF('Yab. Dil. Öğr. Gör. Sonuç'!D48=\"\",\"\",IF(ISERR(FIND(\" \",'Yab. Dil. Öğr. Gör. Sonuç'!D48))=TRUE,LEFT('Yab. Dil. Öğr. Gör. Sonuç'!D48,2)&REPT(\"*\",3),LEFT('Yab. Dil. Öğr. Gör. Sonuç'!D48,2)&REPT(\"*\",3)&\" \"&MID('Yab. Dil. Öğr. Gör. Sonuç'!D48,FIND(\" \",'Yab. Dil. Öğr. Gör. Sonuç'!D48)+1,2)&REPT(\"*\",3)))","v":""},{"$f":"IF('Yab. Dil. Öğr. Gör. Sonuç'!E48=\"\",\"\",'Yab. Dil. Öğr. Gör. Sonuç'!E48)","v":""},{"$f":"IF('Yab. Dil. Öğr. Gör. Sonuç'!F48=\"\",\"\",'Yab. Dil. Öğr. Gör. Sonuç'!F48)","v":""},{"$f":"IF('Yab. Dil. Öğr. Gör. Sonuç'!G48=\"\",\"\",'Yab. Dil. Öğr. Gör. Sonuç'!G48)","v":""},{"$f":"IF('Yab. Dil. Öğr. Gör. Sonuç'!H48=\"\",\"\",'Yab. Dil. Öğr. Gör. Sonuç'!H48)","v":""},{"$f":"IF('Yab. Dil. Öğr. Gör. Sonuç'!I48=\"\",\"\",'Yab. Dil. Öğr. Gör. Sonuç'!I48)","v":""},{"$f":"IF('Yab. Dil. Öğr. Gör. Sonuç'!J48=\"\",\"\",'Yab. Dil. Öğr. Gör. Sonuç'!J48)","v":""},{"$f":"IF('Yab. Dil. Öğr. Gör. Sonuç'!K48=\"\",\"\",'Yab. Dil. Öğr. Gör. Sonuç'!K48)","v":""},{"$f":"IF('Yab. Dil. Öğr. Gör. Sonuç'!L48=\"\",\"\",'Yab. Dil. Öğr. Gör. Sonuç'!L48)","v":""},{"$f":"IF('Yab. Dil. Öğr. Gör. Sonuç'!M48=\"\",\"\",'Yab. Dil. Öğr. Gör. Sonuç'!M48)","v":""},{"$f":"IF('Yab. Dil. Öğr. Gör. Sonuç'!N48=\"\",\"\",'Yab. Dil. Öğr. Gör. Sonuç'!N48)","v":""}]
[{"$f":"IF('Yab. Dil. Öğr. Gör. Sonuç'!A49=\"\",\"\",'Yab. Dil. Öğr. Gör. Sonuç'!A49)","v":""},{"$f":"IF('Yab. Dil. Öğr. Gör. Sonuç'!B49=\"\",\"\",LEFT('Yab. Dil. Öğr. Gör. Sonuç'!B49,3)&REPT(\"*\",4)&RIGHT('Yab. Dil. Öğr. Gör. Sonuç'!B49,2))","v":""},{"$f":"IF('Yab. Dil. Öğr. Gör. Sonuç'!C49=\"\",\"\",IF(ISERR(FIND(\" \",'Yab. Dil. Öğr. Gör. Sonuç'!C49))=TRUE,LEFT('Yab. Dil. Öğr. Gör. Sonuç'!C49,2)&REPT(\"*\",3),LEFT('Yab. Dil. Öğr. Gör. Sonuç'!C49,2)&REPT(\"*\",3)&\" \"&MID('Yab. Dil. Öğr. Gör. Sonuç'!C49,FIND(\" \",'Yab. Dil. Öğr. Gör. Sonuç'!C49)+1,2)&REPT(\"*\",3)))","v":""},{"$f":"IF('Yab. Dil. Öğr. Gör. Sonuç'!D49=\"\",\"\",IF(ISERR(FIND(\" \",'Yab. Dil. Öğr. Gör. Sonuç'!D49))=TRUE,LEFT('Yab. Dil. Öğr. Gör. Sonuç'!D49,2)&REPT(\"*\",3),LEFT('Yab. Dil. Öğr. Gör. Sonuç'!D49,2)&REPT(\"*\",3)&\" \"&MID('Yab. Dil. Öğr. Gör. Sonuç'!D49,FIND(\" \",'Yab. Dil. Öğr. Gör. Sonuç'!D49)+1,2)&REPT(\"*\",3)))","v":""},{"$f":"IF('Yab. Dil. Öğr. Gör. Sonuç'!E49=\"\",\"\",'Yab. Dil. Öğr. Gör. Sonuç'!E49)","v":""},{"$f":"IF('Yab. Dil. Öğr. Gör. Sonuç'!F49=\"\",\"\",'Yab. Dil. Öğr. Gör. Sonuç'!F49)","v":""},{"$f":"IF('Yab. Dil. Öğr. Gör. Sonuç'!G49=\"\",\"\",'Yab. Dil. Öğr. Gör. Sonuç'!G49)","v":""},{"$f":"IF('Yab. Dil. Öğr. Gör. Sonuç'!H49=\"\",\"\",'Yab. Dil. Öğr. Gör. Sonuç'!H49)","v":""},{"$f":"IF('Yab. Dil. Öğr. Gör. Sonuç'!I49=\"\",\"\",'Yab. Dil. Öğr. Gör. Sonuç'!I49)","v":""},{"$f":"IF('Yab. Dil. Öğr. Gör. Sonuç'!J49=\"\",\"\",'Yab. Dil. Öğr. Gör. Sonuç'!J49)","v":""},{"$f":"IF('Yab. Dil. Öğr. Gör. Sonuç'!K49=\"\",\"\",'Yab. Dil. Öğr. Gör. Sonuç'!K49)","v":""},{"$f":"IF('Yab. Dil. Öğr. Gör. Sonuç'!L49=\"\",\"\",'Yab. Dil. Öğr. Gör. Sonuç'!L49)","v":""},{"$f":"IF('Yab. Dil. Öğr. Gör. Sonuç'!M49=\"\",\"\",'Yab. Dil. Öğr. Gör. Sonuç'!M49)","v":""},{"$f":"IF('Yab. Dil. Öğr. Gör. Sonuç'!N49=\"\",\"\",'Yab. Dil. Öğr. Gör. Sonuç'!N49)","v":""}]
[{"$f":"IF('Yab. Dil. Öğr. Gör. Sonuç'!A50=\"\",\"\",'Yab. Dil. Öğr. Gör. Sonuç'!A50)","v":""},{"$f":"IF('Yab. Dil. Öğr. Gör. Sonuç'!B50=\"\",\"\",LEFT('Yab. Dil. Öğr. Gör. Sonuç'!B50,3)&REPT(\"*\",4)&RIGHT('Yab. Dil. Öğr. Gör. Sonuç'!B50,2))","v":""},{"$f":"IF('Yab. Dil. Öğr. Gör. Sonuç'!C50=\"\",\"\",IF(ISERR(FIND(\" \",'Yab. Dil. Öğr. Gör. Sonuç'!C50))=TRUE,LEFT('Yab. Dil. Öğr. Gör. Sonuç'!C50,2)&REPT(\"*\",3),LEFT('Yab. Dil. Öğr. Gör. Sonuç'!C50,2)&REPT(\"*\",3)&\" \"&MID('Yab. Dil. Öğr. Gör. Sonuç'!C50,FIND(\" \",'Yab. Dil. Öğr. Gör. Sonuç'!C50)+1,2)&REPT(\"*\",3)))","v":""},{"$f":"IF('Yab. Dil. Öğr. Gör. Sonuç'!D50=\"\",\"\",IF(ISERR(FIND(\" \",'Yab. Dil. Öğr. Gör. Sonuç'!D50))=TRUE,LEFT('Yab. Dil. Öğr. Gör. Sonuç'!D50,2)&REPT(\"*\",3),LEFT('Yab. Dil. Öğr. Gör. Sonuç'!D50,2)&REPT(\"*\",3)&\" \"&MID('Yab. Dil. Öğr. Gör. Sonuç'!D50,FIND(\" \",'Yab. Dil. Öğr. Gör. Sonuç'!D50)+1,2)&REPT(\"*\",3)))","v":""},{"$f":"IF('Yab. Dil. Öğr. Gör. Sonuç'!E50=\"\",\"\",'Yab. Dil. Öğr. Gör. Sonuç'!E50)","v":""},{"$f":"IF('Yab. Dil. Öğr. Gör. Sonuç'!F50=\"\",\"\",'Yab. Dil. Öğr. Gör. Sonuç'!F50)","v":""},{"$f":"IF('Yab. Dil. Öğr. Gör. Sonuç'!G50=\"\",\"\",'Yab. Dil. Öğr. Gör. Sonuç'!G50)","v":""},{"$f":"IF('Yab. Dil. Öğr. Gör. Sonuç'!H50=\"\",\"\",'Yab. Dil. Öğr. Gör. Sonuç'!H50)","v":""},{"$f":"IF('Yab. Dil. Öğr. Gör. Sonuç'!I50=\"\",\"\",'Yab. Dil. Öğr. Gör. Sonuç'!I50)","v":""},{"$f":"IF('Yab. Dil. Öğr. Gör. Sonuç'!J50=\"\",\"\",'Yab. Dil. Öğr. Gör. Sonuç'!J50)","v":""},{"$f":"IF('Yab. Dil. Öğr. Gör. Sonuç'!K50=\"\",\"\",'Yab. Dil. Öğr. Gör. Sonuç'!K50)","v":""},{"$f":"IF('Yab. Dil. Öğr. Gör. Sonuç'!L50=\"\",\"\",'Yab. Dil. Öğr. Gör. Sonuç'!L50)","v":""},{"$f":"IF('Yab. Dil. Öğr. Gör. Sonuç'!M50=\"\",\"\",'Yab. Dil. Öğr. Gör. Sonuç'!M50)","v":""},{"$f":"IF('Yab. Dil. Öğr. Gör. Sonuç'!N50=\"\",\"\",'Yab. Dil. Öğr. Gör. Sonuç'!N50)","v":""}]
[{"$f":"IF('Yab. Dil. Öğr. Gör. Sonuç'!A51=\"\",\"\",'Yab. Dil. Öğr. Gör. Sonuç'!A51)","v":""},{"$f":"IF('Yab. Dil. Öğr. Gör. Sonuç'!B51=\"\",\"\",LEFT('Yab. Dil. Öğr. Gör. Sonuç'!B51,3)&REPT(\"*\",4)&RIGHT('Yab. Dil. Öğr. Gör. Sonuç'!B51,2))","v":""},{"$f":"IF('Yab. Dil. Öğr. Gör. Sonuç'!C51=\"\",\"\",IF(ISERR(FIND(\" \",'Yab. Dil. Öğr. Gör. Sonuç'!C51))=TRUE,LEFT('Yab. Dil. Öğr. Gör. Sonuç'!C51,2)&REPT(\"*\",3),LEFT('Yab. Dil. Öğr. Gör. Sonuç'!C51,2)&REPT(\"*\",3)&\" \"&MID('Yab. Dil. Öğr. Gör. Sonuç'!C51,FIND(\" \",'Yab. Dil. Öğr. Gör. Sonuç'!C51)+1,2)&REPT(\"*\",3)))","v":""},{"$f":"IF('Yab. Dil. Öğr. Gör. Sonuç'!D51=\"\",\"\",IF(ISERR(FIND(\" \",'Yab. Dil. Öğr. Gör. Sonuç'!D51))=TRUE,LEFT('Yab. Dil. Öğr. Gör. Sonuç'!D51,2)&REPT(\"*\",3),LEFT('Yab. Dil. Öğr. Gör. Sonuç'!D51,2)&REPT(\"*\",3)&\" \"&MID('Yab. Dil. Öğr. Gör. Sonuç'!D51,FIND(\" \",'Yab. Dil. Öğr. Gör. Sonuç'!D51)+1,2)&REPT(\"*\",3)))","v":""},{"$f":"IF('Yab. Dil. Öğr. Gör. Sonuç'!E51=\"\",\"\",'Yab. Dil. Öğr. Gör. Sonuç'!E51)","v":""},{"$f":"IF('Yab. Dil. Öğr. Gör. Sonuç'!F51=\"\",\"\",'Yab. Dil. Öğr. Gör. Sonuç'!F51)","v":""},{"$f":"IF('Yab. Dil. Öğr. Gör. Sonuç'!G51=\"\",\"\",'Yab. Dil. Öğr. Gör. Sonuç'!G51)","v":""},{"$f":"IF('Yab. Dil. Öğr. Gör. Sonuç'!H51=\"\",\"\",'Yab. Dil. Öğr. Gör. Sonuç'!H51)","v":""},{"$f":"IF('Yab. Dil. Öğr. Gör. Sonuç'!I51=\"\",\"\",'Yab. Dil. Öğr. Gör. Sonuç'!I51)","v":""},{"$f":"IF('Yab. Dil. Öğr. Gör. Sonuç'!J51=\"\",\"\",'Yab. Dil. Öğr. Gör. Sonuç'!J51)","v":""},{"$f":"IF('Yab. Dil. Öğr. Gör. Sonuç'!K51=\"\",\"\",'Yab. Dil. Öğr. Gör. Sonuç'!K51)","v":""},{"$f":"IF('Yab. Dil. Öğr. Gör. Sonuç'!L51=\"\",\"\",'Yab. Dil. Öğr. Gör. Sonuç'!L51)","v":""},{"$f":"IF('Yab. Dil. Öğr. Gör. Sonuç'!M51=\"\",\"\",'Yab. Dil. Öğr. Gör. Sonuç'!M51)","v":""},{"$f":"IF('Yab. Dil. Öğr. Gör. Sonuç'!N51=\"\",\"\",'Yab. Dil. Öğr. Gör. Sonuç'!N51)","v":""}]
[{"$f":"IF('Yab. Dil. Öğr. Gör. Sonuç'!A52=\"\",\"\",'Yab. Dil. Öğr. Gör. Sonuç'!A52)","v":""},{"$f":"IF('Yab. Dil. Öğr. Gör. Sonuç'!B52=\"\",\"\",LEFT('Yab. Dil. Öğr. Gör. Sonuç'!B52,3)&REPT(\"*\",4)&RIGHT('Yab. Dil. Öğr. Gör. Sonuç'!B52,2))","v":""},{"$f":"IF('Yab. Dil. Öğr. Gör. Sonuç'!C52=\"\",\"\",IF(ISERR(FIND(\" \",'Yab. Dil. Öğr. Gör. Sonuç'!C52))=TRUE,LEFT('Yab. Dil. Öğr. Gör. Sonuç'!C52,2)&REPT(\"*\",3),LEFT('Yab. Dil. Öğr. Gör. Sonuç'!C52,2)&REPT(\"*\",3)&\" \"&MID('Yab. Dil. Öğr. Gör. Sonuç'!C52,FIND(\" \",'Yab. Dil. Öğr. Gör. Sonuç'!C52)+1,2)&REPT(\"*\",3)))","v":""},{"$f":"IF('Yab. Dil. Öğr. Gör. Sonuç'!D52=\"\",\"\",IF(ISERR(FIND(\" \",'Yab. Dil. Öğr. Gör. Sonuç'!D52))=TRUE,LEFT('Yab. Dil. Öğr. Gör. Sonuç'!D52,2)&REPT(\"*\",3),LEFT('Yab. Dil. Öğr. Gör. Sonuç'!D52,2)&REPT(\"*\",3)&\" \"&MID('Yab. Dil. Öğr. Gör. Sonuç'!D52,FIND(\" \",'Yab. Dil. Öğr. Gör. Sonuç'!D52)+1,2)&REPT(\"*\",3)))","v":""},{"$f":"IF('Yab. Dil. Öğr. Gör. Sonuç'!E52=\"\",\"\",'Yab. Dil. Öğr. Gör. Sonuç'!E52)","v":""},{"$f":"IF('Yab. Dil. Öğr. Gör. Sonuç'!F52=\"\",\"\",'Yab. Dil. Öğr. Gör. Sonuç'!F52)","v":""},{"$f":"IF('Yab. Dil. Öğr. Gör. Sonuç'!G52=\"\",\"\",'Yab. Dil. Öğr. Gör. Sonuç'!G52)","v":""},{"$f":"IF('Yab. Dil. Öğr. Gör. Sonuç'!H52=\"\",\"\",'Yab. Dil. Öğr. Gör. Sonuç'!H52)","v":""},{"$f":"IF('Yab. Dil. Öğr. Gör. Sonuç'!I52=\"\",\"\",'Yab. Dil. Öğr. Gör. Sonuç'!I52)","v":""},{"$f":"IF('Yab. Dil. Öğr. Gör. Sonuç'!J52=\"\",\"\",'Yab. Dil. Öğr. Gör. Sonuç'!J52)","v":""},{"$f":"IF('Yab. Dil. Öğr. Gör. Sonuç'!K52=\"\",\"\",'Yab. Dil. Öğr. Gör. Sonuç'!K52)","v":""},{"$f":"IF('Yab. Dil. Öğr. Gör. Sonuç'!L52=\"\",\"\",'Yab. Dil. Öğr. Gör. Sonuç'!L52)","v":""},{"$f":"IF('Yab. Dil. Öğr. Gör. Sonuç'!M52=\"\",\"\",'Yab. Dil. Öğr. Gör. Sonuç'!M52)","v":""},{"$f":"IF('Yab. Dil. Öğr. Gör. Sonuç'!N52=\"\",\"\",'Yab. Dil. Öğr. Gör. Sonuç'!N52)","v":""}]
[{"$f":"IF('Yab. Dil. Öğr. Gör. Sonuç'!A53=\"\",\"\",'Yab. Dil. Öğr. Gör. Sonuç'!A53)","v":""},{"$f":"IF('Yab. Dil. Öğr. Gör. Sonuç'!B53=\"\",\"\",LEFT('Yab. Dil. Öğr. Gör. Sonuç'!B53,3)&REPT(\"*\",4)&RIGHT('Yab. Dil. Öğr. Gör. Sonuç'!B53,2))","v":""},{"$f":"IF('Yab. Dil. Öğr. Gör. Sonuç'!C53=\"\",\"\",IF(ISERR(FIND(\" \",'Yab. Dil. Öğr. Gör. Sonuç'!C53))=TRUE,LEFT('Yab. Dil. Öğr. Gör. Sonuç'!C53,2)&REPT(\"*\",3),LEFT('Yab. Dil. Öğr. Gör. Sonuç'!C53,2)&REPT(\"*\",3)&\" \"&MID('Yab. Dil. Öğr. Gör. Sonuç'!C53,FIND(\" \",'Yab. Dil. Öğr. Gör. Sonuç'!C53)+1,2)&REPT(\"*\",3)))","v":""},{"$f":"IF('Yab. Dil. Öğr. Gör. Sonuç'!D53=\"\",\"\",IF(ISERR(FIND(\" \",'Yab. Dil. Öğr. Gör. Sonuç'!D53))=TRUE,LEFT('Yab. Dil. Öğr. Gör. Sonuç'!D53,2)&REPT(\"*\",3),LEFT('Yab. Dil. Öğr. Gör. Sonuç'!D53,2)&REPT(\"*\",3)&\" \"&MID('Yab. Dil. Öğr. Gör. Sonuç'!D53,FIND(\" \",'Yab. Dil. Öğr. Gör. Sonuç'!D53)+1,2)&REPT(\"*\",3)))","v":""},{"$f":"IF('Yab. Dil. Öğr. Gör. Sonuç'!E53=\"\",\"\",'Yab. Dil. Öğr. Gör. Sonuç'!E53)","v":""},{"$f":"IF('Yab. Dil. Öğr. Gör. Sonuç'!F53=\"\",\"\",'Yab. Dil. Öğr. Gör. Sonuç'!F53)","v":""},{"$f":"IF('Yab. Dil. Öğr. Gör. Sonuç'!G53=\"\",\"\",'Yab. Dil. Öğr. Gör. Sonuç'!G53)","v":""},{"$f":"IF('Yab. Dil. Öğr. Gör. Sonuç'!H53=\"\",\"\",'Yab. Dil. Öğr. Gör. Sonuç'!H53)","v":""},{"$f":"IF('Yab. Dil. Öğr. Gör. Sonuç'!I53=\"\",\"\",'Yab. Dil. Öğr. Gör. Sonuç'!I53)","v":""},{"$f":"IF('Yab. Dil. Öğr. Gör. Sonuç'!J53=\"\",\"\",'Yab. Dil. Öğr. Gör. Sonuç'!J53)","v":""},{"$f":"IF('Yab. Dil. Öğr. Gör. Sonuç'!K53=\"\",\"\",'Yab. Dil. Öğr. Gör. Sonuç'!K53)","v":""},{"$f":"IF('Yab. Dil. Öğr. Gör. Sonuç'!L53=\"\",\"\",'Yab. Dil. Öğr. Gör. Sonuç'!L53)","v":""},{"$f":"IF('Yab. Dil. Öğr. Gör. Sonuç'!M53=\"\",\"\",'Yab. Dil. Öğr. Gör. Sonuç'!M53)","v":""},{"$f":"IF('Yab. Dil. Öğr. Gör. Sonuç'!N53=\"\",\"\",'Yab. Dil. Öğr. Gör. Sonuç'!N53)","v":""}]
[{"$f":"IF('Yab. Dil. Öğr. Gör. Sonuç'!A54=\"\",\"\",'Yab. Dil. Öğr. Gör. Sonuç'!A54)","v":""},{"$f":"IF('Yab. Dil. Öğr. Gör. Sonuç'!B54=\"\",\"\",LEFT('Yab. Dil. Öğr. Gör. Sonuç'!B54,3)&REPT(\"*\",4)&RIGHT('Yab. Dil. Öğr. Gör. Sonuç'!B54,2))","v":""},{"$f":"IF('Yab. Dil. Öğr. Gör. Sonuç'!C54=\"\",\"\",IF(ISERR(FIND(\" \",'Yab. Dil. Öğr. Gör. Sonuç'!C54))=TRUE,LEFT('Yab. Dil. Öğr. Gör. Sonuç'!C54,2)&REPT(\"*\",3),LEFT('Yab. Dil. Öğr. Gör. Sonuç'!C54,2)&REPT(\"*\",3)&\" \"&MID('Yab. Dil. Öğr. Gör. Sonuç'!C54,FIND(\" \",'Yab. Dil. Öğr. Gör. Sonuç'!C54)+1,2)&REPT(\"*\",3)))","v":""},{"$f":"IF('Yab. Dil. Öğr. Gör. Sonuç'!D54=\"\",\"\",IF(ISERR(FIND(\" \",'Yab. Dil. Öğr. Gör. Sonuç'!D54))=TRUE,LEFT('Yab. Dil. Öğr. Gör. Sonuç'!D54,2)&REPT(\"*\",3),LEFT('Yab. Dil. Öğr. Gör. Sonuç'!D54,2)&REPT(\"*\",3)&\" \"&MID('Yab. Dil. Öğr. Gör. Sonuç'!D54,FIND(\" \",'Yab. Dil. Öğr. Gör. Sonuç'!D54)+1,2)&REPT(\"*\",3)))","v":""},{"$f":"IF('Yab. Dil. Öğr. Gör. Sonuç'!E54=\"\",\"\",'Yab. Dil. Öğr. Gör. Sonuç'!E54)","v":""},{"$f":"IF('Yab. Dil. Öğr. Gör. Sonuç'!F54=\"\",\"\",'Yab. Dil. Öğr. Gör. Sonuç'!F54)","v":""},{"$f":"IF('Yab. Dil. Öğr. Gör. Sonuç'!G54=\"\",\"\",'Yab. Dil. Öğr. Gör. Sonuç'!G54)","v":""},{"$f":"IF('Yab. Dil. Öğr. Gör. Sonuç'!H54=\"\",\"\",'Yab. Dil. Öğr. Gör. Sonuç'!H54)","v":""},{"$f":"IF('Yab. Dil. Öğr. Gör. Sonuç'!I54=\"\",\"\",'Yab. Dil. Öğr. Gör. Sonuç'!I54)","v":""},{"$f":"IF('Yab. Dil. Öğr. Gör. Sonuç'!J54=\"\",\"\",'Yab. Dil. Öğr. Gör. Sonuç'!J54)","v":""},{"$f":"IF('Yab. Dil. Öğr. Gör. Sonuç'!K54=\"\",\"\",'Yab. Dil. Öğr. Gör. Sonuç'!K54)","v":""},{"$f":"IF('Yab. Dil. Öğr. Gör. Sonuç'!L54=\"\",\"\",'Yab. Dil. Öğr. Gör. Sonuç'!L54)","v":""},{"$f":"IF('Yab. Dil. Öğr. Gör. Sonuç'!M54=\"\",\"\",'Yab. Dil. Öğr. Gör. Sonuç'!M54)","v":""},{"$f":"IF('Yab. Dil. Öğr. Gör. Sonuç'!N54=\"\",\"\",'Yab. Dil. Öğr. Gör. Sonuç'!N54)","v":""}]
[{"$f":"IF('Yab. Dil. Öğr. Gör. Sonuç'!A55=\"\",\"\",'Yab. Dil. Öğr. Gör. Sonuç'!A55)","v":""},{"$f":"IF('Yab. Dil. Öğr. Gör. Sonuç'!B55=\"\",\"\",LEFT('Yab. Dil. Öğr. Gör. Sonuç'!B55,3)&REPT(\"*\",4)&RIGHT('Yab. Dil. Öğr. Gör. Sonuç'!B55,2))","v":""},{"$f":"IF('Yab. Dil. Öğr. Gör. Sonuç'!C55=\"\",\"\",IF(ISERR(FIND(\" \",'Yab. Dil. Öğr. Gör. Sonuç'!C55))=TRUE,LEFT('Yab. Dil. Öğr. Gör. Sonuç'!C55,2)&REPT(\"*\",3),LEFT('Yab. Dil. Öğr. Gör. Sonuç'!C55,2)&REPT(\"*\",3)&\" \"&MID('Yab. Dil. Öğr. Gör. Sonuç'!C55,FIND(\" \",'Yab. Dil. Öğr. Gör. Sonuç'!C55)+1,2)&REPT(\"*\",3)))","v":""},{"$f":"IF('Yab. Dil. Öğr. Gör. Sonuç'!D55=\"\",\"\",IF(ISERR(FIND(\" \",'Yab. Dil. Öğr. Gör. Sonuç'!D55))=TRUE,LEFT('Yab. Dil. Öğr. Gör. Sonuç'!D55,2)&REPT(\"*\",3),LEFT('Yab. Dil. Öğr. Gör. Sonuç'!D55,2)&REPT(\"*\",3)&\" \"&MID('Yab. Dil. Öğr. Gör. Sonuç'!D55,FIND(\" \",'Yab. Dil. Öğr. Gör. Sonuç'!D55)+1,2)&REPT(\"*\",3)))","v":""},{"$f":"IF('Yab. Dil. Öğr. Gör. Sonuç'!E55=\"\",\"\",'Yab. Dil. Öğr. Gör. Sonuç'!E55)","v":""},{"$f":"IF('Yab. Dil. Öğr. Gör. Sonuç'!F55=\"\",\"\",'Yab. Dil. Öğr. Gör. Sonuç'!F55)","v":""},{"$f":"IF('Yab. Dil. Öğr. Gör. Sonuç'!G55=\"\",\"\",'Yab. Dil. Öğr. Gör. Sonuç'!G55)","v":""},{"$f":"IF('Yab. Dil. Öğr. Gör. Sonuç'!H55=\"\",\"\",'Yab. Dil. Öğr. Gör. Sonuç'!H55)","v":""},{"$f":"IF('Yab. Dil. Öğr. Gör. Sonuç'!I55=\"\",\"\",'Yab. Dil. Öğr. Gör. Sonuç'!I55)","v":""},{"$f":"IF('Yab. Dil. Öğr. Gör. Sonuç'!J55=\"\",\"\",'Yab. Dil. Öğr. Gör. Sonuç'!J55)","v":""},{"$f":"IF('Yab. Dil. Öğr. Gör. Sonuç'!K55=\"\",\"\",'Yab. Dil. Öğr. Gör. Sonuç'!K55)","v":""},{"$f":"IF('Yab. Dil. Öğr. Gör. Sonuç'!L55=\"\",\"\",'Yab. Dil. Öğr. Gör. Sonuç'!L55)","v":""},{"$f":"IF('Yab. Dil. Öğr. Gör. Sonuç'!M55=\"\",\"\",'Yab. Dil. Öğr. Gör. Sonuç'!M55)","v":""},{"$f":"IF('Yab. Dil. Öğr. Gör. Sonuç'!N55=\"\",\"\",'Yab. Dil. Öğr. Gör. Sonuç'!N55)","v":""}]
[{"$f":"IF('Yab. Dil. Öğr. Gör. Sonuç'!A56=\"\",\"\",'Yab. Dil. Öğr. Gör. Sonuç'!A56)","v":""},{"$f":"IF('Yab. Dil. Öğr. Gör. Sonuç'!B56=\"\",\"\",LEFT('Yab. Dil. Öğr. Gör. Sonuç'!B56,3)&REPT(\"*\",4)&RIGHT('Yab. Dil. Öğr. Gör. Sonuç'!B56,2))","v":""},{"$f":"IF('Yab. Dil. Öğr. Gör. Sonuç'!C56=\"\",\"\",IF(ISERR(FIND(\" \",'Yab. Dil. Öğr. Gör. Sonuç'!C56))=TRUE,LEFT('Yab. Dil. Öğr. Gör. Sonuç'!C56,2)&REPT(\"*\",3),LEFT('Yab. Dil. Öğr. Gör. Sonuç'!C56,2)&REPT(\"*\",3)&\" \"&MID('Yab. Dil. Öğr. Gör. Sonuç'!C56,FIND(\" \",'Yab. Dil. Öğr. Gör. Sonuç'!C56)+1,2)&REPT(\"*\",3)))","v":""},{"$f":"IF('Yab. Dil. Öğr. Gör. Sonuç'!D56=\"\",\"\",IF(ISERR(FIND(\" \",'Yab. Dil. Öğr. Gör. Sonuç'!D56))=TRUE,LEFT('Yab. Dil. Öğr. Gör. Sonuç'!D56,2)&REPT(\"*\",3),LEFT('Yab. Dil. Öğr. Gör. Sonuç'!D56,2)&REPT(\"*\",3)&\" \"&MID('Yab. Dil. Öğr. Gör. Sonuç'!D56,FIND(\" \",'Yab. Dil. Öğr. Gör. Sonuç'!D56)+1,2)&REPT(\"*\",3)))","v":""},{"$f":"IF('Yab. Dil. Öğr. Gör. Sonuç'!E56=\"\",\"\",'Yab. Dil. Öğr. Gör. Sonuç'!E56)","v":""},{"$f":"IF('Yab. Dil. Öğr. Gör. Sonuç'!F56=\"\",\"\",'Yab. Dil. Öğr. Gör. Sonuç'!F56)","v":""},{"$f":"IF('Yab. Dil. Öğr. Gör. Sonuç'!G56=\"\",\"\",'Yab. Dil. Öğr. Gör. Sonuç'!G56)","v":""},{"$f":"IF('Yab. Dil. Öğr. Gör. Sonuç'!H56=\"\",\"\",'Yab. Dil. Öğr. Gör. Sonuç'!H56)","v":""},{"$f":"IF('Yab. Dil. Öğr. Gör. Sonuç'!I56=\"\",\"\",'Yab. Dil. Öğr. Gör. Sonuç'!I56)","v":""},{"$f":"IF('Yab. Dil. Öğr. Gör. Sonuç'!J56=\"\",\"\",'Yab. Dil. Öğr. Gör. Sonuç'!J56)","v":""},{"$f":"IF('Yab. Dil. Öğr. Gör. Sonuç'!K56=\"\",\"\",'Yab. Dil. Öğr. Gör. Sonuç'!K56)","v":""},{"$f":"IF('Yab. Dil. Öğr. Gör. Sonuç'!L56=\"\",\"\",'Yab. Dil. Öğr. Gör. Sonuç'!L56)","v":""},{"$f":"IF('Yab. Dil. Öğr. Gör. Sonuç'!M56=\"\",\"\",'Yab. Dil. Öğr. Gör. Sonuç'!M56)","v":""},{"$f":"IF('Yab. Dil. Öğr. Gör. Sonuç'!N56=\"\",\"\",'Yab. Dil. Öğr. Gör. Sonuç'!N56)","v":""}]
[{"$f":"IF('Yab. Dil. Öğr. Gör. Sonuç'!A57=\"\",\"\",'Yab. Dil. Öğr. Gör. Sonuç'!A57)","v":""},{"$f":"IF('Yab. Dil. Öğr. Gör. Sonuç'!B57=\"\",\"\",LEFT('Yab. Dil. Öğr. Gör. Sonuç'!B57,3)&REPT(\"*\",4)&RIGHT('Yab. Dil. Öğr. Gör. Sonuç'!B57,2))","v":""},{"$f":"IF('Yab. Dil. Öğr. Gör. Sonuç'!C57=\"\",\"\",IF(ISERR(FIND(\" \",'Yab. Dil. Öğr. Gör. Sonuç'!C57))=TRUE,LEFT('Yab. Dil. Öğr. Gör. Sonuç'!C57,2)&REPT(\"*\",3),LEFT('Yab. Dil. Öğr. Gör. Sonuç'!C57,2)&REPT(\"*\",3)&\" \"&MID('Yab. Dil. Öğr. Gör. Sonuç'!C57,FIND(\" \",'Yab. Dil. Öğr. Gör. Sonuç'!C57)+1,2)&REPT(\"*\",3)))","v":""},{"$f":"IF('Yab. Dil. Öğr. Gör. Sonuç'!D57=\"\",\"\",IF(ISERR(FIND(\" \",'Yab. Dil. Öğr. Gör. Sonuç'!D57))=TRUE,LEFT('Yab. Dil. Öğr. Gör. Sonuç'!D57,2)&REPT(\"*\",3),LEFT('Yab. Dil. Öğr. Gör. Sonuç'!D57,2)&REPT(\"*\",3)&\" \"&MID('Yab. Dil. Öğr. Gör. Sonuç'!D57,FIND(\" \",'Yab. Dil. Öğr. Gör. Sonuç'!D57)+1,2)&REPT(\"*\",3)))","v":""},{"$f":"IF('Yab. Dil. Öğr. Gör. Sonuç'!E57=\"\",\"\",'Yab. Dil. Öğr. Gör. Sonuç'!E57)","v":""},{"$f":"IF('Yab. Dil. Öğr. Gör. Sonuç'!F57=\"\",\"\",'Yab. Dil. Öğr. Gör. Sonuç'!F57)","v":""},{"$f":"IF('Yab. Dil. Öğr. Gör. Sonuç'!G57=\"\",\"\",'Yab. Dil. Öğr. Gör. Sonuç'!G57)","v":""},{"$f":"IF('Yab. Dil. Öğr. Gör. Sonuç'!H57=\"\",\"\",'Yab. Dil. Öğr. Gör. Sonuç'!H57)","v":""},{"$f":"IF('Yab. Dil. Öğr. Gör. Sonuç'!I57=\"\",\"\",'Yab. Dil. Öğr. Gör. Sonuç'!I57)","v":""},{"$f":"IF('Yab. Dil. Öğr. Gör. Sonuç'!J57=\"\",\"\",'Yab. Dil. Öğr. Gör. Sonuç'!J57)","v":""},{"$f":"IF('Yab. Dil. Öğr. Gör. Sonuç'!K57=\"\",\"\",'Yab. Dil. Öğr. Gör. Sonuç'!K57)","v":""},{"$f":"IF('Yab. Dil. Öğr. Gör. Sonuç'!L57=\"\",\"\",'Yab. Dil. Öğr. Gör. Sonuç'!L57)","v":""},{"$f":"IF('Yab. Dil. Öğr. Gör. Sonuç'!M57=\"\",\"\",'Yab. Dil. Öğr. Gör. Sonuç'!M57)","v":""},{"$f":"IF('Yab. Dil. Öğr. Gör. Sonuç'!N57=\"\",\"\",'Yab. Dil. Öğr. Gör. Sonuç'!N57)","v":""}]
[{"$f":"IF('Yab. Dil. Öğr. Gör. Sonuç'!A58=\"\",\"\",'Yab. Dil. Öğr. Gör. Sonuç'!A58)","v":""},{"$f":"IF('Yab. Dil. Öğr. Gör. Sonuç'!B58=\"\",\"\",LEFT('Yab. Dil. Öğr. Gör. Sonuç'!B58,3)&REPT(\"*\",4)&RIGHT('Yab. Dil. Öğr. Gör. Sonuç'!B58,2))","v":""},{"$f":"IF('Yab. Dil. Öğr. Gör. Sonuç'!C58=\"\",\"\",IF(ISERR(FIND(\" \",'Yab. Dil. Öğr. Gör. Sonuç'!C58))=TRUE,LEFT('Yab. Dil. Öğr. Gör. Sonuç'!C58,2)&REPT(\"*\",3),LEFT('Yab. Dil. Öğr. Gör. Sonuç'!C58,2)&REPT(\"*\",3)&\" \"&MID('Yab. Dil. Öğr. Gör. Sonuç'!C58,FIND(\" \",'Yab. Dil. Öğr. Gör. Sonuç'!C58)+1,2)&REPT(\"*\",3)))","v":""},{"$f":"IF('Yab. Dil. Öğr. Gör. Sonuç'!D58=\"\",\"\",IF(ISERR(FIND(\" \",'Yab. Dil. Öğr. Gör. Sonuç'!D58))=TRUE,LEFT('Yab. Dil. Öğr. Gör. Sonuç'!D58,2)&REPT(\"*\",3),LEFT('Yab. Dil. Öğr. Gör. Sonuç'!D58,2)&REPT(\"*\",3)&\" \"&MID('Yab. Dil. Öğr. Gör. Sonuç'!D58,FIND(\" \",'Yab. Dil. Öğr. Gör. Sonuç'!D58)+1,2)&REPT(\"*\",3)))","v":""},{"$f":"IF('Yab. Dil. Öğr. Gör. Sonuç'!E58=\"\",\"\",'Yab. Dil. Öğr. Gör. Sonuç'!E58)","v":""},{"$f":"IF('Yab. Dil. Öğr. Gör. Sonuç'!F58=\"\",\"\",'Yab. Dil. Öğr. Gör. Sonuç'!F58)","v":""},{"$f":"IF('Yab. Dil. Öğr. Gör. Sonuç'!G58=\"\",\"\",'Yab. Dil. Öğr. Gör. Sonuç'!G58)","v":""},{"$f":"IF('Yab. Dil. Öğr. Gör. Sonuç'!H58=\"\",\"\",'Yab. Dil. Öğr. Gör. Sonuç'!H58)","v":""},{"$f":"IF('Yab. Dil. Öğr. Gör. Sonuç'!I58=\"\",\"\",'Yab. Dil. Öğr. Gör. Sonuç'!I58)","v":""},{"$f":"IF('Yab. Dil. Öğr. Gör. Sonuç'!J58=\"\",\"\",'Yab. Dil. Öğr. Gör. Sonuç'!J58)","v":""},{"$f":"IF('Yab. Dil. Öğr. Gör. Sonuç'!K58=\"\",\"\",'Yab. Dil. Öğr. Gör. Sonuç'!K58)","v":""},{"$f":"IF('Yab. Dil. Öğr. Gör. Sonuç'!L58=\"\",\"\",'Yab. Dil. Öğr. Gör. Sonuç'!L58)","v":""},{"$f":"IF('Yab. Dil. Öğr. Gör. Sonuç'!M58=\"\",\"\",'Yab. Dil. Öğr. Gör. Sonuç'!M58)","v":""},{"$f":"IF('Yab. Dil. Öğr. Gör. Sonuç'!N58=\"\",\"\",'Yab. Dil. Öğr. Gör. Sonuç'!N58)","v":""}]
[{"$f":"IF('Yab. Dil. Öğr. Gör. Sonuç'!A59=\"\",\"\",'Yab. Dil. Öğr. Gör. Sonuç'!A59)","v":""},{"$f":"IF('Yab. Dil. Öğr. Gör. Sonuç'!B59=\"\",\"\",LEFT('Yab. Dil. Öğr. Gör. Sonuç'!B59,3)&REPT(\"*\",4)&RIGHT('Yab. Dil. Öğr. Gör. Sonuç'!B59,2))","v":""},{"$f":"IF('Yab. Dil. Öğr. Gör. Sonuç'!C59=\"\",\"\",IF(ISERR(FIND(\" \",'Yab. Dil. Öğr. Gör. Sonuç'!C59))=TRUE,LEFT('Yab. Dil. Öğr. Gör. Sonuç'!C59,2)&REPT(\"*\",3),LEFT('Yab. Dil. Öğr. Gör. Sonuç'!C59,2)&REPT(\"*\",3)&\" \"&MID('Yab. Dil. Öğr. Gör. Sonuç'!C59,FIND(\" \",'Yab. Dil. Öğr. Gör. Sonuç'!C59)+1,2)&REPT(\"*\",3)))","v":""},{"$f":"IF('Yab. Dil. Öğr. Gör. Sonuç'!D59=\"\",\"\",IF(ISERR(FIND(\" \",'Yab. Dil. Öğr. Gör. Sonuç'!D59))=TRUE,LEFT('Yab. Dil. Öğr. Gör. Sonuç'!D59,2)&REPT(\"*\",3),LEFT('Yab. Dil. Öğr. Gör. Sonuç'!D59,2)&REPT(\"*\",3)&\" \"&MID('Yab. Dil. Öğr. Gör. Sonuç'!D59,FIND(\" \",'Yab. Dil. Öğr. Gör. Sonuç'!D59)+1,2)&REPT(\"*\",3)))","v":""},{"$f":"IF('Yab. Dil. Öğr. Gör. Sonuç'!E59=\"\",\"\",'Yab. Dil. Öğr. Gör. Sonuç'!E59)","v":""},{"$f":"IF('Yab. Dil. Öğr. Gör. Sonuç'!F59=\"\",\"\",'Yab. Dil. Öğr. Gör. Sonuç'!F59)","v":""},{"$f":"IF('Yab. Dil. Öğr. Gör. Sonuç'!G59=\"\",\"\",'Yab. Dil. Öğr. Gör. Sonuç'!G59)","v":""},{"$f":"IF('Yab. Dil. Öğr. Gör. Sonuç'!H59=\"\",\"\",'Yab. Dil. Öğr. Gör. Sonuç'!H59)","v":""},{"$f":"IF('Yab. Dil. Öğr. Gör. Sonuç'!I59=\"\",\"\",'Yab. Dil. Öğr. Gör. Sonuç'!I59)","v":""},{"$f":"IF('Yab. Dil. Öğr. Gör. Sonuç'!J59=\"\",\"\",'Yab. Dil. Öğr. Gör. Sonuç'!J59)","v":""},{"$f":"IF('Yab. Dil. Öğr. Gör. Sonuç'!K59=\"\",\"\",'Yab. Dil. Öğr. Gör. Sonuç'!K59)","v":""},{"$f":"IF('Yab. Dil. Öğr. Gör. Sonuç'!L59=\"\",\"\",'Yab. Dil. Öğr. Gör. Sonuç'!L59)","v":""},{"$f":"IF('Yab. Dil. Öğr. Gör. Sonuç'!M59=\"\",\"\",'Yab. Dil. Öğr. Gör. Sonuç'!M59)","v":""},{"$f":"IF('Yab. Dil. Öğr. Gör. Sonuç'!N59=\"\",\"\",'Yab. Dil. Öğr. Gör. Sonuç'!N59)","v":""}]
[{"$f":"IF('Yab. Dil. Öğr. Gör. Sonuç'!A60=\"\",\"\",'Yab. Dil. Öğr. Gör. Sonuç'!A60)","v":""},{"$f":"IF('Yab. Dil. Öğr. Gör. Sonuç'!B60=\"\",\"\",LEFT('Yab. Dil. Öğr. Gör. Sonuç'!B60,3)&REPT(\"*\",4)&RIGHT('Yab. Dil. Öğr. Gör. Sonuç'!B60,2))","v":""},{"$f":"IF('Yab. Dil. Öğr. Gör. Sonuç'!C60=\"\",\"\",IF(ISERR(FIND(\" \",'Yab. Dil. Öğr. Gör. Sonuç'!C60))=TRUE,LEFT('Yab. Dil. Öğr. Gör. Sonuç'!C60,2)&REPT(\"*\",3),LEFT('Yab. Dil. Öğr. Gör. Sonuç'!C60,2)&REPT(\"*\",3)&\" \"&MID('Yab. Dil. Öğr. Gör. Sonuç'!C60,FIND(\" \",'Yab. Dil. Öğr. Gör. Sonuç'!C60)+1,2)&REPT(\"*\",3)))","v":""},{"$f":"IF('Yab. Dil. Öğr. Gör. Sonuç'!D60=\"\",\"\",IF(ISERR(FIND(\" \",'Yab. Dil. Öğr. Gör. Sonuç'!D60))=TRUE,LEFT('Yab. Dil. Öğr. Gör. Sonuç'!D60,2)&REPT(\"*\",3),LEFT('Yab. Dil. Öğr. Gör. Sonuç'!D60,2)&REPT(\"*\",3)&\" \"&MID('Yab. Dil. Öğr. Gör. Sonuç'!D60,FIND(\" \",'Yab. Dil. Öğr. Gör. Sonuç'!D60)+1,2)&REPT(\"*\",3)))","v":""},{"$f":"IF('Yab. Dil. Öğr. Gör. Sonuç'!E60=\"\",\"\",'Yab. Dil. Öğr. Gör. Sonuç'!E60)","v":""},{"$f":"IF('Yab. Dil. Öğr. Gör. Sonuç'!F60=\"\",\"\",'Yab. Dil. Öğr. Gör. Sonuç'!F60)","v":""},{"$f":"IF('Yab. Dil. Öğr. Gör. Sonuç'!G60=\"\",\"\",'Yab. Dil. Öğr. Gör. Sonuç'!G60)","v":""},{"$f":"IF('Yab. Dil. Öğr. Gör. Sonuç'!H60=\"\",\"\",'Yab. Dil. Öğr. Gör. Sonuç'!H60)","v":""},{"$f":"IF('Yab. Dil. Öğr. Gör. Sonuç'!I60=\"\",\"\",'Yab. Dil. Öğr. Gör. Sonuç'!I60)","v":""},{"$f":"IF('Yab. Dil. Öğr. Gör. Sonuç'!J60=\"\",\"\",'Yab. Dil. Öğr. Gör. Sonuç'!J60)","v":""},{"$f":"IF('Yab. Dil. Öğr. Gör. Sonuç'!K60=\"\",\"\",'Yab. Dil. Öğr. Gör. Sonuç'!K60)","v":""},{"$f":"IF('Yab. Dil. Öğr. Gör. Sonuç'!L60=\"\",\"\",'Yab. Dil. Öğr. Gör. Sonuç'!L60)","v":""},{"$f":"IF('Yab. Dil. Öğr. Gör. Sonuç'!M60=\"\",\"\",'Yab. Dil. Öğr. Gör. Sonuç'!M60)","v":""},{"$f":"IF('Yab. Dil. Öğr. Gör. Sonuç'!N60=\"\",\"\",'Yab. Dil. Öğr. Gör. Sonuç'!N60)","v":""}]
[{"$f":"IF('Yab. Dil. Öğr. Gör. Sonuç'!A61=\"\",\"\",'Yab. Dil. Öğr. Gör. Sonuç'!A61)","v":""},{"$f":"IF('Yab. Dil. Öğr. Gör. Sonuç'!B61=\"\",\"\",LEFT('Yab. Dil. Öğr. Gör. Sonuç'!B61,3)&REPT(\"*\",4)&RIGHT('Yab. Dil. Öğr. Gör. Sonuç'!B61,2))","v":""},{"$f":"IF('Yab. Dil. Öğr. Gör. Sonuç'!C61=\"\",\"\",IF(ISERR(FIND(\" \",'Yab. Dil. Öğr. Gör. Sonuç'!C61))=TRUE,LEFT('Yab. Dil. Öğr. Gör. Sonuç'!C61,2)&REPT(\"*\",3),LEFT('Yab. Dil. Öğr. Gör. Sonuç'!C61,2)&REPT(\"*\",3)&\" \"&MID('Yab. Dil. Öğr. Gör. Sonuç'!C61,FIND(\" \",'Yab. Dil. Öğr. Gör. Sonuç'!C61)+1,2)&REPT(\"*\",3)))","v":""},{"$f":"IF('Yab. Dil. Öğr. Gör. Sonuç'!D61=\"\",\"\",IF(ISERR(FIND(\" \",'Yab. Dil. Öğr. Gör. Sonuç'!D61))=TRUE,LEFT('Yab. Dil. Öğr. Gör. Sonuç'!D61,2)&REPT(\"*\",3),LEFT('Yab. Dil. Öğr. Gör. Sonuç'!D61,2)&REPT(\"*\",3)&\" \"&MID('Yab. Dil. Öğr. Gör. Sonuç'!D61,FIND(\" \",'Yab. Dil. Öğr. Gör. Sonuç'!D61)+1,2)&REPT(\"*\",3)))","v":""},{"$f":"IF('Yab. Dil. Öğr. Gör. Sonuç'!E61=\"\",\"\",'Yab. Dil. Öğr. Gör. Sonuç'!E61)","v":""},{"$f":"IF('Yab. Dil. Öğr. Gör. Sonuç'!F61=\"\",\"\",'Yab. Dil. Öğr. Gör. Sonuç'!F61)","v":""},{"$f":"IF('Yab. Dil. Öğr. Gör. Sonuç'!G61=\"\",\"\",'Yab. Dil. Öğr. Gör. Sonuç'!G61)","v":""},{"$f":"IF('Yab. Dil. Öğr. Gör. Sonuç'!H61=\"\",\"\",'Yab. Dil. Öğr. Gör. Sonuç'!H61)","v":""},{"$f":"IF('Yab. Dil. Öğr. Gör. Sonuç'!I61=\"\",\"\",'Yab. Dil. Öğr. Gör. Sonuç'!I61)","v":""},{"$f":"IF('Yab. Dil. Öğr. Gör. Sonuç'!J61=\"\",\"\",'Yab. Dil. Öğr. Gör. Sonuç'!J61)","v":""},{"$f":"IF('Yab. Dil. Öğr. Gör. Sonuç'!K61=\"\",\"\",'Yab. Dil. Öğr. Gör. Sonuç'!K61)","v":""},{"$f":"IF('Yab. Dil. Öğr. Gör. Sonuç'!L61=\"\",\"\",'Yab. Dil. Öğr. Gör. Sonuç'!L61)","v":""},{"$f":"IF('Yab. Dil. Öğr. Gör. Sonuç'!M61=\"\",\"\",'Yab. Dil. Öğr. Gör. Sonuç'!M61)","v":""},{"$f":"IF('Yab. Dil. Öğr. Gör. Sonuç'!N61=\"\",\"\",'Yab. Dil. Öğr. Gör. Sonuç'!N61)","v":""}]
[{"$f":"IF('Yab. Dil. Öğr. Gör. Sonuç'!A62=\"\",\"\",'Yab. Dil. Öğr. Gör. Sonuç'!A62)","v":""},{"$f":"IF('Yab. Dil. Öğr. Gör. Sonuç'!B62=\"\",\"\",LEFT('Yab. Dil. Öğr. Gör. Sonuç'!B62,3)&REPT(\"*\",4)&RIGHT('Yab. Dil. Öğr. Gör. Sonuç'!B62,2))","v":""},{"$f":"IF('Yab. Dil. Öğr. Gör. Sonuç'!C62=\"\",\"\",IF(ISERR(FIND(\" \",'Yab. Dil. Öğr. Gör. Sonuç'!C62))=TRUE,LEFT('Yab. Dil. Öğr. Gör. Sonuç'!C62,2)&REPT(\"*\",3),LEFT('Yab. Dil. Öğr. Gör. Sonuç'!C62,2)&REPT(\"*\",3)&\" \"&MID('Yab. Dil. Öğr. Gör. Sonuç'!C62,FIND(\" \",'Yab. Dil. Öğr. Gör. Sonuç'!C62)+1,2)&REPT(\"*\",3)))","v":""},{"$f":"IF('Yab. Dil. Öğr. Gör. Sonuç'!D62=\"\",\"\",IF(ISERR(FIND(\" \",'Yab. Dil. Öğr. Gör. Sonuç'!D62))=TRUE,LEFT('Yab. Dil. Öğr. Gör. Sonuç'!D62,2)&REPT(\"*\",3),LEFT('Yab. Dil. Öğr. Gör. Sonuç'!D62,2)&REPT(\"*\",3)&\" \"&MID('Yab. Dil. Öğr. Gör. Sonuç'!D62,FIND(\" \",'Yab. Dil. Öğr. Gör. Sonuç'!D62)+1,2)&REPT(\"*\",3)))","v":""},{"$f":"IF('Yab. Dil. Öğr. Gör. Sonuç'!E62=\"\",\"\",'Yab. Dil. Öğr. Gör. Sonuç'!E62)","v":""},{"$f":"IF('Yab. Dil. Öğr. Gör. Sonuç'!F62=\"\",\"\",'Yab. Dil. Öğr. Gör. Sonuç'!F62)","v":""},{"$f":"IF('Yab. Dil. Öğr. Gör. Sonuç'!G62=\"\",\"\",'Yab. Dil. Öğr. Gör. Sonuç'!G62)","v":""},{"$f":"IF('Yab. Dil. Öğr. Gör. Sonuç'!H62=\"\",\"\",'Yab. Dil. Öğr. Gör. Sonuç'!H62)","v":""},{"$f":"IF('Yab. Dil. Öğr. Gör. Sonuç'!I62=\"\",\"\",'Yab. Dil. Öğr. Gör. Sonuç'!I62)","v":""},{"$f":"IF('Yab. Dil. Öğr. Gör. Sonuç'!J62=\"\",\"\",'Yab. Dil. Öğr. Gör. Sonuç'!J62)","v":""},{"$f":"IF('Yab. Dil. Öğr. Gör. Sonuç'!K62=\"\",\"\",'Yab. Dil. Öğr. Gör. Sonuç'!K62)","v":""},{"$f":"IF('Yab. Dil. Öğr. Gör. Sonuç'!L62=\"\",\"\",'Yab. Dil. Öğr. Gör. Sonuç'!L62)","v":""},{"$f":"IF('Yab. Dil. Öğr. Gör. Sonuç'!M62=\"\",\"\",'Yab. Dil. Öğr. Gör. Sonuç'!M62)","v":""},{"$f":"IF('Yab. Dil. Öğr. Gör. Sonuç'!N62=\"\",\"\",'Yab. Dil. Öğr. Gör. Sonuç'!N62)","v":""}]
[{"$f":"IF('Yab. Dil. Öğr. Gör. Sonuç'!A63=\"\",\"\",'Yab. Dil. Öğr. Gör. Sonuç'!A63)","v":""},{"$f":"IF('Yab. Dil. Öğr. Gör. Sonuç'!B63=\"\",\"\",LEFT('Yab. Dil. Öğr. Gör. Sonuç'!B63,3)&REPT(\"*\",4)&RIGHT('Yab. Dil. Öğr. Gör. Sonuç'!B63,2))","v":""},{"$f":"IF('Yab. Dil. Öğr. Gör. Sonuç'!C63=\"\",\"\",IF(ISERR(FIND(\" \",'Yab. Dil. Öğr. Gör. Sonuç'!C63))=TRUE,LEFT('Yab. Dil. Öğr. Gör. Sonuç'!C63,2)&REPT(\"*\",3),LEFT('Yab. Dil. Öğr. Gör. Sonuç'!C63,2)&REPT(\"*\",3)&\" \"&MID('Yab. Dil. Öğr. Gör. Sonuç'!C63,FIND(\" \",'Yab. Dil. Öğr. Gör. Sonuç'!C63)+1,2)&REPT(\"*\",3)))","v":""},{"$f":"IF('Yab. Dil. Öğr. Gör. Sonuç'!D63=\"\",\"\",IF(ISERR(FIND(\" \",'Yab. Dil. Öğr. Gör. Sonuç'!D63))=TRUE,LEFT('Yab. Dil. Öğr. Gör. Sonuç'!D63,2)&REPT(\"*\",3),LEFT('Yab. Dil. Öğr. Gör. Sonuç'!D63,2)&REPT(\"*\",3)&\" \"&MID('Yab. Dil. Öğr. Gör. Sonuç'!D63,FIND(\" \",'Yab. Dil. Öğr. Gör. Sonuç'!D63)+1,2)&REPT(\"*\",3)))","v":""},{"$f":"IF('Yab. Dil. Öğr. Gör. Sonuç'!E63=\"\",\"\",'Yab. Dil. Öğr. Gör. Sonuç'!E63)","v":""},{"$f":"IF('Yab. Dil. Öğr. Gör. Sonuç'!F63=\"\",\"\",'Yab. Dil. Öğr. Gör. Sonuç'!F63)","v":""},{"$f":"IF('Yab. Dil. Öğr. Gör. Sonuç'!G63=\"\",\"\",'Yab. Dil. Öğr. Gör. Sonuç'!G63)","v":""},{"$f":"IF('Yab. Dil. Öğr. Gör. Sonuç'!H63=\"\",\"\",'Yab. Dil. Öğr. Gör. Sonuç'!H63)","v":""},{"$f":"IF('Yab. Dil. Öğr. Gör. Sonuç'!I63=\"\",\"\",'Yab. Dil. Öğr. Gör. Sonuç'!I63)","v":""},{"$f":"IF('Yab. Dil. Öğr. Gör. Sonuç'!J63=\"\",\"\",'Yab. Dil. Öğr. Gör. Sonuç'!J63)","v":""},{"$f":"IF('Yab. Dil. Öğr. Gör. Sonuç'!K63=\"\",\"\",'Yab. Dil. Öğr. Gör. Sonuç'!K63)","v":""},{"$f":"IF('Yab. Dil. Öğr. Gör. Sonuç'!L63=\"\",\"\",'Yab. Dil. Öğr. Gör. Sonuç'!L63)","v":""},{"$f":"IF('Yab. Dil. Öğr. Gör. Sonuç'!M63=\"\",\"\",'Yab. Dil. Öğr. Gör. Sonuç'!M63)","v":""},{"$f":"IF('Yab. Dil. Öğr. Gör. Sonuç'!N63=\"\",\"\",'Yab. Dil. Öğr. Gör. Sonuç'!N63)","v":""}]
[{"$f":"IF('Yab. Dil. Öğr. Gör. Sonuç'!A64=\"\",\"\",'Yab. Dil. Öğr. Gör. Sonuç'!A64)","v":""},{"$f":"IF('Yab. Dil. Öğr. Gör. Sonuç'!B64=\"\",\"\",LEFT('Yab. Dil. Öğr. Gör. Sonuç'!B64,3)&REPT(\"*\",4)&RIGHT('Yab. Dil. Öğr. Gör. Sonuç'!B64,2))","v":""},{"$f":"IF('Yab. Dil. Öğr. Gör. Sonuç'!C64=\"\",\"\",IF(ISERR(FIND(\" \",'Yab. Dil. Öğr. Gör. Sonuç'!C64))=TRUE,LEFT('Yab. Dil. Öğr. Gör. Sonuç'!C64,2)&REPT(\"*\",3),LEFT('Yab. Dil. Öğr. Gör. Sonuç'!C64,2)&REPT(\"*\",3)&\" \"&MID('Yab. Dil. Öğr. Gör. Sonuç'!C64,FIND(\" \",'Yab. Dil. Öğr. Gör. Sonuç'!C64)+1,2)&REPT(\"*\",3)))","v":""},{"$f":"IF('Yab. Dil. Öğr. Gör. Sonuç'!D64=\"\",\"\",IF(ISERR(FIND(\" \",'Yab. Dil. Öğr. Gör. Sonuç'!D64))=TRUE,LEFT('Yab. Dil. Öğr. Gör. Sonuç'!D64,2)&REPT(\"*\",3),LEFT('Yab. Dil. Öğr. Gör. Sonuç'!D64,2)&REPT(\"*\",3)&\" \"&MID('Yab. Dil. Öğr. Gör. Sonuç'!D64,FIND(\" \",'Yab. Dil. Öğr. Gör. Sonuç'!D64)+1,2)&REPT(\"*\",3)))","v":""},{"$f":"IF('Yab. Dil. Öğr. Gör. Sonuç'!E64=\"\",\"\",'Yab. Dil. Öğr. Gör. Sonuç'!E64)","v":""},{"$f":"IF('Yab. Dil. Öğr. Gör. Sonuç'!F64=\"\",\"\",'Yab. Dil. Öğr. Gör. Sonuç'!F64)","v":""},{"$f":"IF('Yab. Dil. Öğr. Gör. Sonuç'!G64=\"\",\"\",'Yab. Dil. Öğr. Gör. Sonuç'!G64)","v":""},{"$f":"IF('Yab. Dil. Öğr. Gör. Sonuç'!H64=\"\",\"\",'Yab. Dil. Öğr. Gör. Sonuç'!H64)","v":""},{"$f":"IF('Yab. Dil. Öğr. Gör. Sonuç'!I64=\"\",\"\",'Yab. Dil. Öğr. Gör. Sonuç'!I64)","v":""},{"$f":"IF('Yab. Dil. Öğr. Gör. Sonuç'!J64=\"\",\"\",'Yab. Dil. Öğr. Gör. Sonuç'!J64)","v":""},{"$f":"IF('Yab. Dil. Öğr. Gör. Sonuç'!K64=\"\",\"\",'Yab. Dil. Öğr. Gör. Sonuç'!K64)","v":""},{"$f":"IF('Yab. Dil. Öğr. Gör. Sonuç'!L64=\"\",\"\",'Yab. Dil. Öğr. Gör. Sonuç'!L64)","v":""},{"$f":"IF('Yab. Dil. Öğr. Gör. Sonuç'!M64=\"\",\"\",'Yab. Dil. Öğr. Gör. Sonuç'!M64)","v":""},{"$f":"IF('Yab. Dil. Öğr. Gör. Sonuç'!N64=\"\",\"\",'Yab. Dil. Öğr. Gör. Sonuç'!N64)","v":""}]
[{"$f":"IF('Yab. Dil. Öğr. Gör. Sonuç'!A65=\"\",\"\",'Yab. Dil. Öğr. Gör. Sonuç'!A65)","v":""},{"$f":"IF('Yab. Dil. Öğr. Gör. Sonuç'!B65=\"\",\"\",LEFT('Yab. Dil. Öğr. Gör. Sonuç'!B65,3)&REPT(\"*\",4)&RIGHT('Yab. Dil. Öğr. Gör. Sonuç'!B65,2))","v":""},{"$f":"IF('Yab. Dil. Öğr. Gör. Sonuç'!C65=\"\",\"\",IF(ISERR(FIND(\" \",'Yab. Dil. Öğr. Gör. Sonuç'!C65))=TRUE,LEFT('Yab. Dil. Öğr. Gör. Sonuç'!C65,2)&REPT(\"*\",3),LEFT('Yab. Dil. Öğr. Gör. Sonuç'!C65,2)&REPT(\"*\",3)&\" \"&MID('Yab. Dil. Öğr. Gör. Sonuç'!C65,FIND(\" \",'Yab. Dil. Öğr. Gör. Sonuç'!C65)+1,2)&REPT(\"*\",3)))","v":""},{"$f":"IF('Yab. Dil. Öğr. Gör. Sonuç'!D65=\"\",\"\",IF(ISERR(FIND(\" \",'Yab. Dil. Öğr. Gör. Sonuç'!D65))=TRUE,LEFT('Yab. Dil. Öğr. Gör. Sonuç'!D65,2)&REPT(\"*\",3),LEFT('Yab. Dil. Öğr. Gör. Sonuç'!D65,2)&REPT(\"*\",3)&\" \"&MID('Yab. Dil. Öğr. Gör. Sonuç'!D65,FIND(\" \",'Yab. Dil. Öğr. Gör. Sonuç'!D65)+1,2)&REPT(\"*\",3)))","v":""},{"$f":"IF('Yab. Dil. Öğr. Gör. Sonuç'!E65=\"\",\"\",'Yab. Dil. Öğr. Gör. Sonuç'!E65)","v":""},{"$f":"IF('Yab. Dil. Öğr. Gör. Sonuç'!F65=\"\",\"\",'Yab. Dil. Öğr. Gör. Sonuç'!F65)","v":""},{"$f":"IF('Yab. Dil. Öğr. Gör. Sonuç'!G65=\"\",\"\",'Yab. Dil. Öğr. Gör. Sonuç'!G65)","v":""},{"$f":"IF('Yab. Dil. Öğr. Gör. Sonuç'!H65=\"\",\"\",'Yab. Dil. Öğr. Gör. Sonuç'!H65)","v":""},{"$f":"IF('Yab. Dil. Öğr. Gör. Sonuç'!I65=\"\",\"\",'Yab. Dil. Öğr. Gör. Sonuç'!I65)","v":""},{"$f":"IF('Yab. Dil. Öğr. Gör. Sonuç'!J65=\"\",\"\",'Yab. Dil. Öğr. Gör. Sonuç'!J65)","v":""},{"$f":"IF('Yab. Dil. Öğr. Gör. Sonuç'!K65=\"\",\"\",'Yab. Dil. Öğr. Gör. Sonuç'!K65)","v":""},{"$f":"IF('Yab. Dil. Öğr. Gör. Sonuç'!L65=\"\",\"\",'Yab. Dil. Öğr. Gör. Sonuç'!L65)","v":""},{"$f":"IF('Yab. Dil. Öğr. Gör. Sonuç'!M65=\"\",\"\",'Yab. Dil. Öğr. Gör. Sonuç'!M65)","v":""},{"$f":"IF('Yab. Dil. Öğr. Gör. Sonuç'!N65=\"\",\"\",'Yab. Dil. Öğr. Gör. Sonuç'!N65)","v":""}]
[{"$f":"IF('Yab. Dil. Öğr. Gör. Sonuç'!A66=\"\",\"\",'Yab. Dil. Öğr. Gör. Sonuç'!A66)","v":""},{"$f":"IF('Yab. Dil. Öğr. Gör. Sonuç'!B66=\"\",\"\",LEFT('Yab. Dil. Öğr. Gör. Sonuç'!B66,3)&REPT(\"*\",4)&RIGHT('Yab. Dil. Öğr. Gör. Sonuç'!B66,2))","v":""},{"$f":"IF('Yab. Dil. Öğr. Gör. Sonuç'!C66=\"\",\"\",IF(ISERR(FIND(\" \",'Yab. Dil. Öğr. Gör. Sonuç'!C66))=TRUE,LEFT('Yab. Dil. Öğr. Gör. Sonuç'!C66,2)&REPT(\"*\",3),LEFT('Yab. Dil. Öğr. Gör. Sonuç'!C66,2)&REPT(\"*\",3)&\" \"&MID('Yab. Dil. Öğr. Gör. Sonuç'!C66,FIND(\" \",'Yab. Dil. Öğr. Gör. Sonuç'!C66)+1,2)&REPT(\"*\",3)))","v":""},{"$f":"IF('Yab. Dil. Öğr. Gör. Sonuç'!D66=\"\",\"\",IF(ISERR(FIND(\" \",'Yab. Dil. Öğr. Gör. Sonuç'!D66))=TRUE,LEFT('Yab. Dil. Öğr. Gör. Sonuç'!D66,2)&REPT(\"*\",3),LEFT('Yab. Dil. Öğr. Gör. Sonuç'!D66,2)&REPT(\"*\",3)&\" \"&MID('Yab. Dil. Öğr. Gör. Sonuç'!D66,FIND(\" \",'Yab. Dil. Öğr. Gör. Sonuç'!D66)+1,2)&REPT(\"*\",3)))","v":""},{"$f":"IF('Yab. Dil. Öğr. Gör. Sonuç'!E66=\"\",\"\",'Yab. Dil. Öğr. Gör. Sonuç'!E66)","v":""},{"$f":"IF('Yab. Dil. Öğr. Gör. Sonuç'!F66=\"\",\"\",'Yab. Dil. Öğr. Gör. Sonuç'!F66)","v":""},{"$f":"IF('Yab. Dil. Öğr. Gör. Sonuç'!G66=\"\",\"\",'Yab. Dil. Öğr. Gör. Sonuç'!G66)","v":""},{"$f":"IF('Yab. Dil. Öğr. Gör. Sonuç'!H66=\"\",\"\",'Yab. Dil. Öğr. Gör. Sonuç'!H66)","v":""},{"$f":"IF('Yab. Dil. Öğr. Gör. Sonuç'!I66=\"\",\"\",'Yab. Dil. Öğr. Gör. Sonuç'!I66)","v":""},{"$f":"IF('Yab. Dil. Öğr. Gör. Sonuç'!J66=\"\",\"\",'Yab. Dil. Öğr. Gör. Sonuç'!J66)","v":""},{"$f":"IF('Yab. Dil. Öğr. Gör. Sonuç'!K66=\"\",\"\",'Yab. Dil. Öğr. Gör. Sonuç'!K66)","v":""},{"$f":"IF('Yab. Dil. Öğr. Gör. Sonuç'!L66=\"\",\"\",'Yab. Dil. Öğr. Gör. Sonuç'!L66)","v":""},{"$f":"IF('Yab. Dil. Öğr. Gör. Sonuç'!M66=\"\",\"\",'Yab. Dil. Öğr. Gör. Sonuç'!M66)","v":""},{"$f":"IF('Yab. Dil. Öğr. Gör. Sonuç'!N66=\"\",\"\",'Yab. Dil. Öğr. Gör. Sonuç'!N66)","v":""}]
[{"$f":"IF('Yab. Dil. Öğr. Gör. Sonuç'!A67=\"\",\"\",'Yab. Dil. Öğr. Gör. Sonuç'!A67)","v":""},{"$f":"IF('Yab. Dil. Öğr. Gör. Sonuç'!B67=\"\",\"\",LEFT('Yab. Dil. Öğr. Gör. Sonuç'!B67,3)&REPT(\"*\",4)&RIGHT('Yab. Dil. Öğr. Gör. Sonuç'!B67,2))","v":""},{"$f":"IF('Yab. Dil. Öğr. Gör. Sonuç'!C67=\"\",\"\",IF(ISERR(FIND(\" \",'Yab. Dil. Öğr. Gör. Sonuç'!C67))=TRUE,LEFT('Yab. Dil. Öğr. Gör. Sonuç'!C67,2)&REPT(\"*\",3),LEFT('Yab. Dil. Öğr. Gör. Sonuç'!C67,2)&REPT(\"*\",3)&\" \"&MID('Yab. Dil. Öğr. Gör. Sonuç'!C67,FIND(\" \",'Yab. Dil. Öğr. Gör. Sonuç'!C67)+1,2)&REPT(\"*\",3)))","v":""},{"$f":"IF('Yab. Dil. Öğr. Gör. Sonuç'!D67=\"\",\"\",IF(ISERR(FIND(\" \",'Yab. Dil. Öğr. Gör. Sonuç'!D67))=TRUE,LEFT('Yab. Dil. Öğr. Gör. Sonuç'!D67,2)&REPT(\"*\",3),LEFT('Yab. Dil. Öğr. Gör. Sonuç'!D67,2)&REPT(\"*\",3)&\" \"&MID('Yab. Dil. Öğr. Gör. Sonuç'!D67,FIND(\" \",'Yab. Dil. Öğr. Gör. Sonuç'!D67)+1,2)&REPT(\"*\",3)))","v":""},{"$f":"IF('Yab. Dil. Öğr. Gör. Sonuç'!E67=\"\",\"\",'Yab. Dil. Öğr. Gör. Sonuç'!E67)","v":""},{"$f":"IF('Yab. Dil. Öğr. Gör. Sonuç'!F67=\"\",\"\",'Yab. Dil. Öğr. Gör. Sonuç'!F67)","v":""},{"$f":"IF('Yab. Dil. Öğr. Gör. Sonuç'!G67=\"\",\"\",'Yab. Dil. Öğr. Gör. Sonuç'!G67)","v":""},{"$f":"IF('Yab. Dil. Öğr. Gör. Sonuç'!H67=\"\",\"\",'Yab. Dil. Öğr. Gör. Sonuç'!H67)","v":""},{"$f":"IF('Yab. Dil. Öğr. Gör. Sonuç'!I67=\"\",\"\",'Yab. Dil. Öğr. Gör. Sonuç'!I67)","v":""},{"$f":"IF('Yab. Dil. Öğr. Gör. Sonuç'!J67=\"\",\"\",'Yab. Dil. Öğr. Gör. Sonuç'!J67)","v":""},{"$f":"IF('Yab. Dil. Öğr. Gör. Sonuç'!K67=\"\",\"\",'Yab. Dil. Öğr. Gör. Sonuç'!K67)","v":""},{"$f":"IF('Yab. Dil. Öğr. Gör. Sonuç'!L67=\"\",\"\",'Yab. Dil. Öğr. Gör. Sonuç'!L67)","v":""},{"$f":"IF('Yab. Dil. Öğr. Gör. Sonuç'!M67=\"\",\"\",'Yab. Dil. Öğr. Gör. Sonuç'!M67)","v":""},{"$f":"IF('Yab. Dil. Öğr. Gör. Sonuç'!N67=\"\",\"\",'Yab. Dil. Öğr. Gör. Sonuç'!N67)","v":""}]
[{"$f":"IF('Yab. Dil. Öğr. Gör. Sonuç'!A68=\"\",\"\",'Yab. Dil. Öğr. Gör. Sonuç'!A68)","v":""},{"$f":"IF('Yab. Dil. Öğr. Gör. Sonuç'!B68=\"\",\"\",LEFT('Yab. Dil. Öğr. Gör. Sonuç'!B68,3)&REPT(\"*\",4)&RIGHT('Yab. Dil. Öğr. Gör. Sonuç'!B68,2))","v":""},{"$f":"IF('Yab. Dil. Öğr. Gör. Sonuç'!C68=\"\",\"\",IF(ISERR(FIND(\" \",'Yab. Dil. Öğr. Gör. Sonuç'!C68))=TRUE,LEFT('Yab. Dil. Öğr. Gör. Sonuç'!C68,2)&REPT(\"*\",3),LEFT('Yab. Dil. Öğr. Gör. Sonuç'!C68,2)&REPT(\"*\",3)&\" \"&MID('Yab. Dil. Öğr. Gör. Sonuç'!C68,FIND(\" \",'Yab. Dil. Öğr. Gör. Sonuç'!C68)+1,2)&REPT(\"*\",3)))","v":""},{"$f":"IF('Yab. Dil. Öğr. Gör. Sonuç'!D68=\"\",\"\",IF(ISERR(FIND(\" \",'Yab. Dil. Öğr. Gör. Sonuç'!D68))=TRUE,LEFT('Yab. Dil. Öğr. Gör. Sonuç'!D68,2)&REPT(\"*\",3),LEFT('Yab. Dil. Öğr. Gör. Sonuç'!D68,2)&REPT(\"*\",3)&\" \"&MID('Yab. Dil. Öğr. Gör. Sonuç'!D68,FIND(\" \",'Yab. Dil. Öğr. Gör. Sonuç'!D68)+1,2)&REPT(\"*\",3)))","v":""},{"$f":"IF('Yab. Dil. Öğr. Gör. Sonuç'!E68=\"\",\"\",'Yab. Dil. Öğr. Gör. Sonuç'!E68)","v":""},{"$f":"IF('Yab. Dil. Öğr. Gör. Sonuç'!F68=\"\",\"\",'Yab. Dil. Öğr. Gör. Sonuç'!F68)","v":""},{"$f":"IF('Yab. Dil. Öğr. Gör. Sonuç'!G68=\"\",\"\",'Yab. Dil. Öğr. Gör. Sonuç'!G68)","v":""},{"$f":"IF('Yab. Dil. Öğr. Gör. Sonuç'!H68=\"\",\"\",'Yab. Dil. Öğr. Gör. Sonuç'!H68)","v":""},{"$f":"IF('Yab. Dil. Öğr. Gör. Sonuç'!I68=\"\",\"\",'Yab. Dil. Öğr. Gör. Sonuç'!I68)","v":""},{"$f":"IF('Yab. Dil. Öğr. Gör. Sonuç'!J68=\"\",\"\",'Yab. Dil. Öğr. Gör. Sonuç'!J68)","v":""},{"$f":"IF('Yab. Dil. Öğr. Gör. Sonuç'!K68=\"\",\"\",'Yab. Dil. Öğr. Gör. Sonuç'!K68)","v":""},{"$f":"IF('Yab. Dil. Öğr. Gör. Sonuç'!L68=\"\",\"\",'Yab. Dil. Öğr. Gör. Sonuç'!L68)","v":""},{"$f":"IF('Yab. Dil. Öğr. Gör. Sonuç'!M68=\"\",\"\",'Yab. Dil. Öğr. Gör. Sonuç'!M68)","v":""},{"$f":"IF('Yab. Dil. Öğr. Gör. Sonuç'!N68=\"\",\"\",'Yab. Dil. Öğr. Gör. Sonuç'!N68)","v":""}]
[{"$f":"IF('Yab. Dil. Öğr. Gör. Sonuç'!A69=\"\",\"\",'Yab. Dil. Öğr. Gör. Sonuç'!A69)","v":""},{"$f":"IF('Yab. Dil. Öğr. Gör. Sonuç'!B69=\"\",\"\",LEFT('Yab. Dil. Öğr. Gör. Sonuç'!B69,3)&REPT(\"*\",4)&RIGHT('Yab. Dil. Öğr. Gör. Sonuç'!B69,2))","v":""},{"$f":"IF('Yab. Dil. Öğr. Gör. Sonuç'!C69=\"\",\"\",IF(ISERR(FIND(\" \",'Yab. Dil. Öğr. Gör. Sonuç'!C69))=TRUE,LEFT('Yab. Dil. Öğr. Gör. Sonuç'!C69,2)&REPT(\"*\",3),LEFT('Yab. Dil. Öğr. Gör. Sonuç'!C69,2)&REPT(\"*\",3)&\" \"&MID('Yab. Dil. Öğr. Gör. Sonuç'!C69,FIND(\" \",'Yab. Dil. Öğr. Gör. Sonuç'!C69)+1,2)&REPT(\"*\",3)))","v":""},{"$f":"IF('Yab. Dil. Öğr. Gör. Sonuç'!D69=\"\",\"\",IF(ISERR(FIND(\" \",'Yab. Dil. Öğr. Gör. Sonuç'!D69))=TRUE,LEFT('Yab. Dil. Öğr. Gör. Sonuç'!D69,2)&REPT(\"*\",3),LEFT('Yab. Dil. Öğr. Gör. Sonuç'!D69,2)&REPT(\"*\",3)&\" \"&MID('Yab. Dil. Öğr. Gör. Sonuç'!D69,FIND(\" \",'Yab. Dil. Öğr. Gör. Sonuç'!D69)+1,2)&REPT(\"*\",3)))","v":""},{"$f":"IF('Yab. Dil. Öğr. Gör. Sonuç'!E69=\"\",\"\",'Yab. Dil. Öğr. Gör. Sonuç'!E69)","v":""},{"$f":"IF('Yab. Dil. Öğr. Gör. Sonuç'!F69=\"\",\"\",'Yab. Dil. Öğr. Gör. Sonuç'!F69)","v":""},{"$f":"IF('Yab. Dil. Öğr. Gör. Sonuç'!G69=\"\",\"\",'Yab. Dil. Öğr. Gör. Sonuç'!G69)","v":""},{"$f":"IF('Yab. Dil. Öğr. Gör. Sonuç'!H69=\"\",\"\",'Yab. Dil. Öğr. Gör. Sonuç'!H69)","v":""},{"$f":"IF('Yab. Dil. Öğr. Gör. Sonuç'!I69=\"\",\"\",'Yab. Dil. Öğr. Gör. Sonuç'!I69)","v":""},{"$f":"IF('Yab. Dil. Öğr. Gör. Sonuç'!J69=\"\",\"\",'Yab. Dil. Öğr. Gör. Sonuç'!J69)","v":""},{"$f":"IF('Yab. Dil. Öğr. Gör. Sonuç'!K69=\"\",\"\",'Yab. Dil. Öğr. Gör. Sonuç'!K69)","v":""},{"$f":"IF('Yab. Dil. Öğr. Gör. Sonuç'!L69=\"\",\"\",'Yab. Dil. Öğr. Gör. Sonuç'!L69)","v":""},{"$f":"IF('Yab. Dil. Öğr. Gör. Sonuç'!M69=\"\",\"\",'Yab. Dil. Öğr. Gör. Sonuç'!M69)","v":""},{"$f":"IF('Yab. Dil. Öğr. Gör. Sonuç'!N69=\"\",\"\",'Yab. Dil. Öğr. Gör. Sonuç'!N69)","v":""}]
[{"$f":"IF('Yab. Dil. Öğr. Gör. Sonuç'!A70=\"\",\"\",'Yab. Dil. Öğr. Gör. Sonuç'!A70)","v":""},{"$f":"IF('Yab. Dil. Öğr. Gör. Sonuç'!B70=\"\",\"\",LEFT('Yab. Dil. Öğr. Gör. Sonuç'!B70,3)&REPT(\"*\",4)&RIGHT('Yab. Dil. Öğr. Gör. Sonuç'!B70,2))","v":""},{"$f":"IF('Yab. Dil. Öğr. Gör. Sonuç'!C70=\"\",\"\",IF(ISERR(FIND(\" \",'Yab. Dil. Öğr. Gör. Sonuç'!C70))=TRUE,LEFT('Yab. Dil. Öğr. Gör. Sonuç'!C70,2)&REPT(\"*\",3),LEFT('Yab. Dil. Öğr. Gör. Sonuç'!C70,2)&REPT(\"*\",3)&\" \"&MID('Yab. Dil. Öğr. Gör. Sonuç'!C70,FIND(\" \",'Yab. Dil. Öğr. Gör. Sonuç'!C70)+1,2)&REPT(\"*\",3)))","v":""},{"$f":"IF('Yab. Dil. Öğr. Gör. Sonuç'!D70=\"\",\"\",IF(ISERR(FIND(\" \",'Yab. Dil. Öğr. Gör. Sonuç'!D70))=TRUE,LEFT('Yab. Dil. Öğr. Gör. Sonuç'!D70,2)&REPT(\"*\",3),LEFT('Yab. Dil. Öğr. Gör. Sonuç'!D70,2)&REPT(\"*\",3)&\" \"&MID('Yab. Dil. Öğr. Gör. Sonuç'!D70,FIND(\" \",'Yab. Dil. Öğr. Gör. Sonuç'!D70)+1,2)&REPT(\"*\",3)))","v":""},{"$f":"IF('Yab. Dil. Öğr. Gör. Sonuç'!E70=\"\",\"\",'Yab. Dil. Öğr. Gör. Sonuç'!E70)","v":""},{"$f":"IF('Yab. Dil. Öğr. Gör. Sonuç'!F70=\"\",\"\",'Yab. Dil. Öğr. Gör. Sonuç'!F70)","v":""},{"$f":"IF('Yab. Dil. Öğr. Gör. Sonuç'!G70=\"\",\"\",'Yab. Dil. Öğr. Gör. Sonuç'!G70)","v":""},{"$f":"IF('Yab. Dil. Öğr. Gör. Sonuç'!H70=\"\",\"\",'Yab. Dil. Öğr. Gör. Sonuç'!H70)","v":""},{"$f":"IF('Yab. Dil. Öğr. Gör. Sonuç'!I70=\"\",\"\",'Yab. Dil. Öğr. Gör. Sonuç'!I70)","v":""},{"$f":"IF('Yab. Dil. Öğr. Gör. Sonuç'!J70=\"\",\"\",'Yab. Dil. Öğr. Gör. Sonuç'!J70)","v":""},{"$f":"IF('Yab. Dil. Öğr. Gör. Sonuç'!K70=\"\",\"\",'Yab. Dil. Öğr. Gör. Sonuç'!K70)","v":""},{"$f":"IF('Yab. Dil. Öğr. Gör. Sonuç'!L70=\"\",\"\",'Yab. Dil. Öğr. Gör. Sonuç'!L70)","v":""},{"$f":"IF('Yab. Dil. Öğr. Gör. Sonuç'!M70=\"\",\"\",'Yab. Dil. Öğr. Gör. Sonuç'!M70)","v":""},{"$f":"IF('Yab. Dil. Öğr. Gör. Sonuç'!N70=\"\",\"\",'Yab. Dil. Öğr. Gör. Sonuç'!N70)","v":""}]

{"sheet":"Ulus.İlişkiler.Sonuç","index":4,"n_rows":16,"n_cols":14,"rows_kept":16,"cut":false,"hidden":false,"merged":[[9,0,10,0],[9,4,9,5],[9,6,9,7],[9,8,9,9],[0,0,0,13],[1,0,1,13],[2,0,2,13],[3,0,3,13],[4,0,4,1],[5,0,5,1],[5,2,5,5],[6,0,6,1],[6,2,6,5],[7,0,7,1],[6,9,6,13],[7,6,7,8],[4,2,4,5],[8,0,8,1],[4,6,4,8],[4,9,4,13],[5,6,5,8],[5,9,5,13],[6,6,6,8],[8,2,8,13],[7,9,7,10],[7,11,7,12],[9,12,10,12],[9,13,10,13],[7,2,7,5],[9,1,9,3],[9,10,9,11]]}
["T.C."]
["BAYBURT ÜNİVERSİTESİ"]
["GİRİŞ SINAVI SONUÇ TUTANAĞI"]
[" Üniversitemize bağlı birimlere, 2547 sayılı Kanunun ilgili maddeleri ve 09.11.2018 tarih ve 30590 sayılı Resmi Gazetede yayımlanan \"Öğretim Üyesi Dışındaki Öğretim Elemanı Kadrolarına Naklen veya Açıktan Yapılacak Atamalarda Uygulanacak Merkezi Sınav ile Giriş Sınavlarına İlişkin Usul ve Esaslar Hakkında Yönetmelik” 11. ve 12. maddeleri hükümleri uyarınca yapılan Giriş Sınavında başarılı olan adayların isimleri aşağıda belirtilmiştir."]
["İlan No:",null,null,null,null,null,"Birimi:",null,null,"Rektörlük"]
["İlan Tarihi:",null,"…/.../....",null,null,null,"Bölümü:",null,null,"Uluslararası İlişkiler Ofisi"]
["Kadro Unvanı:",null,"Öğretim Görevlisi (Uluslararası İlişkiler Birimi - Uygulamalı Birim)",null,null,null,"Alanı:"]
["Kadro Adedi:",null,1,null,null,null,"Sınav Tarihi:",null,null,"…/.../....",null,"Sonuç Tarihi:",null,"…/.../...."]
["İlan Özel Şartı:"]
["Sıra No","Başvuranın",null,null,"ALES",null,"Yabancı Dil",null,null,null,"Giriş \nSınavı",null,"(A+B+C+D) Değerlendirme Notu","Sonuç"]
[null,"T.C. Kimlik No","Adı","Soyadı","Puanı","(A) Puanın %30' u","Puanı","(B) Puanın %30' u","100' lük Sistem ","(C) Notun %10' u","Giriş \nSınav Notu","(D) Notunun %30' u"]
[1,11111111111,"Örnek","Örnek",82.513919999999999,{"$f":"E12*0.3","v":24.754175999999998},90,{"$f":"G12*0.3","v":27},76.66,{"$f":"I12*0.1","v":7.6660000000000004},95,{"$f":"K12*0.3","v":28.5},{"$f":"F12+H12+J12+L12","v":87.920175999999998},"BAŞARILI (ASIL)"]
[2,11111111111,"Örnek Örnek","Örnek",85.030479999999997,{"$f":"E13*0.3","v":25.509143999999999},88,{"$f":"G13*0.3","v":26.4},76.66,{"$f":"I13*0.1","v":7.6660000000000004},63,{"$f":"K13*0.3","v":18.899999999999999},{"$f":"F13+H13+J13+L13","v":78.475144},"BAŞARILI (YEDEK)"]
[3,11111111111,"Örnek","Örnek Örnek",84.431349999999995,{"$f":"E14*0.3","v":25.329404999999998},89,{"$f":"G14*0.3","v":26.7},83.66,{"$f":"I14*0.1","v":8.3659999999999997},45,{"$f":"K14*0.3","v":13.5},{"$f":"F14+H14+J14+L14","v":73.895404999999997},"YÖNETMELİK GEREĞİ ELENDİ*"]
[4,11111111111,"Örnek Örnek","Örnek Örnek",72,{"$f":"E15*0.3","v":21.599999999999998},85,{"$f":"G15*0.3","v":25.5},76.66,{"$f":"I15*0.1","v":7.6660000000000004},35,{"$f":"K15*0.3","v":10.5},{"$f":"F15+H15+J15+L15","v":65.265999999999991},"BAŞARISIZ**"]
[5,11111111111,"Örnek","Örnek",84.431349999999995,{"$f":"E16*0.3","v":25.329404999999998},87,{"$f":"G16*0.3","v":26.099999999999998},83.66,{"$f":"I16*0.1","v":8.3659999999999997},"Sınava Girmedi","-","-","SINAVA GİRMEDİ"]

{"sheet":"Ulus.İlişkiler.Sonuç Rapor","index":5,"n_rows":47,"n_cols":14,"rows_kept":47,"cut":false,"hidden":false,"merged":[[9,12,10,12],[9,13,10,13],[9,0,10,0],[9,1,9,3],[9,4,9,5],[9,6,9,7],[9,8,9,9],[9,10,9,11],[8,0,8,1],[8,2,8,13],[5,0,5,1],[5,2,5,5],[5,6,5,8],[5,9,5,13],[6,0,6,1],[6,2,6,5],[6,6,6,8],[6,9,6,13],[7,0,7,1],[7,2,7,5],[7,6,7,8],[7,9,7,10],[7,11,7,12],[0,0,0,13],[1,0,1,13],[2,0,2,13],[3,0,3,13],[4,0,4,1],[4,2,4,5],[4,6,4,8],[4,9,4,13]]}
["T.C."]
["BAYBURT ÜNİVERSİTESİ"]
["GİRİŞ SINAVI SONUÇ TUTANAĞI"]
[" Üniversitemize bağlı birimlere, 2547 sayılı Kanunun ilgili maddeleri ve 09.11.2018 tarih ve 30590 sayılı Resmi Gazetede yayımlanan \"Öğretim Üyesi Dışındaki Öğretim Elemanı Kadrolarına Naklen veya Açıktan Yapılacak Atamalarda Uygulanacak Merkezi Sınav ile Giriş Sınavlarına İlişkin Usul ve Esaslar Hakkında Yönetmelik” 11. ve 12. maddeleri hükümleri uyarınca yapılan Giriş Sınavında başarılı olan adayların isimleri aşağıda belirtilmiştir."]
["İlan No:",null,{"$f":"IF(Ulus.İlişkiler.Sonuç!C5=\"\",\"\",Ulus.İlişkiler.Sonuç!C5)","v":""},null,null,null,"Birimi:",null,null,{"$f":"IF(Ulus.İlişkiler.Sonuç!J5=\"\",\"\",Ulus.İlişkiler.Sonuç!J5)","v":"Rektörlük"}]
["İlan Tarihi:",null,{"$f":"IF(Ulus.İlişkiler.Sonuç!C6=\"\",\"\",Ulus.İlişkiler.Sonuç!C6)","v":"…/.../...."},null,null,null,"Bölümü:",null,null,{"$f":"IF(Ulus.İlişkiler.Sonuç!J6=\"\",\"\",Ulus.İlişkiler.Sonuç!J6)","v":"Uluslararası İlişkiler Ofisi"}]
["Kadro Unvanı:",null,{"$f":"IF(Ulus.İlişkiler.Sonuç!C7=\"\",\"\",Ulus.İlişkiler.Sonuç!C7)","v":"Öğretim Görevlisi (Uluslararası İlişkiler Birimi - Uygulamalı Birim)"},null,null,null,"Alanı:",null,null,{"$f":"IF(Ulus.İlişkiler.Sonuç!J7=\"\",\"\",Ulus.İlişkiler.Sonuç!J7)","v":""}]
["Kadro Adedi:",null,{"$f":"IF(Ulus.İlişkiler.Sonuç!C8=\"\",\"\",Ulus.İlişkiler.Sonuç!C8)","v":1},null,null,null,"Sınav Tarihi:",null,null,{"$f":"IF(Ulus.İlişkiler.Sonuç!J8=\"\",\"\",Ulus.İlişkiler.Sonuç!J8)","v":"…/.../...."},null,"Sonuç Tarihi:",null,{"$f":"IF(Ulus.İlişkiler.Sonuç!N8=\"\",\"\",Ulus.İlişkiler.Sonuç!N8)","v":"…/.../...."}]
["İlan Özel Şartı:",null,{"$f":"IF(Ulus.İlişkiler.Sonuç!C9=\"\",\"\",Ulus.İlişkiler.Sonuç!C9)","v":""}]
["Sıra No","Başvuranın",null,null,"ALES",null,"Yabancı Dil",null,null,null,"Giriş \nSınavı",null,"(A+B+C+D) Değerlendirme Notu","Sonuç"]
[null,"T.C. Kimlik No","Adı","Soyadı","Puanı","(A) Puanın %30' u","Puanı","(B) Puanın %30' u","100' lük Sistem ","(C) Notun %10' u","Giriş \nSınav Notu","(D) Notunun %30' u"]
[{"$f":"IF(Ulus.İlişkiler.Sonuç!A12=\"\",\"\",Ulus.İlişkiler.Sonuç!A12)","v":1},{"$f":"IF(Ulus.İlişkiler.Sonuç!B12=\"\",\"\",LEFT(Ulus.İlişkiler.Sonuç!B12,3)&REPT(\"*\",4)&RIGHT(Ulus.İlişkiler.Sonuç!B12,2))","v":"111****11"},{"$f":"IF(Ulus.İlişkiler.Sonuç!C12=\"\",\"\",IF(ISERR(FIND(\" \",Ulus.İlişkiler.Sonuç!C12))=TRUE,LEFT(Ulus.İlişkiler.Sonuç!C12,2)&REPT(\"*\",3),LEFT(Ulus.İlişkiler.Sonuç!C12,2)&REPT(\"*\",3)&\" \"&MID(Ulus.İlişkiler.Sonuç!C12,FIND(\" \",Ulus.İlişkiler.Sonuç!C12)+1,2)&REPT(\"*\",3)))","v":"Ör***"},{"$f":"IF(Ulus.İlişkiler.Sonuç!D12=\"\",\"\",IF(ISERR(FIND(\" \",Ulus.İlişkiler.Sonuç!D12))=TRUE,LEFT(Ulus.İlişkiler.Sonuç!D12,2)&REPT(\"*\",3),LEFT(Ulus.İlişkiler.Sonuç!D12,2)&REPT(\"*\",3)&\" \"&MID(Ulus.İlişkiler.Sonuç!D12,FIND(\" \",Ulus.İlişkiler.Sonuç!D12)+1,2)&REPT(\"*\",3)))","v":"Ör***"},{"$f":"IF(Ulus.İlişkiler.Sonuç!E12=\"\",\"\",Ulus.İlişkiler.Sonuç!E12)","v":82.513919999999999},{"$f":"IF(Ulus.İlişkiler.Sonuç!F12=\"\",\"\",Ulus.İlişkiler.Sonuç!F12)","v":24.754175999999998},{"$f":"IF(Ulus.İlişkiler.Sonuç!G12=\"\",\"\",Ulus.İlişkiler.Sonuç!G12)","v":90},{"$f":"IF(Ulus.İlişkiler.Sonuç!H12=\"\",\"\",Ulus.İlişkiler.Sonuç!H12)","v":27},{"$f":"IF(Ulus.İlişkiler.Sonuç!I12=\"\",\"\",Ulus.İlişkiler.Sonuç!I12)","v":76.66},{"$f":"IF(Ulus.İlişkiler.Sonuç!J12=\"\",\"\",Ulus.İlişkiler.Sonuç!J12)","v":7.6660000000000004},{"$f":"IF(Ulus.İlişkiler.Sonuç!K12=\"\",\"\",Ulus.İlişkiler.Sonuç!K12)","v":95},{"$f":"IF(Ulus.İlişkiler.Sonuç!L12=\"\",\"\",Ulus.İlişkiler.Sonuç!L12)","v":28.5},{"$f":"IF(Ulus.İlişkiler.Sonuç!M12=\"\",\"\",Ulus.İlişkiler.Sonuç!M12)","v":87.920175999999998},{"$f":"IF(Ulus.İlişkiler.Sonuç!N12=\"\",\"\",Ulus.İlişkiler.Sonuç!N12)","v":"BAŞARILI (ASIL)"}]
[{"$f":"IF(Ulus.İlişkiler.Sonuç!A13=\"\",\"\",Ulus.İlişkiler.Sonuç!A13)","v":2},{"$f":"IF(Ulus.İlişkiler.Sonuç!B13=\"\",\"\",LEFT(Ulus.İlişkiler.Sonuç!B13,3)&REPT(\"*\",4)&RIGHT(Ulus.İlişkiler.Sonuç!B13,2))","v":"111****11"},{"$f":"IF(Ulus.İlişkiler.Sonuç!C13=\"\",\"\",IF(ISERR(FIND(\" \",Ulus.İlişkiler.Sonuç!C13))=TRUE,LEFT(Ulus.İlişkiler.Sonuç!C13,2)&REPT(\"*\",3),LEFT(Ulus.İlişkiler.Sonuç!C13,2)&REPT(\"*\",3)&\" \"&MID(Ulus.İlişkiler.Sonuç!C13,FIND(\" \",Ulus.İlişkiler.Sonuç!C13)+1,2)&REPT(\"*\",3)))","v":"Ör*** Ör***"},{"$f":"IF(Ulus.İlişkiler.Sonuç!D13=\"\",\"\",IF(ISERR(FIND(\" \",Ulus.İlişkiler.Sonuç!D13))=TRUE,LEFT(Ulus.İlişkiler.Sonuç!D13,2)&REPT(\"*\",3),LEFT(Ulus.İlişkiler.Sonuç!D13,2)&REPT(\"*\",3)&\" \"&MID(Ulus.İlişkiler.Sonuç!D13,FIND(\" \",Ulus.İlişkiler.Sonuç!D13)+1,2)&REPT(\"*\",3)))","v":"Ör***"},{"$f":"IF(Ulus.İlişkiler.Sonuç!E13=\"\",\"\",Ulus.İlişkiler.Sonuç!E13)","v":85.030479999999997},{"$f":"IF(Ulus.İlişkiler.Sonuç!F13=\"\",\"\",Ulus.İlişkiler.Sonuç!F13)","v":25.509143999999999},{"$f":"IF(Ulus.İlişkiler.Sonuç!G13=\"\",\"\",Ulus.İlişkiler.Sonuç!G13)","v":88},{"$f":"IF(Ulus.İlişkiler.Sonuç!H13=\"\",\"\",Ulus.İlişkiler.Sonuç!H13)","v":26.4},{"$f":"IF(Ulus.İlişkiler.Sonuç!I13=\"\",\"\",Ulus.İlişkiler.Sonuç!I13)","v":76.66},{"$f":"IF(Ulus.İlişkiler.Sonuç!J13=\"\",\"\",Ulus.İlişkiler.Sonuç!J13)","v":7.6660000000000004},{"$f":"IF(Ulus.İlişkiler.Sonuç!K13=\"\",\"\",Ulus.İlişkiler.Sonuç!K13)","v":63},{"$f":"IF(Ulus.İlişkiler.Sonuç!L13=\"\",\"\",Ulus.İlişkiler.Sonuç!L13)","v":18.899999999999999},{"$f":"IF(Ulus.İlişkiler.Sonuç!M13=\"\",\"\",Ulus.İlişkiler.Sonuç!M13)","v":78.475144},{"$f":"IF(Ulus.İlişkiler.Sonuç!N13=\"\",\"\",Ulus.İlişkiler.Sonuç!N13)","v":"BAŞARILI (YEDEK)"}]
[{"$f":"IF(Ulus.İlişkiler.Sonuç!A14=\"\",\"\",Ulus.İlişkiler.Sonuç!A14)","v":3},{"$f":"IF(Ulus.İlişkiler.Sonuç!B14=\"\",\"\",LEFT(Ulus.İlişkiler.Sonuç!B14,3)&REPT(\"*\",4)&RIGHT(Ulus.İlişkiler.Sonuç!B14,2))","v":"111****11"},{"$f":"IF(Ulus.İlişkiler.Sonuç!C14=\"\",\"\",IF(ISERR(FIND(\" \",Ulus.İlişkiler.Sonuç!C14))=TRUE,LEFT(Ulus.İlişkiler.Sonuç!C14,2)&REPT(\"*\",3),LEFT(Ulus.İlişkiler.Sonuç!C14,2)&REPT(\"*\",3)&\" \"&MID(Ulus.İlişkiler.Sonuç!C14,FIND(\" \",Ulus.İlişkiler.Sonuç!C14)+1,2)&REPT(\"*\",3)))","v":"Ör***"},{"$f":"IF(Ulus.İlişkiler.Sonuç!D14=\"\",\"\",IF(ISERR(FIND(\" \",Ulus.İlişkiler.Sonuç!D14))=TRUE,LEFT(Ulus.İlişkiler.Sonuç!D14,2)&REPT(\"*\",3),LEFT(Ulus.İlişkiler.Sonuç!D14,2)&REPT(\"*\",3)&\" \"&MID(Ulus.İlişkiler.Sonuç!D14,FIND(\" \",Ulus.İlişkiler.Sonuç!D14)+1,2)&REPT(\"*\",3)))","v":"Ör*** Ör***"},{"$f":"IF(Ulus.İlişkiler.Sonuç!E14=\"\",\"\",Ulus.İlişkiler.Sonuç!E14)","v":84.431349999999995},{"$f":"IF(Ulus.İlişkiler.Sonuç!F14=\"\",\"\",Ulus.İlişkiler.Sonuç!F14)","v":25.329404999999998},{"$f":"IF(Ulus.İlişkiler.Sonuç!G14=\"\",\"\",Ulus.İlişkiler.Sonuç!G14)","v":89},{"$f":"IF(Ulus.İlişkiler.Sonuç!H14=\"\",\"\",Ulus.İlişkiler.Sonuç!H14)","v":26.7},{"$f":"IF(Ulus.İlişkiler.Sonuç!I14=\"\",\"\",Ulus.İlişkiler.Sonuç!I14)","v":83.66},{"$f":"IF(Ulus.İlişkiler.Sonuç!J14=\"\",\"\",Ulus.İlişkiler.Sonuç!J14)","v":8.3659999999999997},{"$f":"IF(Ulus.İlişkiler.Sonuç!K14=\"\",\"\",Ulus.İlişkiler.Sonuç!K14)","v":45},{"$f":"IF(Ulus.İlişkiler.Sonuç!L14=\"\",\"\",Ulus.İlişkiler.Sonuç!L14)","v":13.5},{"$f":"IF(Ulus.İlişkiler.Sonuç!M14=\"\",\"\",Ulus.İlişkiler.Sonuç!M14)","v":73.895404999999997},{"$f":"IF(Ulus.İlişkiler.Sonuç!N14=\"\",\"\",Ulus.İlişkiler.Sonuç!N14)","v":"YÖNETMELİK GEREĞİ ELENDİ*"}]
[{"$f":"IF(Ulus.İlişkiler.Sonuç!A15=\"\",\"\",Ulus.İlişkiler.Sonuç!A15)","v":4},{"$f":"IF(Ulus.İlişkiler.Sonuç!B15=\"\",\"\",LEFT(Ulus.İlişkiler.Sonuç!B15,3)&REPT(\"*\",4)&RIGHT(Ulus.İlişkiler.Sonuç!B15,2))","v":"111****11"},{"$f":"IF(Ulus.İlişkiler.Sonuç!C15=\"\",\"\",IF(ISERR(FIND(\" \",Ulus.İlişkiler.Sonuç!C15))=TRUE,LEFT(Ulus.İlişkiler.Sonuç!C15,2)&REPT(\"*\",3),LEFT(Ulus.İlişkiler.Sonuç!C15,2)&REPT(\"*\",3)&\" \"&MID(Ulus.İlişkiler.Sonuç!C15,FIND(\" \",Ulus.İlişkiler.Sonuç!C15)+1,2)&REPT(\"*\",3)))","v":"Ör*** Ör***"},{"$f":"IF(Ulus.İlişkiler.Sonuç!D15=\"\",\"\",IF(ISERR(FIND(\" \",Ulus.İlişkiler.Sonuç!D15))=TRUE,LEFT(Ulus.İlişkiler.Sonuç!D15,2)&REPT(\"*\",3),LEFT(Ulus.İlişkiler.Sonuç!D15,2)&REPT(\"*\",3)&\" \"&MID(Ulus.İlişkiler.Sonuç!D15,FIND(\" \",Ulus.İlişkiler.Sonuç!D15)+1,2)&REPT(\"*\",3)))","v":"Ör*** Ör***"},{"$f":"IF(Ulus.İlişkiler.Sonuç!E15=\"\",\"\",Ulus.İlişkiler.Sonuç!E15)","v":72},{"$f":"IF(Ulus.İlişkiler.Sonuç!F15=\"\",\"\",Ulus.İlişkiler.Sonuç!F15)","v":21.599999999999998},{"$f":"IF(Ulus.İlişkiler.Sonuç!G15=\"\",\"\",Ulus.İlişkiler.Sonuç!G15)","v":85},{"$f":"IF(Ulus.İlişkiler.Sonuç!H15=\"\",\"\",Ulus.İlişkiler.Sonuç!H15)","v":25.5},{"$f":"IF(Ulus.İlişkiler.Sonuç!I15=\"\",\"\",Ulus.İlişkiler.Sonuç!I15)","v":76.66},{"$f":"IF(Ulus.İlişkiler.Sonuç!J15=\"\",\"\",Ulus.İlişkiler.Sonuç!J15)","v":7.6660000000000004},{"$f":"IF(Ulus.İlişkiler.Sonuç!K15=\"\",\"\",Ulus.İlişkiler.Sonuç!K15)","v":35},{"$f":"IF(Ulus.İlişkiler.Sonuç!L15=\"\",\"\",Ulus.İlişkiler.Sonuç!L15)","v":10.5},{"$f":"IF(Ulus.İlişkiler.Sonuç!M15=\"\",\"\",Ulus.İlişkiler.Sonuç!M15)","v":65.265999999999991},{"$f":"IF(Ulus.İlişkiler.Sonuç!N15=\"\",\"\",Ulus.İlişkiler.Sonuç!N15)","v":"BAŞARISIZ**"}]
[{"$f":"IF(Ulus.İlişkiler.Sonuç!A16=\"\",\"\",Ulus.İlişkiler.Sonuç!A16)","v":5},{"$f":"IF(Ulus.İlişkiler.Sonuç!B16=\"\",\"\",LEFT(Ulus.İlişkiler.Sonuç!B16,3)&REPT(\"*\",4)&RIGHT(Ulus.İlişkiler.Sonuç!B16,2))","v":"111****11"},{"$f":"IF(Ulus.İlişkiler.Sonuç!C16=\"\",\"\",IF(ISERR(FIND(\" \",Ulus.İlişkiler.Sonuç!C16))=TRUE,LEFT(Ulus.İlişkiler.Sonuç!C16,2)&REPT(\"*\",3),LEFT(Ulus.İlişkiler.Sonuç!C16,2)&REPT(\"*\",3)&\" \"&MID(Ulus.İlişkiler.Sonuç!C16,FIND(\" \",Ulus.İlişkiler.Sonuç!C16)+1,2)&REPT(\"*\",3)))","v":"Ör***"},{"$f":"IF(Ulus.İlişkiler.Sonuç!D16=\"\",\"\",IF(ISERR(FIND(\" \",Ulus.İlişkiler.Sonuç!D16))=TRUE,LEFT(Ulus.İlişkiler.Sonuç!D16,2)&REPT(\"*\",3),LEFT(Ulus.İlişkiler.Sonuç!D16,2)&REPT(\"*\",3)&\" \"&MID(Ulus.İlişkiler.Sonuç!D16,FIND(\" \",Ulus.İlişkiler.Sonuç!D16)+1,2)&REPT(\"*\",3)))","v":"Ör***"},{"$f":"IF(Ulus.İlişkiler.Sonuç!E16=\"\",\"\",Ulus.İlişkiler.Sonuç!E16)","v":84.431349999999995},{"$f":"IF(Ulus.İlişkiler.Sonuç!F16=\"\",\"\",Ulus.İlişkiler.Sonuç!F16)","v":25.329404999999998},{"$f":"IF(Ulus.İlişkiler.Sonuç!G16=\"\",\"\",Ulus.İlişkiler.Sonuç!G16)","v":87},{"$f":"IF(Ulus.İlişkiler.Sonuç!H16=\"\",\"\",Ulus.İlişkiler.Sonuç!H16)","v":26.099999999999998},{"$f":"IF(Ulus.İlişkiler.Sonuç!I16=\"\",\"\",Ulus.İlişkiler.Sonuç!I16)","v":83.66},{"$f":"IF(Ulus.İlişkiler.Sonuç!J16=\"\",\"\",Ulus.İlişkiler.Sonuç!J16)","v":8.3659999999999997},{"$f":"IF(Ulus.İlişkiler.Sonuç!K16=\"\",\"\",Ulus.İlişkiler.Sonuç!K16)","v":"Sınava Girmedi"},{"$f":"IF(Ulus.İlişkiler.Sonuç!L16=\"\",\"\",Ulus.İlişkiler.Sonuç!L16)","v":"-"},{"$f":"IF(Ulus.İlişkiler.Sonuç!M16=\"\",\"\",Ulus.İlişkiler.Sonuç!M16)","v":"-"},{"$f":"IF(Ulus.İlişkiler.Sonuç!N16=\"\",\"\",Ulus.İlişkiler.Sonuç!N16)","v":"SINAVA GİRMEDİ"}]
[{"$f":"IF(Ulus.İlişkiler.Sonuç!A17=\"\",\"\",Ulus.İlişkiler.Sonuç!A17)","v":""},{"$f":"IF(Ulus.İlişkiler.Sonuç!B17=\"\",\"\",LEFT(Ulus.İlişkiler.Sonuç!B17,3)&REPT(\"*\",4)&RIGHT(Ulus.İlişkiler.Sonuç!B17,2))","v":""},{"$f":"IF(Ulus.İlişkiler.Sonuç!C17=\"\",\"\",IF(ISERR(FIND(\" \",Ulus.İlişkiler.Sonuç!C17))=TRUE,LEFT(Ulus.İlişkiler.Sonuç!C17,2)&REPT(\"*\",3),LEFT(Ulus.İlişkiler.Sonuç!C17,2)&REPT(\"*\",3)&\" \"&MID(Ulus.İlişkiler.Sonuç!C17,FIND(\" \",Ulus.İlişkiler.Sonuç!C17)+1,2)&REPT(\"*\",3)))","v":""},{"$f":"IF(Ulus.İlişkiler.Sonuç!D17=\"\",\"\",IF(ISERR(FIND(\" \",Ulus.İlişkiler.Sonuç!D17))=TRUE,LEFT(Ulus.İlişkiler.Sonuç!D17,2)&REPT(\"*\",3),LEFT(Ulus.İlişkiler.Sonuç!D17,2)&REPT(\"*\",3)&\" \"&MID(Ulus.İlişkiler.Sonuç!D17,FIND(\" \",Ulus.İlişkiler.Sonuç!D17)+1,2)&REPT(\"*\",3)))","v":""},{"$f":"IF(Ulus.İlişkiler.Sonuç!E17=\"\",\"\",Ulus.İlişkiler.Sonuç!E17)","v":""},{"$f":"IF(Ulus.İlişkiler.Sonuç!F17=\"\",\"\",Ulus.İlişkiler.Sonuç!F17)","v":""},{"$f":"IF(Ulus.İlişkiler.Sonuç!G17=\"\",\"\",Ulus.İlişkiler.Sonuç!G17)","v":""},{"$f":"IF(Ulus.İlişkiler.Sonuç!H17=\"\",\"\",Ulus.İlişkiler.Sonuç!H17)","v":""},{"$f":"IF(Ulus.İlişkiler.Sonuç!I17=\"\",\"\",Ulus.İlişkiler.Sonuç!I17)","v":""},{"$f":"IF(Ulus.İlişkiler.Sonuç!J17=\"\",\"\",Ulus.İlişkiler.Sonuç!J17)","v":""},{"$f":"IF(Ulus.İlişkiler.Sonuç!K17=\"\",\"\",Ulus.İlişkiler.Sonuç!K17)","v":""},{"$f":"IF(Ulus.İlişkiler.Sonuç!L17=\"\",\"\",Ulus.İlişkiler.Sonuç!L17)","v":""},{"$f":"IF(Ulus.İlişkiler.Sonuç!M17=\"\",\"\",Ulus.İlişkiler.Sonuç!M17)","v":""},{"$f":"IF(Ulus.İlişkiler.Sonuç!N17=\"\",\"\",Ulus.İlişkiler.Sonuç!N17)","v":""}]
[{"$f":"IF(Ulus.İlişkiler.Sonuç!A18=\"\",\"\",Ulus.İlişkiler.Sonuç!A18)","v":""},{"$f":"IF(Ulus.İlişkiler.Sonuç!B18=\"\",\"\",LEFT(Ulus.İlişkiler.Sonuç!B18,3)&REPT(\"*\",4)&RIGHT(Ulus.İlişkiler.Sonuç!B18,2))","v":""},{"$f":"IF(Ulus.İlişkiler.Sonuç!C18=\"\",\"\",IF(ISERR(FIND(\" \",Ulus.İlişkiler.Sonuç!C18))=TRUE,LEFT(Ulus.İlişkiler.Sonuç!C18,2)&REPT(\"*\",3),LEFT(Ulus.İlişkiler.Sonuç!C18,2)&REPT(\"*\",3)&\" \"&MID(Ulus.İlişkiler.Sonuç!C18,FIND(\" \",Ulus.İlişkiler.Sonuç!C18)+1,2)&REPT(\"*\",3)))","v":""},{"$f":"IF(Ulus.İlişkiler.Sonuç!D18=\"\",\"\",IF(ISERR(FIND(\" \",Ulus.İlişkiler.Sonuç!D18))=TRUE,LEFT(Ulus.İlişkiler.Sonuç!D18,2)&REPT(\"*\",3),LEFT(Ulus.İlişkiler.Sonuç!D18,2)&REPT(\"*\",3)&\" \"&MID(Ulus.İlişkiler.Sonuç!D18,FIND(\" \",Ulus.İlişkiler.Sonuç!D18)+1,2)&REPT(\"*\",3)))","v":""},{"$f":"IF(Ulus.İlişkiler.Sonuç!E18=\"\",\"\",Ulus.İlişkiler.Sonuç!E18)","v":""},{"$f":"IF(Ulus.İlişkiler.Sonuç!F18=\"\",\"\",Ulus.İlişkiler.Sonuç!F18)","v":""},{"$f":"IF(Ulus.İlişkiler.Sonuç!G18=\"\",\"\",Ulus.İlişkiler.Sonuç!G18)","v":""},{"$f":"IF(Ulus.İlişkiler.Sonuç!H18=\"\",\"\",Ulus.İlişkiler.Sonuç!H18)","v":""},{"$f":"IF(Ulus.İlişkiler.Sonuç!I18=\"\",\"\",Ulus.İlişkiler.Sonuç!I18)","v":""},{"$f":"IF(Ulus.İlişkiler.Sonuç!J18=\"\",\"\",Ulus.İlişkiler.Sonuç!J18)","v":""},{"$f":"IF(Ulus.İlişkiler.Sonuç!K18=\"\",\"\",Ulus.İlişkiler.Sonuç!K18)","v":""},{"$f":"IF(Ulus.İlişkiler.Sonuç!L18=\"\",\"\",Ulus.İlişkiler.Sonuç!L18)","v":""},{"$f":"IF(Ulus.İlişkiler.Sonuç!M18=\"\",\"\",Ulus.İlişkiler.Sonuç!M18)","v":""},{"$f":"IF(Ulus.İlişkiler.Sonuç!N18=\"\",\"\",Ulus.İlişkiler.Sonuç!N18)","v":""}]
[{"$f":"IF(Ulus.İlişkiler.Sonuç!A19=\"\",\"\",Ulus.İlişkiler.Sonuç!A19)","v":""},{"$f":"IF(Ulus.İlişkiler.Sonuç!B19=\"\",\"\",LEFT(Ulus.İlişkiler.Sonuç!B19,3)&REPT(\"*\",4)&RIGHT(Ulus.İlişkiler.Sonuç!B19,2))","v":""},{"$f":"IF(Ulus.İlişkiler.Sonuç!C19=\"\",\"\",IF(ISERR(FIND(\" \",Ulus.İlişkiler.Sonuç!C19))=TRUE,LEFT(Ulus.İlişkiler.Sonuç!C19,2)&REPT(\"*\",3),LEFT(Ulus.İlişkiler.Sonuç!C19,2)&REPT(\"*\",3)&\" \"&MID(Ulus.İlişkiler.Sonuç!C19,FIND(\" \",Ulus.İlişkiler.Sonuç!C19)+1,2)&REPT(\"*\",3)))","v":""},{"$f":"IF(Ulus.İlişkiler.Sonuç!D19=\"\",\"\",IF(ISERR(FIND(\" \",Ulus.İlişkiler.Sonuç!D19))=TRUE,LEFT(Ulus.İlişkiler.Sonuç!D19,2)&REPT(\"*\",3),LEFT(Ulus.İlişkiler.Sonuç!D19,2)&REPT(\"*\",3)&\" \"&MID(Ulus.İlişkiler.Sonuç!D19,FIND(\" \",Ulus.İlişkiler.Sonuç!D19)+1,2)&REPT(\"*\",3)))","v":""},{"$f":"IF(Ulus.İlişkiler.Sonuç!E19=\"\",\"\",Ulus.İlişkiler.Sonuç!E19)","v":""},{"$f":"IF(Ulus.İlişkiler.Sonuç!F19=\"\",\"\",Ulus.İlişkiler.Sonuç!F19)","v":""},{"$f":"IF(Ulus.İlişkiler.Sonuç!G19=\"\",\"\",Ulus.İlişkiler.Sonuç!G19)","v":""},{"$f":"IF(Ulus.İlişkiler.Sonuç!H19=\"\",\"\",Ulus.İlişkiler.Sonuç!H19)","v":""},{"$f":"IF(Ulus.İlişkiler.Sonuç!I19=\"\",\"\",Ulus.İlişkiler.Sonuç!I19)","v":""},{"$f":"IF(Ulus.İlişkiler.Sonuç!J19=\"\",\"\",Ulus.İlişkiler.Sonuç!J19)","v":""},{"$f":"IF(Ulus.İlişkiler.Sonuç!K19=\"\",\"\",Ulus.İlişkiler.Sonuç!K19)","v":""},{"$f":"IF(Ulus.İlişkiler.Sonuç!L19=\"\",\"\",Ulus.İlişkiler.Sonuç!L19)","v":""},{"$f":"IF(Ulus.İlişkiler.Sonuç!M19=\"\",\"\",Ulus.İlişkiler.Sonuç!M19)","v":""},{"$f":"IF(Ulus.İlişkiler.Sonuç!N19=\"\",\"\",Ulus.İlişkiler.Sonuç!N19)","v":""}]
[{"$f":"IF(Ulus.İlişkiler.Sonuç!A20=\"\",\"\",Ulus.İlişkiler.Sonuç!A20)","v":""},{"$f":"IF(Ulus.İlişkiler.Sonuç!B20=\"\",\"\",LEFT(Ulus.İlişkiler.Sonuç!B20,3)&REPT(\"*\",4)&RIGHT(Ulus.İlişkiler.Sonuç!B20,2))","v":""},{"$f":"IF(Ulus.İlişkiler.Sonuç!C20=\"\",\"\",IF(ISERR(FIND(\" \",Ulus.İlişkiler.Sonuç!C20))=TRUE,LEFT(Ulus.İlişkiler.Sonuç!C20,2)&REPT(\"*\",3),LEFT(Ulus.İlişkiler.Sonuç!C20,2)&REPT(\"*\",3)&\" \"&MID(Ulus.İlişkiler.Sonuç!C20,FIND(\" \",Ulus.İlişkiler.Sonuç!C20)+1,2)&REPT(\"*\",3)))","v":""},{"$f":"IF(Ulus.İlişkiler.Sonuç!D20=\"\",\"\",IF(ISERR(FIND(\" \",Ulus.İlişkiler.Sonuç!D20))=TRUE,LEFT(Ulus.İlişkiler.Sonuç!D20,2)&REPT(\"*\",3),LEFT(Ulus.İlişkiler.Sonuç!D20,2)&REPT(\"*\",3)&\" \"&MID(Ulus.İlişkiler.Sonuç!D20,FIND(\" \",Ulus.İlişkiler.Sonuç!D20)+1,2)&REPT(\"*\",3)))","v":""},{"$f":"IF(Ulus.İlişkiler.Sonuç!E20=\"\",\"\",Ulus.İlişkiler.Sonuç!E20)","v":""},{"$f":"IF(Ulus.İlişkiler.Sonuç!F20=\"\",\"\",Ulus.İlişkiler.Sonuç!F20)","v":""},{"$f":"IF(Ulus.İlişkiler.Sonuç!G20=\"\",\"\",Ulus.İlişkiler.Sonuç!G20)","v":""},{"$f":"IF(Ulus.İlişkiler.Sonuç!H20=\"\",\"\",Ulus.İlişkiler.Sonuç!H20)","v":""},{"$f":"IF(Ulus.İlişkiler.Sonuç!I20=\"\",\"\",Ulus.İlişkiler.Sonuç!I20)","v":""},{"$f":"IF(Ulus.İlişkiler.Sonuç!J20=\"\",\"\",Ulus.İlişkiler.Sonuç!J20)","v":""},{"$f":"IF(Ulus.İlişkiler.Sonuç!K20=\"\",\"\",Ulus.İlişkiler.Sonuç!K20)","v":""},{"$f":"IF(Ulus.İlişkiler.Sonuç!L20=\"\",\"\",Ulus.İlişkiler.Sonuç!L20)","v":""},{"$f":"IF(Ulus.İlişkiler.Sonuç!M20=\"\",\"\",Ulus.İlişkiler.Sonuç!M20)","v":""},{"$f":"IF(Ulus.İlişkiler.Sonuç!N20=\"\",\"\",Ulus.İlişkiler.Sonuç!N20)","v":""}]
[{"$f":"IF(Ulus.İlişkiler.Sonuç!A21=\"\",\"\",Ulus.İlişkiler.Sonuç!A21)","v":""},{"$f":"IF(Ulus.İlişkiler.Sonuç!B21=\"\",\"\",LEFT(Ulus.İlişkiler.Sonuç!B21,3)&REPT(\"*\",4)&RIGHT(Ulus.İlişkiler.Sonuç!B21,2))","v":""},{"$f":"IF(Ulus.İlişkiler.Sonuç!C21=\"\",\"\",IF(ISERR(FIND(\" \",Ulus.İlişkiler.Sonuç!C21))=TRUE,LEFT(Ulus.İlişkiler.Sonuç!C21,2)&REPT(\"*\",3),LEFT(Ulus.İlişkiler.Sonuç!C21,2)&REPT(\"*\",3)&\" \"&MID(Ulus.İlişkiler.Sonuç!C21,FIND(\" \",Ulus.İlişkiler.Sonuç!C21)+1,2)&REPT(\"*\",3)))","v":""},{"$f":"IF(Ulus.İlişkiler.Sonuç!D21=\"\",\"\",IF(ISERR(FIND(\" \",Ulus.İlişkiler.Sonuç!D21))=TRUE,LEFT(Ulus.İlişkiler.Sonuç!D21,2)&REPT(\"*\",3),LEFT(Ulus.İlişkiler.Sonuç!D21,2)&REPT(\"*\",3)&\" \"&MID(Ulus.İlişkiler.Sonuç!D21,FIND(\" \",Ulus.İlişkiler.Sonuç!D21)+1,2)&REPT(\"*\",3)))","v":""},{"$f":"IF(Ulus.İlişkiler.Sonuç!E21=\"\",\"\",Ulus.İlişkiler.Sonuç!E21)","v":""},{"$f":"IF(Ulus.İlişkiler.Sonuç!F21=\"\",\"\",Ulus.İlişkiler.Sonuç!F21)","v":""},{"$f":"IF(Ulus.İlişkiler.Sonuç!G21=\"\",\"\",Ulus.İlişkiler.Sonuç!G21)","v":""},{"$f":"IF(Ulus.İlişkiler.Sonuç!H21=\"\",\"\",Ulus.İlişkiler.Sonuç!H21)","v":""},{"$f":"IF(Ulus.İlişkiler.Sonuç!I21=\"\",\"\",Ulus.İlişkiler.Sonuç!I21)","v":""},{"$f":"IF(Ulus.İlişkiler.Sonuç!J21=\"\",\"\",Ulus.İlişkiler.Sonuç!J21)","v":""},{"$f":"IF(Ulus.İlişkiler.Sonuç!K21=\"\",\"\",Ulus.İlişkiler.Sonuç!K21)","v":""},{"$f":"IF(Ulus.İlişkiler.Sonuç!L21=\"\",\"\",Ulus.İlişkiler.Sonuç!L21)","v":""},{"$f":"IF(Ulus.İlişkiler.Sonuç!M21=\"\",\"\",Ulus.İlişkiler.Sonuç!M21)","v":""},{"$f":"IF(Ulus.İlişkiler.Sonuç!N21=\"\",\"\",Ulus.İlişkiler.Sonuç!N21)","v":""}]
[{"$f":"IF(Ulus.İlişkiler.Sonuç!A22=\"\",\"\",Ulus.İlişkiler.Sonuç!A22)","v":""},{"$f":"IF(Ulus.İlişkiler.Sonuç!B22=\"\",\"\",LEFT(Ulus.İlişkiler.Sonuç!B22,3)&REPT(\"*\",4)&RIGHT(Ulus.İlişkiler.Sonuç!B22,2))","v":""},{"$f":"IF(Ulus.İlişkiler.Sonuç!C22=\"\",\"\",IF(ISERR(FIND(\" \",Ulus.İlişkiler.Sonuç!C22))=TRUE,LEFT(Ulus.İlişkiler.Sonuç!C22,2)&REPT(\"*\",3),LEFT(Ulus.İlişkiler.Sonuç!C22,2)&REPT(\"*\",3)&\" \"&MID(Ulus.İlişkiler.Sonuç!C22,FIND(\" \",Ulus.İlişkiler.Sonuç!C22)+1,2)&REPT(\"*\",3)))","v":""},{"$f":"IF(Ulus.İlişkiler.Sonuç!D22=\"\",\"\",IF(ISERR(FIND(\" \",Ulus.İlişkiler.Sonuç!D22))=TRUE,LEFT(Ulus.İlişkiler.Sonuç!D22,2)&REPT(\"*\",3),LEFT(Ulus.İlişkiler.Sonuç!D22,2)&REPT(\"*\",3)&\" \"&MID(Ulus.İlişkiler.Sonuç!D22,FIND(\" \",Ulus.İlişkiler.Sonuç!D22)+1,2)&REPT(\"*\",3)))","v":""},{"$f":"IF(Ulus.İlişkiler.Sonuç!E22=\"\",\"\",Ulus.İlişkiler.Sonuç!E22)","v":""},{"$f":"IF(Ulus.İlişkiler.Sonuç!F22=\"\",\"\",Ulus.İlişkiler.Sonuç!F22)","v":""},{"$f":"IF(Ulus.İlişkiler.Sonuç!G22=\"\",\"\",Ulus.İlişkiler.Sonuç!G22)","v":""},{"$f":"IF(Ulus.İlişkiler.Sonuç!H22=\"\",\"\",Ulus.İlişkiler.Sonuç!H22)","v":""},{"$f":"IF(Ulus.İlişkiler.Sonuç!I22=\"\",\"\",Ulus.İlişkiler.Sonuç!I22)","v":""},{"$f":"IF(Ulus.İlişkiler.Sonuç!J22=\"\",\"\",Ulus.İlişkiler.Sonuç!J22)","v":""},{"$f":"IF(Ulus.İlişkiler.Sonuç!K22=\"\",\"\",Ulus.İlişkiler.Sonuç!K22)","v":""},{"$f":"IF(Ulus.İlişkiler.Sonuç!L22=\"\",\"\",Ulus.İlişkiler.Sonuç!L22)","v":""},{"$f":"IF(Ulus.İlişkiler.Sonuç!M22=\"\",\"\",Ulus.İlişkiler.Sonuç!M22)","v":""},{"$f":"IF(Ulus.İlişkiler.Sonuç!N22=\"\",\"\",Ulus.İlişkiler.Sonuç!N22)","v":""}]
[{"$f":"IF(Ulus.İlişkiler.Sonuç!A23=\"\",\"\",Ulus.İlişkiler.Sonuç!A23)","v":""},{"$f":"IF(Ulus.İlişkiler.Sonuç!B23=\"\",\"\",LEFT(Ulus.İlişkiler.Sonuç!B23,3)&REPT(\"*\",4)&RIGHT(Ulus.İlişkiler.Sonuç!B23,2))","v":""},{"$f":"IF(Ulus.İlişkiler.Sonuç!C23=\"\",\"\",IF(ISERR(FIND(\" \",Ulus.İlişkiler.Sonuç!C23))=TRUE,LEFT(Ulus.İlişkiler.Sonuç!C23,2)&REPT(\"*\",3),LEFT(Ulus.İlişkiler.Sonuç!C23,2)&REPT(\"*\",3)&\" \"&MID(Ulus.İlişkiler.Sonuç!C23,FIND(\" \",Ulus.İlişkiler.Sonuç!C23)+1,2)&REPT(\"*\",3)))","v":""},{"$f":"IF(Ulus.İlişkiler.Sonuç!D23=\"\",\"\",IF(ISERR(FIND(\" \",Ulus.İlişkiler.Sonuç!D23))=TRUE,LEFT(Ulus.İlişkiler.Sonuç!D23,2)&REPT(\"*\",3),LEFT(Ulus.İlişkiler.Sonuç!D23,2)&REPT(\"*\",3)&\" \"&MID(Ulus.İlişkiler.Sonuç!D23,FIND(\" \",Ulus.İlişkiler.Sonuç!D23)+1,2)&REPT(\"*\",3)))","v":""},{"$f":"IF(Ulus.İlişkiler.Sonuç!E23=\"\",\"\",Ulus.İlişkiler.Sonuç!E23)","v":""},{"$f":"IF(Ulus.İlişkiler.Sonuç!F23=\"\",\"\",Ulus.İlişkiler.Sonuç!F23)","v":""},{"$f":"IF(Ulus.İlişkiler.Sonuç!G23=\"\",\"\",Ulus.İlişkiler.Sonuç!G23)","v":""},{"$f":"IF(Ulus.İlişkiler.Sonuç!H23=\"\",\"\",Ulus.İlişkiler.Sonuç!H23)","v":""},{"$f":"IF(Ulus.İlişkiler.Sonuç!I23=\"\",\"\",Ulus.İlişkiler.Sonuç!I23)","v":""},{"$f":"IF(Ulus.İlişkiler.Sonuç!J23=\"\",\"\",Ulus.İlişkiler.Sonuç!J23)","v":""},{"$f":"IF(Ulus.İlişkiler.Sonuç!K23=\"\",\"\",Ulus.İlişkiler.Sonuç!K23)","v":""},{"$f":"IF(Ulus.İlişkiler.Sonuç!L23=\"\",\"\",Ulus.İlişkiler.Sonuç!L23)","v":""},{"$f":"IF(Ulus.İlişkiler.Sonuç!M23=\"\",\"\",Ulus.İlişkiler.Sonuç!M23)","v":""},{"$f":"IF(Ulus.İlişkiler.Sonuç!N23=\"\",\"\",Ulus.İlişkiler.Sonuç!N23)","v":""}]
[{"$f":"IF(Ulus.İlişkiler.Sonuç!A24=\"\",\"\",Ulus.İlişkiler.Sonuç!A24)","v":""},{"$f":"IF(Ulus.İlişkiler.Sonuç!B24=\"\",\"\",LEFT(Ulus.İlişkiler.Sonuç!B24,3)&REPT(\"*\",4)&RIGHT(Ulus.İlişkiler.Sonuç!B24,2))","v":""},{"$f":"IF(Ulus.İlişkiler.Sonuç!C24=\"\",\"\",IF(ISERR(FIND(\" \",Ulus.İlişkiler.Sonuç!C24))=TRUE,LEFT(Ulus.İlişkiler.Sonuç!C24,2)&REPT(\"*\",3),LEFT(Ulus.İlişkiler.Sonuç!C24,2)&REPT(\"*\",3)&\" \"&MID(Ulus.İlişkiler.Sonuç!C24,FIND(\" \",Ulus.İlişkiler.Sonuç!C24)+1,2)&REPT(\"*\",3)))","v":""},{"$f":"IF(Ulus.İlişkiler.Sonuç!D24=\"\",\"\",IF(ISERR(FIND(\" \",Ulus.İlişkiler.Sonuç!D24))=TRUE,LEFT(Ulus.İlişkiler.Sonuç!D24,2)&REPT(\"*\",3),LEFT(Ulus.İlişkiler.Sonuç!D24,2)&REPT(\"*\",3)&\" \"&MID(Ulus.İlişkiler.Sonuç!D24,FIND(\" \",Ulus.İlişkiler.Sonuç!D24)+1,2)&REPT(\"*\",3)))","v":""},{"$f":"IF(Ulus.İlişkiler.Sonuç!E24=\"\",\"\",Ulus.İlişkiler.Sonuç!E24)","v":""},{"$f":"IF(Ulus.İlişkiler.Sonuç!F24=\"\",\"\",Ulus.İlişkiler.Sonuç!F24)","v":""},{"$f":"IF(Ulus.İlişkiler.Sonuç!G24=\"\",\"\",Ulus.İlişkiler.Sonuç!G24)","v":""},{"$f":"IF(Ulus.İlişkiler.Sonuç!H24=\"\",\"\",Ulus.İlişkiler.Sonuç!H24)","v":""},{"$f":"IF(Ulus.İlişkiler.Sonuç!I24=\"\",\"\",Ulus.İlişkiler.Sonuç!I24)","v":""},{"$f":"IF(Ulus.İlişkiler.Sonuç!J24=\"\",\"\",Ulus.İlişkiler.Sonuç!J24)","v":""},{"$f":"IF(Ulus.İlişkiler.Sonuç!K24=\"\",\"\",Ulus.İlişkiler.Sonuç!K24)","v":""},{"$f":"IF(Ulus.İlişkiler.Sonuç!L24=\"\",\"\",Ulus.İlişkiler.Sonuç!L24)","v":""},{"$f":"IF(Ulus.İlişkiler.Sonuç!M24=\"\",\"\",Ulus.İlişkiler.Sonuç!M24)","v":""},{"$f":"IF(Ulus.İlişkiler.Sonuç!N24=\"\",\"\",Ulus.İlişkiler.Sonuç!N24)","v":""}]
[{"$f":"IF(Ulus.İlişkiler.Sonuç!A25=\"\",\"\",Ulus.İlişkiler.Sonuç!A25)","v":""},{"$f":"IF(Ulus.İlişkiler.Sonuç!B25=\"\",\"\",LEFT(Ulus.İlişkiler.Sonuç!B25,3)&REPT(\"*\",4)&RIGHT(Ulus.İlişkiler.Sonuç!B25,2))","v":""},{"$f":"IF(Ulus.İlişkiler.Sonuç!C25=\"\",\"\",IF(ISERR(FIND(\" \",Ulus.İlişkiler.Sonuç!C25))=TRUE,LEFT(Ulus.İlişkiler.Sonuç!C25,2)&REPT(\"*\",3),LEFT(Ulus.İlişkiler.Sonuç!C25,2)&REPT(\"*\",3)&\" \"&MID(Ulus.İlişkiler.Sonuç!C25,FIND(\" \",Ulus.İlişkiler.Sonuç!C25)+1,2)&REPT(\"*\",3)))","v":""},{"$f":"IF(Ulus.İlişkiler.Sonuç!D25=\"\",\"\",IF(ISERR(FIND(\" \",Ulus.İlişkiler.Sonuç!D25))=TRUE,LEFT(Ulus.İlişkiler.Sonuç!D25,2)&REPT(\"*\",3),LEFT(Ulus.İlişkiler.Sonuç!D25,2)&REPT(\"*\",3)&\" \"&MID(Ulus.İlişkiler.Sonuç!D25,FIND(\" \",Ulus.İlişkiler.Sonuç!D25)+1,2)&REPT(\"*\",3)))","v":""},{"$f":"IF(Ulus.İlişkiler.Sonuç!E25=\"\",\"\",Ulus.İlişkiler.Sonuç!E25)","v":""},{"$f":"IF(Ulus.İlişkiler.Sonuç!F25=\"\",\"\",Ulus.İlişkiler.Sonuç!F25)","v":""},{"$f":"IF(Ulus.İlişkiler.Sonuç!G25=\"\",\"\",Ulus.İlişkiler.Sonuç!G25)","v":""},{"$f":"IF(Ulus.İlişkiler.Sonuç!H25=\"\",\"\",Ulus.İlişkiler.Sonuç!H25)","v":""},{"$f":"IF(Ulus.İlişkiler.Sonuç!I25=\"\",\"\",Ulus.İlişkiler.Sonuç!I25)","v":""},{"$f":"IF(Ulus.İlişkiler.Sonuç!J25=\"\",\"\",Ulus.İlişkiler.Sonuç!J25)","v":""},{"$f":"IF(Ulus.İlişkiler.Sonuç!K25=\"\",\"\",Ulus.İlişkiler.Sonuç!K25)","v":""},{"$f":"IF(Ulus.İlişkiler.Sonuç!L25=\"\",\"\",Ulus.İlişkiler.Sonuç!L25)","v":""},{"$f":"IF(Ulus.İlişkiler.Sonuç!M25=\"\",\"\",Ulus.İlişkiler.Sonuç!M25)","v":""},{"$f":"IF(Ulus.İlişkiler.Sonuç!N25=\"\",\"\",Ulus.İlişkiler.Sonuç!N25)","v":""}]
[{"$f":"IF(Ulus.İlişkiler.Sonuç!A26=\"\",\"\",Ulus.İlişkiler.Sonuç!A26)","v":""},{"$f":"IF(Ulus.İlişkiler.Sonuç!B26=\"\",\"\",LEFT(Ulus.İlişkiler.Sonuç!B26,3)&REPT(\"*\",4)&RIGHT(Ulus.İlişkiler.Sonuç!B26,2))","v":""},{"$f":"IF(Ulus.İlişkiler.Sonuç!C26=\"\",\"\",IF(ISERR(FIND(\" \",Ulus.İlişkiler.Sonuç!C26))=TRUE,LEFT(Ulus.İlişkiler.Sonuç!C26,2)&REPT(\"*\",3),LEFT(Ulus.İlişkiler.Sonuç!C26,2)&REPT(\"*\",3)&\" \"&MID(Ulus.İlişkiler.Sonuç!C26,FIND(\" \",Ulus.İlişkiler.Sonuç!C26)+1,2)&REPT(\"*\",3)))","v":""},{"$f":"IF(Ulus.İlişkiler.Sonuç!D26=\"\",\"\",IF(ISERR(FIND(\" \",Ulus.İlişkiler.Sonuç!D26))=TRUE,LEFT(Ulus.İlişkiler.Sonuç!D26,2)&REPT(\"*\",3),LEFT(Ulus.İlişkiler.Sonuç!D26,2)&REPT(\"*\",3)&\" \"&MID(Ulus.İlişkiler.Sonuç!D26,FIND(\" \",Ulus.İlişkiler.Sonuç!D26)+1,2)&REPT(\"*\",3)))","v":""},{"$f":"IF(Ulus.İlişkiler.Sonuç!E26=\"\",\"\",Ulus.İlişkiler.Sonuç!E26)","v":""},{"$f":"IF(Ulus.İlişkiler.Sonuç!F26=\"\",\"\",Ulus.İlişkiler.Sonuç!F26)","v":""},{"$f":"IF(Ulus.İlişkiler.Sonuç!G26=\"\",\"\",Ulus.İlişkiler.Sonuç!G26)","v":""},{"$f":"IF(Ulus.İlişkiler.Sonuç!H26=\"\",\"\",Ulus.İlişkiler.Sonuç!H26)","v":""},{"$f":"IF(Ulus.İlişkiler.Sonuç!I26=\"\",\"\",Ulus.İlişkiler.Sonuç!I26)","v":""},{"$f":"IF(Ulus.İlişkiler.Sonuç!J26=\"\",\"\",Ulus.İlişkiler.Sonuç!J26)","v":""},{"$f":"IF(Ulus.İlişkiler.Sonuç!K26=\"\",\"\",Ulus.İlişkiler.Sonuç!K26)","v":""},{"$f":"IF(Ulus.İlişkiler.Sonuç!L26=\"\",\"\",Ulus.İlişkiler.Sonuç!L26)","v":""},{"$f":"IF(Ulus.İlişkiler.Sonuç!M26=\"\",\"\",Ulus.İlişkiler.Sonuç!M26)","v":""},{"$f":"IF(Ulus.İlişkiler.Sonuç!N26=\"\",\"\",Ulus.İlişkiler.Sonuç!N26)","v":""}]
[{"$f":"IF(Ulus.İlişkiler.Sonuç!A27=\"\",\"\",Ulus.İlişkiler.Sonuç!A27)","v":""},{"$f":"IF(Ulus.İlişkiler.Sonuç!B27=\"\",\"\",LEFT(Ulus.İlişkiler.Sonuç!B27,3)&REPT(\"*\",4)&RIGHT(Ulus.İlişkiler.Sonuç!B27,2))","v":""},{"$f":"IF(Ulus.İlişkiler.Sonuç!C27=\"\",\"\",IF(ISERR(FIND(\" \",Ulus.İlişkiler.Sonuç!C27))=TRUE,LEFT(Ulus.İlişkiler.Sonuç!C27,2)&REPT(\"*\",3),LEFT(Ulus.İlişkiler.Sonuç!C27,2)&REPT(\"*\",3)&\" \"&MID(Ulus.İlişkiler.Sonuç!C27,FIND(\" \",Ulus.İlişkiler.Sonuç!C27)+1,2)&REPT(\"*\",3)))","v":""},{"$f":"IF(Ulus.İlişkiler.Sonuç!D27=\"\",\"\",IF(ISERR(FIND(\" \",Ulus.İlişkiler.Sonuç!D27))=TRUE,LEFT(Ulus.İlişkiler.Sonuç!D27,2)&REPT(\"*\",3),LEFT(Ulus.İlişkiler.Sonuç!D27,2)&REPT(\"*\",3)&\" \"&MID(Ulus.İlişkiler.Sonuç!D27,FIND(\" \",Ulus.İlişkiler.Sonuç!D27)+1,2)&REPT(\"*\",3)))","v":""},{"$f":"IF(Ulus.İlişkiler.Sonuç!E27=\"\",\"\",Ulus.İlişkiler.Sonuç!E27)","v":""},{"$f":"IF(Ulus.İlişkiler.Sonuç!F27=\"\",\"\",Ulus.İlişkiler.Sonuç!F27)","v":""},{"$f":"IF(Ulus.İlişkiler.Sonuç!G27=\"\",\"\",Ulus.İlişkiler.Sonuç!G27)","v":""},{"$f":"IF(Ulus.İlişkiler.Sonuç!H27=\"\",\"\",Ulus.İlişkiler.Sonuç!H27)","v":""},{"$f":"IF(Ulus.İlişkiler.Sonuç!I27=\"\",\"\",Ulus.İlişkiler.Sonuç!I27)","v":""},{"$f":"IF(Ulus.İlişkiler.Sonuç!J27=\"\",\"\",Ulus.İlişkiler.Sonuç!J27)","v":""},{"$f":"IF(Ulus.İlişkiler.Sonuç!K27=\"\",\"\",Ulus.İlişkiler.Sonuç!K27)","v":""},{"$f":"IF(Ulus.İlişkiler.Sonuç!L27=\"\",\"\",Ulus.İlişkiler.Sonuç!L27)","v":""},{"$f":"IF(Ulus.İlişkiler.Sonuç!M27=\"\",\"\",Ulus.İlişkiler.Sonuç!M27)","v":""},{"$f":"IF(Ulus.İlişkiler.Sonuç!N27=\"\",\"\",Ulus.İlişkiler.Sonuç!N27)","v":""}]
[{"$f":"IF(Ulus.İlişkiler.Sonuç!A28=\"\",\"\",Ulus.İlişkiler.Sonuç!A28)","v":""},{"$f":"IF(Ulus.İlişkiler.Sonuç!B28=\"\",\"\",LEFT(Ulus.İlişkiler.Sonuç!B28,3)&REPT(\"*\",4)&RIGHT(Ulus.İlişkiler.Sonuç!B28,2))","v":""},{"$f":"IF(Ulus.İlişkiler.Sonuç!C28=\"\",\"\",IF(ISERR(FIND(\" \",Ulus.İlişkiler.Sonuç!C28))=TRUE,LEFT(Ulus.İlişkiler.Sonuç!C28,2)&REPT(\"*\",3),LEFT(Ulus.İlişkiler.Sonuç!C28,2)&REPT(\"*\",3)&\" \"&MID(Ulus.İlişkiler.Sonuç!C28,FIND(\" \",Ulus.İlişkiler.Sonuç!C28)+1,2)&REPT(\"*\",3)))","v":""},{"$f":"IF(Ulus.İlişkiler.Sonuç!D28=\"\",\"\",IF(ISERR(FIND(\" \",Ulus.İlişkiler.Sonuç!D28))=TRUE,LEFT(Ulus.İlişkiler.Sonuç!D28,2)&REPT(\"*\",3),LEFT(Ulus.İlişkiler.Sonuç!D28,2)&REPT(\"*\",3)&\" \"&MID(Ulus.İlişkiler.Sonuç!D28,FIND(\" \",Ulus.İlişkiler.Sonuç!D28)+1,2)&REPT(\"*\",3)))","v":""},{"$f":"IF(Ulus.İlişkiler.Sonuç!E28=\"\",\"\",Ulus.İlişkiler.Sonuç!E28)","v":""},{"$f":"IF(Ulus.İlişkiler.Sonuç!F28=\"\",\"\",Ulus.İlişkiler.Sonuç!F28)","v":""},{"$f":"IF(Ulus.İlişkiler.Sonuç!G28=\"\",\"\",Ulus.İlişkiler.Sonuç!G28)","v":""},{"$f":"IF(Ulus.İlişkiler.Sonuç!H28=\"\",\"\",Ulus.İlişkiler.Sonuç!H28)","v":""},{"$f":"IF(Ulus.İlişkiler.Sonuç!I28=\"\",\"\",Ulus.İlişkiler.Sonuç!I28)","v":""},{"$f":"IF(Ulus.İlişkiler.Sonuç!J28=\"\",\"\",Ulus.İlişkiler.Sonuç!J28)","v":""},{"$f":"IF(Ulus.İlişkiler.Sonuç!K28=\"\",\"\",Ulus.İlişkiler.Sonuç!K28)","v":""},{"$f":"IF(Ulus.İlişkiler.Sonuç!L28=\"\",\"\",Ulus.İlişkiler.Sonuç!L28)","v":""},{"$f":"IF(Ulus.İlişkiler.Sonuç!M28=\"\",\"\",Ulus.İlişkiler.Sonuç!M28)","v":""},{"$f":"IF(Ulus.İlişkiler.Sonuç!N28=\"\",\"\",Ulus.İlişkiler.Sonuç!N28)","v":""}]
[{"$f":"IF(Ulus.İlişkiler.Sonuç!A29=\"\",\"\",Ulus.İlişkiler.Sonuç!A29)","v":""},{"$f":"IF(Ulus.İlişkiler.Sonuç!B29=\"\",\"\",LEFT(Ulus.İlişkiler.Sonuç!B29,3)&REPT(\"*\",4)&RIGHT(Ulus.İlişkiler.Sonuç!B29,2))","v":""},{"$f":"IF(Ulus.İlişkiler.Sonuç!C29=\"\",\"\",IF(ISERR(FIND(\" \",Ulus.İlişkiler.Sonuç!C29))=TRUE,LEFT(Ulus.İlişkiler.Sonuç!C29,2)&REPT(\"*\",3),LEFT(Ulus.İlişkiler.Sonuç!C29,2)&REPT(\"*\",3)&\" \"&MID(Ulus.İlişkiler.Sonuç!C29,FIND(\" \",Ulus.İlişkiler.Sonuç!C29)+1,2)&REPT(\"*\",3)))","v":""},{"$f":"IF(Ulus.İlişkiler.Sonuç!D29=\"\",\"\",IF(ISERR(FIND(\" \",Ulus.İlişkiler.Sonuç!D29))=TRUE,LEFT(Ulus.İlişkiler.Sonuç!D29,2)&REPT(\"*\",3),LEFT(Ulus.İlişkiler.Sonuç!D29,2)&REPT(\"*\",3)&\" \"&MID(Ulus.İlişkiler.Sonuç!D29,FIND(\" \",Ulus.İlişkiler.Sonuç!D29)+1,2)&REPT(\"*\",3)))","v":""},{"$f":"IF(Ulus.İlişkiler.Sonuç!E29=\"\",\"\",Ulus.İlişkiler.Sonuç!E29)","v":""},{"$f":"IF(Ulus.İlişkiler.Sonuç!F29=\"\",\"\",Ulus.İlişkiler.Sonuç!F29)","v":""},{"$f":"IF(Ulus.İlişkiler.Sonuç!G29=\"\",\"\",Ulus.İlişkiler.Sonuç!G29)","v":""},{"$f":"IF(Ulus.İlişkiler.Sonuç!H29=\"\",\"\",Ulus.İlişkiler.Sonuç!H29)","v":""},{"$f":"IF(Ulus.İlişkiler.Sonuç!I29=\"\",\"\",Ulus.İlişkiler.Sonuç!I29)","v":""},{"$f":"IF(Ulus.İlişkiler.Sonuç!J29=\"\",\"\",Ulus.İlişkiler.Sonuç!J29)","v":""},{"$f":"IF(Ulus.İlişkiler.Sonuç!K29=\"\",\"\",Ulus.İlişkiler.Sonuç!K29)","v":""},{"$f":"IF(Ulus.İlişkiler.Sonuç!L29=\"\",\"\",Ulus.İlişkiler.Sonuç!L29)","v":""},{"$f":"IF(Ulus.İlişkiler.Sonuç!M29=\"\",\"\",Ulus.İlişkiler.Sonuç!M29)","v":""},{"$f":"IF(Ulus.İlişkiler.Sonuç!N29=\"\",\"\",Ulus.İlişkiler.Sonuç!N29)","v":""}]
[{"$f":"IF(Ulus.İlişkiler.Sonuç!A30=\"\",\"\",Ulus.İlişkiler.Sonuç!A30)","v":""},{"$f":"IF(Ulus.İlişkiler.Sonuç!B30=\"\",\"\",LEFT(Ulus.İlişkiler.Sonuç!B30,3)&REPT(\"*\",4)&RIGHT(Ulus.İlişkiler.Sonuç!B30,2))","v":""},{"$f":"IF(Ulus.İlişkiler.Sonuç!C30=\"\",\"\",IF(ISERR(FIND(\" \",Ulus.İlişkiler.Sonuç!C30))=TRUE,LEFT(Ulus.İlişkiler.Sonuç!C30,2)&REPT(\"*\",3),LEFT(Ulus.İlişkiler.Sonuç!C30,2)&REPT(\"*\",3)&\" \"&MID(Ulus.İlişkiler.Sonuç!C30,FIND(\" \",Ulus.İlişkiler.Sonuç!C30)+1,2)&REPT(\"*\",3)))","v":""},{"$f":"IF(Ulus.İlişkiler.Sonuç!D30=\"\",\"\",IF(ISERR(FIND(\" \",Ulus.İlişkiler.Sonuç!D30))=TRUE,LEFT(Ulus.İlişkiler.Sonuç!D30,2)&REPT(\"*\",3),LEFT(Ulus.İlişkiler.Sonuç!D30,2)&REPT(\"*\",3)&\" \"&MID(Ulus.İlişkiler.Sonuç!D30,FIND(\" \",Ulus.İlişkiler.Sonuç!D30)+1,2)&REPT(\"*\",3)))","v":""},{"$f":"IF(Ulus.İlişkiler.Sonuç!E30=\"\",\"\",Ulus.İlişkiler.Sonuç!E30)","v":""},{"$f":"IF(Ulus.İlişkiler.Sonuç!F30=\"\",\"\",Ulus.İlişkiler.Sonuç!F30)","v":""},{"$f":"IF(Ulus.İlişkiler.Sonuç!G30=\"\",\"\",Ulus.İlişkiler.Sonuç!G30)","v":""},{"$f":"IF(Ulus.İlişkiler.Sonuç!H30=\"\",\"\",Ulus.İlişkiler.Sonuç!H30)","v":""},{"$f":"IF(Ulus.İlişkiler.Sonuç!I30=\"\",\"\",Ulus.İlişkiler.Sonuç!I30)","v":""},{"$f":"IF(Ulus.İlişkiler.Sonuç!J30=\"\",\"\",Ulus.İlişkiler.Sonuç!J30)","v":""},{"$f":"IF(Ulus.İlişkiler.Sonuç!K30=\"\",\"\",Ulus.İlişkiler.Sonuç!K30)","v":""},{"$f":"IF(Ulus.İlişkiler.Sonuç!L30=\"\",\"\",Ulus.İlişkiler.Sonuç!L30)","v":""},{"$f":"IF(Ulus.İlişkiler.Sonuç!M30=\"\",\"\",Ulus.İlişkiler.Sonuç!M30)","v":""},{"$f":"IF(Ulus.İlişkiler.Sonuç!N30=\"\",\"\",Ulus.İlişkiler.Sonuç!N30)","v":""}]
[{"$f":"IF(Ulus.İlişkiler.Sonuç!A31=\"\",\"\",Ulus.İlişkiler.Sonuç!A31)","v":""},{"$f":"IF(Ulus.İlişkiler.Sonuç!B31=\"\",\"\",LEFT(Ulus.İlişkiler.Sonuç!B31,3)&REPT(\"*\",4)&RIGHT(Ulus.İlişkiler.Sonuç!B31,2))","v":""},{"$f":"IF(Ulus.İlişkiler.Sonuç!C31=\"\",\"\",IF(ISERR(FIND(\" \",Ulus.İlişkiler.Sonuç!C31))=TRUE,LEFT(Ulus.İlişkiler.Sonuç!C31,2)&REPT(\"*\",3),LEFT(Ulus.İlişkiler.Sonuç!C31,2)&REPT(\"*\",3)&\" \"&MID(Ulus.İlişkiler.Sonuç!C31,FIND(\" \",Ulus.İlişkiler.Sonuç!C31)+1,2)&REPT(\"*\",3)))","v":""},{"$f":"IF(Ulus.İlişkiler.Sonuç!D31=\"\",\"\",IF(ISERR(FIND(\" \",Ulus.İlişkiler.Sonuç!D31))=TRUE,LEFT(Ulus.İlişkiler.Sonuç!D31,2)&REPT(\"*\",3),LEFT(Ulus.İlişkiler.Sonuç!D31,2)&REPT(\"*\",3)&\" \"&MID(Ulus.İlişkiler.Sonuç!D31,FIND(\" \",Ulus.İlişkiler.Sonuç!D31)+1,2)&REPT(\"*\",3)))","v":""},{"$f":"IF(Ulus.İlişkiler.Sonuç!E31=\"\",\"\",Ulus.İlişkiler.Sonuç!E31)","v":""},{"$f":"IF(Ulus.İlişkiler.Sonuç!F31=\"\",\"\",Ulus.İlişkiler.Sonuç!F31)","v":""},{"$f":"IF(Ulus.İlişkiler.Sonuç!G31=\"\",\"\",Ulus.İlişkiler.Sonuç!G31)","v":""},{"$f":"IF(Ulus.İlişkiler.Sonuç!H31=\"\",\"\",Ulus.İlişkiler.Sonuç!H31)","v":""},{"$f":"IF(Ulus.İlişkiler.Sonuç!I31=\"\",\"\",Ulus.İlişkiler.Sonuç!I31)","v":""},{"$f":"IF(Ulus.İlişkiler.Sonuç!J31=\"\",\"\",Ulus.İlişkiler.Sonuç!J31)","v":""},{"$f":"IF(Ulus.İlişkiler.Sonuç!K31=\"\",\"\",Ulus.İlişkiler.Sonuç!K31)","v":""},{"$f":"IF(Ulus.İlişkiler.Sonuç!L31=\"\",\"\",Ulus.İlişkiler.Sonuç!L31)","v":""},{"$f":"IF(Ulus.İlişkiler.Sonuç!M31=\"\",\"\",Ulus.İlişkiler.Sonuç!M31)","v":""},{"$f":"IF(Ulus.İlişkiler.Sonuç!N31=\"\",\"\",Ulus.İlişkiler.Sonuç!N31)","v":""}]
[{"$f":"IF(Ulus.İlişkiler.Sonuç!A32=\"\",\"\",Ulus.İlişkiler.Sonuç!A32)","v":""},{"$f":"IF(Ulus.İlişkiler.Sonuç!B32=\"\",\"\",LEFT(Ulus.İlişkiler.Sonuç!B32,3)&REPT(\"*\",4)&RIGHT(Ulus.İlişkiler.Sonuç!B32,2))","v":""},{"$f":"IF(Ulus.İlişkiler.Sonuç!C32=\"\",\"\",IF(ISERR(FIND(\" \",Ulus.İlişkiler.Sonuç!C32))=TRUE,LEFT(Ulus.İlişkiler.Sonuç!C32,2)&REPT(\"*\",3),LEFT(Ulus.İlişkiler.Sonuç!C32,2)&REPT(\"*\",3)&\" \"&MID(Ulus.İlişkiler.Sonuç!C32,FIND(\" \",Ulus.İlişkiler.Sonuç!C32)+1,2)&REPT(\"*\",3)))","v":""},{"$f":"IF(Ulus.İlişkiler.Sonuç!D32=\"\",\"\",IF(ISERR(FIND(\" \",Ulus.İlişkiler.Sonuç!D32))=TRUE,LEFT(Ulus.İlişkiler.Sonuç!D32,2)&REPT(\"*\",3),LEFT(Ulus.İlişkiler.Sonuç!D32,2)&REPT(\"*\",3)&\" \"&MID(Ulus.İlişkiler.Sonuç!D32,FIND(\" \",Ulus.İlişkiler.Sonuç!D32)+1,2)&REPT(\"*\",3)))","v":""},{"$f":"IF(Ulus.İlişkiler.Sonuç!E32=\"\",\"\",Ulus.İlişkiler.Sonuç!E32)","v":""},{"$f":"IF(Ulus.İlişkiler.Sonuç!F32=\"\",\"\",Ulus.İlişkiler.Sonuç!F32)","v":""},{"$f":"IF(Ulus.İlişkiler.Sonuç!G32=\"\",\"\",Ulus.İlişkiler.Sonuç!G32)","v":""},{"$f":"IF(Ulus.İlişkiler.Sonuç!H32=\"\",\"\",Ulus.İlişkiler.Sonuç!H32)","v":""},{"$f":"IF(Ulus.İlişkiler.Sonuç!I32=\"\",\"\",Ulus.İlişkiler.Sonuç!I32)","v":""},{"$f":"IF(Ulus.İlişkiler.Sonuç!J32=\"\",\"\",Ulus.İlişkiler.Sonuç!J32)","v":""},{"$f":"IF(Ulus.İlişkiler.Sonuç!K32=\"\",\"\",Ulus.İlişkiler.Sonuç!K32)","v":""},{"$f":"IF(Ulus.İlişkiler.Sonuç!L32=\"\",\"\",Ulus.İlişkiler.Sonuç!L32)","v":""},{"$f":"IF(Ulus.İlişkiler.Sonuç!M32=\"\",\"\",Ulus.İlişkiler.Sonuç!M32)","v":""},{"$f":"IF(Ulus.İlişkiler.Sonuç!N32=\"\",\"\",Ulus.İlişkiler.Sonuç!N32)","v":""}]
[{"$f":"IF(Ulus.İlişkiler.Sonuç!A33=\"\",\"\",Ulus.İlişkiler.Sonuç!A33)","v":""},{"$f":"IF(Ulus.İlişkiler.Sonuç!B33=\"\",\"\",LEFT(Ulus.İlişkiler.Sonuç!B33,3)&REPT(\"*\",4)&RIGHT(Ulus.İlişkiler.Sonuç!B33,2))","v":""},{"$f":"IF(Ulus.İlişkiler.Sonuç!C33=\"\",\"\",IF(ISERR(FIND(\" \",Ulus.İlişkiler.Sonuç!C33))=TRUE,LEFT(Ulus.İlişkiler.Sonuç!C33,2)&REPT(\"*\",3),LEFT(Ulus.İlişkiler.Sonuç!C33,2)&REPT(\"*\",3)&\" \"&MID(Ulus.İlişkiler.Sonuç!C33,FIND(\" \",Ulus.İlişkiler.Sonuç!C33)+1,2)&REPT(\"*\",3)))","v":""},{"$f":"IF(Ulus.İlişkiler.Sonuç!D33=\"\",\"\",IF(ISERR(FIND(\" \",Ulus.İlişkiler.Sonuç!D33))=TRUE,LEFT(Ulus.İlişkiler.Sonuç!D33,2)&REPT(\"*\",3),LEFT(Ulus.İlişkiler.Sonuç!D33,2)&REPT(\"*\",3)&\" \"&MID(Ulus.İlişkiler.Sonuç!D33,FIND(\" \",Ulus.İlişkiler.Sonuç!D33)+1,2)&REPT(\"*\",3)))","v":""},{"$f":"IF(Ulus.İlişkiler.Sonuç!E33=\"\",\"\",Ulus.İlişkiler.Sonuç!E33)","v":""},{"$f":"IF(Ulus.İlişkiler.Sonuç!F33=\"\",\"\",Ulus.İlişkiler.Sonuç!F33)","v":""},{"$f":"IF(Ulus.İlişkiler.Sonuç!G33=\"\",\"\",Ulus.İlişkiler.Sonuç!G33)","v":""},{"$f":"IF(Ulus.İlişkiler.Sonuç!H33=\"\",\"\",Ulus.İlişkiler.Sonuç!H33)","v":""},{"$f":"IF(Ulus.İlişkiler.Sonuç!I33=\"\",\"\",Ulus.İlişkiler.Sonuç!I33)","v":""},{"$f":"IF(Ulus.İlişkiler.Sonuç!J33=\"\",\"\",Ulus.İlişkiler.Sonuç!J33)","v":""},{"$f":"IF(Ulus.İlişkiler.Sonuç!K33=\"\",\"\",Ulus.İlişkiler.Sonuç!K33)","v":""},{"$f":"IF(Ulus.İlişkiler.Sonuç!L33=\"\",\"\",Ulus.İlişkiler.Sonuç!L33)","v":""},{"$f":"IF(Ulus.İlişkiler.Sonuç!M33=\"\",\"\",Ulus.İlişkiler.Sonuç!M33)","v":""},{"$f":"IF(Ulus.İlişkiler.Sonuç!N33=\"\",\"\",Ulus.İlişkiler.Sonuç!N33)","v":""}]
[{"$f":"IF(Ulus.İlişkiler.Sonuç!A34=\"\",\"\",Ulus.İlişkiler.Sonuç!A34)","v":""},{"$f":"IF(Ulus.İlişkiler.Sonuç!B34=\"\",\"\",LEFT(Ulus.İlişkiler.Sonuç!B34,3)&REPT(\"*\",4)&RIGHT(Ulus.İlişkiler.Sonuç!B34,2))","v":""},{"$f":"IF(Ulus.İlişkiler.Sonuç!C34=\"\",\"\",IF(ISERR(FIND(\" \",Ulus.İlişkiler.Sonuç!C34))=TRUE,LEFT(Ulus.İlişkiler.Sonuç!C34,2)&REPT(\"*\",3),LEFT(Ulus.İlişkiler.Sonuç!C34,2)&REPT(\"*\",3)&\" \"&MID(Ulus.İlişkiler.Sonuç!C34,FIND(\" \",Ulus.İlişkiler.Sonuç!C34)+1,2)&REPT(\"*\",3)))","v":""},{"$f":"IF(Ulus.İlişkiler.Sonuç!D34=\"\",\"\",IF(ISERR(FIND(\" \",Ulus.İlişkiler.Sonuç!D34))=TRUE,LEFT(Ulus.İlişkiler.Sonuç!D34,2)&REPT(\"*\",3),LEFT(Ulus.İlişkiler.Sonuç!D34,2)&REPT(\"*\",3)&\" \"&MID(Ulus.İlişkiler.Sonuç!D34,FIND(\" \",Ulus.İlişkiler.Sonuç!D34)+1,2)&REPT(\"*\",3)))","v":""},{"$f":"IF(Ulus.İlişkiler.Sonuç!E34=\"\",\"\",Ulus.İlişkiler.Sonuç!E34)","v":""},{"$f":"IF(Ulus.İlişkiler.Sonuç!F34=\"\",\"\",Ulus.İlişkiler.Sonuç!F34)","v":""},{"$f":"IF(Ulus.İlişkiler.Sonuç!G34=\"\",\"\",Ulus.İlişkiler.Sonuç!G34)","v":""},{"$f":"IF(Ulus.İlişkiler.Sonuç!H34=\"\",\"\",Ulus.İlişkiler.Sonuç!H34)","v":""},{"$f":"IF(Ulus.İlişkiler.Sonuç!I34=\"\",\"\",Ulus.İlişkiler.Sonuç!I34)","v":""},{"$f":"IF(Ulus.İlişkiler.Sonuç!J34=\"\",\"\",Ulus.İlişkiler.Sonuç!J34)","v":""},{"$f":"IF(Ulus.İlişkiler.Sonuç!K34=\"\",\"\",Ulus.İlişkiler.Sonuç!K34)","v":""},{"$f":"IF(Ulus.İlişkiler.Sonuç!L34=\"\",\"\",Ulus.İlişkiler.Sonuç!L34)","v":""},{"$f":"IF(Ulus.İlişkiler.Sonuç!M34=\"\",\"\",Ulus.İlişkiler.Sonuç!M34)","v":""},{"$f":"IF(Ulus.İlişkiler.Sonuç!N34=\"\",\"\",Ulus.İlişkiler.Sonuç!N34)","v":""}]
[{"$f":"IF(Ulus.İlişkiler.Sonuç!A35=\"\",\"\",Ulus.İlişkiler.Sonuç!A35)","v":""},{"$f":"IF(Ulus.İlişkiler.Sonuç!B35=\"\",\"\",LEFT(Ulus.İlişkiler.Sonuç!B35,3)&REPT(\"*\",4)&RIGHT(Ulus.İlişkiler.Sonuç!B35,2))","v":""},{"$f":"IF(Ulus.İlişkiler.Sonuç!C35=\"\",\"\",IF(ISERR(FIND(\" \",Ulus.İlişkiler.Sonuç!C35))=TRUE,LEFT(Ulus.İlişkiler.Sonuç!C35,2)&REPT(\"*\",3),LEFT(Ulus.İlişkiler.Sonuç!C35,2)&REPT(\"*\",3)&\" \"&MID(Ulus.İlişkiler.Sonuç!C35,FIND(\" \",Ulus.İlişkiler.Sonuç!C35)+1,2)&REPT(\"*\",3)))","v":""},{"$f":"IF(Ulus.İlişkiler.Sonuç!D35=\"\",\"\",IF(ISERR(FIND(\" \",Ulus.İlişkiler.Sonuç!D35))=TRUE,LEFT(Ulus.İlişkiler.Sonuç!D35,2)&REPT(\"*\",3),LEFT(Ulus.İlişkiler.Sonuç!D35,2)&REPT(\"*\",3)&\" \"&MID(Ulus.İlişkiler.Sonuç!D35,FIND(\" \",Ulus.İlişkiler.Sonuç!D35)+1,2)&REPT(\"*\",3)))","v":""},{"$f":"IF(Ulus.İlişkiler.Sonuç!E35=\"\",\"\",Ulus.İlişkiler.Sonuç!E35)","v":""},{"$f":"IF(Ulus.İlişkiler.Sonuç!F35=\"\",\"\",Ulus.İlişkiler.Sonuç!F35)","v":""},{"$f":"IF(Ulus.İlişkiler.Sonuç!G35=\"\",\"\",Ulus.İlişkiler.Sonuç!G35)","v":""},{"$f":"IF(Ulus.İlişkiler.Sonuç!H35=\"\",\"\",Ulus.İlişkiler.Sonuç!H35)","v":""},{"$f":"IF(Ulus.İlişkiler.Sonuç!I35=\"\",\"\",Ulus.İlişkiler.Sonuç!I35)","v":""},{"$f":"IF(Ulus.İlişkiler.Sonuç!J35=\"\",\"\",Ulus.İlişkiler.Sonuç!J35)","v":""},{"$f":"IF(Ulus.İlişkiler.Sonuç!K35=\"\",\"\",Ulus.İlişkiler.Sonuç!K35)","v":""},{"$f":"IF(Ulus.İlişkiler.Sonuç!L35=\"\",\"\",Ulus.İlişkiler.Sonuç!L35)","v":""},{"$f":"IF(Ulus.İlişkiler.Sonuç!M35=\"\",\"\",Ulus.İlişkiler.Sonuç!M35)","v":""},{"$f":"IF(Ulus.İlişkiler.Sonuç!N35=\"\",\"\",Ulus.İlişkiler.Sonuç!N35)","v":""}]
[{"$f":"IF(Ulus.İlişkiler.Sonuç!A36=\"\",\"\",Ulus.İlişkiler.Sonuç!A36)","v":""},{"$f":"IF(Ulus.İlişkiler.Sonuç!B36=\"\",\"\",LEFT(Ulus.İlişkiler.Sonuç!B36,3)&REPT(\"*\",4)&RIGHT(Ulus.İlişkiler.Sonuç!B36,2))","v":""},{"$f":"IF(Ulus.İlişkiler.Sonuç!C36=\"\",\"\",IF(ISERR(FIND(\" \",Ulus.İlişkiler.Sonuç!C36))=TRUE,LEFT(Ulus.İlişkiler.Sonuç!C36,2)&REPT(\"*\",3),LEFT(Ulus.İlişkiler.Sonuç!C36,2)&REPT(\"*\",3)&\" \"&MID(Ulus.İlişkiler.Sonuç!C36,FIND(\" \",Ulus.İlişkiler.Sonuç!C36)+1,2)&REPT(\"*\",3)))","v":""},{"$f":"IF(Ulus.İlişkiler.Sonuç!D36=\"\",\"\",IF(ISERR(FIND(\" \",Ulus.İlişkiler.Sonuç!D36))=TRUE,LEFT(Ulus.İlişkiler.Sonuç!D36,2)&REPT(\"*\",3),LEFT(Ulus.İlişkiler.Sonuç!D36,2)&REPT(\"*\",3)&\" \"&MID(Ulus.İlişkiler.Sonuç!D36,FIND(\" \",Ulus.İlişkiler.Sonuç!D36)+1,2)&REPT(\"*\",3)))","v":""},{"$f":"IF(Ulus.İlişkiler.Sonuç!E36=\"\",\"\",Ulus.İlişkiler.Sonuç!E36)","v":""},{"$f":"IF(Ulus.İlişkiler.Sonuç!F36=\"\",\"\",Ulus.İlişkiler.Sonuç!F36)","v":""},{"$f":"IF(Ulus.İlişkiler.Sonuç!G36=\"\",\"\",Ulus.İlişkiler.Sonuç!G36)","v":""},{"$f":"IF(Ulus.İlişkiler.Sonuç!H36=\"\",\"\",Ulus.İlişkiler.Sonuç!H36)","v":""},{"$f":"IF(Ulus.İlişkiler.Sonuç!I36=\"\",\"\",Ulus.İlişkiler.Sonuç!I36)","v":""},{"$f":"IF(Ulus.İlişkiler.Sonuç!J36=\"\",\"\",Ulus.İlişkiler.Sonuç!J36)","v":""},{"$f":"IF(Ulus.İlişkiler.Sonuç!K36=\"\",\"\",Ulus.İlişkiler.Sonuç!K36)","v":""},{"$f":"IF(Ulus.İlişkiler.Sonuç!L36=\"\",\"\",Ulus.İlişkiler.Sonuç!L36)","v":""},{"$f":"IF(Ulus.İlişkiler.Sonuç!M36=\"\",\"\",Ulus.İlişkiler.Sonuç!M36)","v":""},{"$f":"IF(Ulus.İlişkiler.Sonuç!N36=\"\",\"\",Ulus.İlişkiler.Sonuç!N36)","v":""}]
[{"$f":"IF(Ulus.İlişkiler.Sonuç!A37=\"\",\"\",Ulus.İlişkiler.Sonuç!A37)","v":""},{"$f":"IF(Ulus.İlişkiler.Sonuç!B37=\"\",\"\",LEFT(Ulus.İlişkiler.Sonuç!B37,3)&REPT(\"*\",4)&RIGHT(Ulus.İlişkiler.Sonuç!B37,2))","v":""},{"$f":"IF(Ulus.İlişkiler.Sonuç!C37=\"\",\"\",IF(ISERR(FIND(\" \",Ulus.İlişkiler.Sonuç!C37))=TRUE,LEFT(Ulus.İlişkiler.Sonuç!C37,2)&REPT(\"*\",3),LEFT(Ulus.İlişkiler.Sonuç!C37,2)&REPT(\"*\",3)&\" \"&MID(Ulus.İlişkiler.Sonuç!C37,FIND(\" \",Ulus.İlişkiler.Sonuç!C37)+1,2)&REPT(\"*\",3)))","v":""},{"$f":"IF(Ulus.İlişkiler.Sonuç!D37=\"\",\"\",IF(ISERR(FIND(\" \",Ulus.İlişkiler.Sonuç!D37))=TRUE,LEFT(Ulus.İlişkiler.Sonuç!D37,2)&REPT(\"*\",3),LEFT(Ulus.İlişkiler.Sonuç!D37,2)&REPT(\"*\",3)&\" \"&MID(Ulus.İlişkiler.Sonuç!D37,FIND(\" \",Ulus.İlişkiler.Sonuç!D37)+1,2)&REPT(\"*\",3)))","v":""},{"$f":"IF(Ulus.İlişkiler.Sonuç!E37=\"\",\"\",Ulus.İlişkiler.Sonuç!E37)","v":""},{"$f":"IF(Ulus.İlişkiler.Sonuç!F37=\"\",\"\",Ulus.İlişkiler.Sonuç!F37)","v":""},{"$f":"IF(Ulus.İlişkiler.Sonuç!G37=\"\",\"\",Ulus.İlişkiler.Sonuç!G37)","v":""},{"$f":"IF(Ulus.İlişkiler.Sonuç!H37=\"\",\"\",Ulus.İlişkiler.Sonuç!H37)","v":""},{"$f":"IF(Ulus.İlişkiler.Sonuç!I37=\"\",\"\",Ulus.İlişkiler.Sonuç!I37)","v":""},{"$f":"IF(Ulus.İlişkiler.Sonuç!J37=\"\",\"\",Ulus.İlişkiler.Sonuç!J37)","v":""},{"$f":"IF(Ulus.İlişkiler.Sonuç!K37=\"\",\"\",Ulus.İlişkiler.Sonuç!K37)","v":""},{"$f":"IF(Ulus.İlişkiler.Sonuç!L37=\"\",\"\",Ulus.İlişkiler.Sonuç!L37)","v":""},{"$f":"IF(Ulus.İlişkiler.Sonuç!M37=\"\",\"\",Ulus.İlişkiler.Sonuç!M37)","v":""},{"$f":"IF(Ulus.İlişkiler.Sonuç!N37=\"\",\"\",Ulus.İlişkiler.Sonuç!N37)","v":""}]
[{"$f":"IF(Ulus.İlişkiler.Sonuç!A38=\"\",\"\",Ulus.İlişkiler.Sonuç!A38)","v":""},{"$f":"IF(Ulus.İlişkiler.Sonuç!B38=\"\",\"\",LEFT(Ulus.İlişkiler.Sonuç!B38,3)&REPT(\"*\",4)&RIGHT(Ulus.İlişkiler.Sonuç!B38,2))","v":""},{"$f":"IF(Ulus.İlişkiler.Sonuç!C38=\"\",\"\",IF(ISERR(FIND(\" \",Ulus.İlişkiler.Sonuç!C38))=TRUE,LEFT(Ulus.İlişkiler.Sonuç!C38,2)&REPT(\"*\",3),LEFT(Ulus.İlişkiler.Sonuç!C38,2)&REPT(\"*\",3)&\" \"&MID(Ulus.İlişkiler.Sonuç!C38,FIND(\" \",Ulus.İlişkiler.Sonuç!C38)+1,2)&REPT(\"*\",3)))","v":""},{"$f":"IF(Ulus.İlişkiler.Sonuç!D38=\"\",\"\",IF(ISERR(FIND(\" \",Ulus.İlişkiler.Sonuç!D38))=TRUE,LEFT(Ulus.İlişkiler.Sonuç!D38,2)&REPT(\"*\",3),LEFT(Ulus.İlişkiler.Sonuç!D38,2)&REPT(\"*\",3)&\" \"&MID(Ulus.İlişkiler.Sonuç!D38,FIND(\" \",Ulus.İlişkiler.Sonuç!D38)+1,2)&REPT(\"*\",3)))","v":""},{"$f":"IF(Ulus.İlişkiler.Sonuç!E38=\"\",\"\",Ulus.İlişkiler.Sonuç!E38)","v":""},{"$f":"IF(Ulus.İlişkiler.Sonuç!F38=\"\",\"\",Ulus.İlişkiler.Sonuç!F38)","v":""},{"$f":"IF(Ulus.İlişkiler.Sonuç!G38=\"\",\"\",Ulus.İlişkiler.Sonuç!G38)","v":""},{"$f":"IF(Ulus.İlişkiler.Sonuç!H38=\"\",\"\",Ulus.İlişkiler.Sonuç!H38)","v":""},{"$f":"IF(Ulus.İlişkiler.Sonuç!I38=\"\",\"\",Ulus.İlişkiler.Sonuç!I38)","v":""},{"$f":"IF(Ulus.İlişkiler.Sonuç!J38=\"\",\"\",Ulus.İlişkiler.Sonuç!J38)","v":""},{"$f":"IF(Ulus.İlişkiler.Sonuç!K38=\"\",\"\",Ulus.İlişkiler.Sonuç!K38)","v":""},{"$f":"IF(Ulus.İlişkiler.Sonuç!L38=\"\",\"\",Ulus.İlişkiler.Sonuç!L38)","v":""},{"$f":"IF(Ulus.İlişkiler.Sonuç!M38=\"\",\"\",Ulus.İlişkiler.Sonuç!M38)","v":""},{"$f":"IF(Ulus.İlişkiler.Sonuç!N38=\"\",\"\",Ulus.İlişkiler.Sonuç!N38)","v":""}]
[{"$f":"IF(Ulus.İlişkiler.Sonuç!A39=\"\",\"\",Ulus.İlişkiler.Sonuç!A39)","v":""},{"$f":"IF(Ulus.İlişkiler.Sonuç!B39=\"\",\"\",LEFT(Ulus.İlişkiler.Sonuç!B39,3)&REPT(\"*\",4)&RIGHT(Ulus.İlişkiler.Sonuç!B39,2))","v":""},{"$f":"IF(Ulus.İlişkiler.Sonuç!C39=\"\",\"\",IF(ISERR(FIND(\" \",Ulus.İlişkiler.Sonuç!C39))=TRUE,LEFT(Ulus.İlişkiler.Sonuç!C39,2)&REPT(\"*\",3),LEFT(Ulus.İlişkiler.Sonuç!C39,2)&REPT(\"*\",3)&\" \"&MID(Ulus.İlişkiler.Sonuç!C39,FIND(\" \",Ulus.İlişkiler.Sonuç!C39)+1,2)&REPT(\"*\",3)))","v":""},{"$f":"IF(Ulus.İlişkiler.Sonuç!D39=\"\",\"\",IF(ISERR(FIND(\" \",Ulus.İlişkiler.Sonuç!D39))=TRUE,LEFT(Ulus.İlişkiler.Sonuç!D39,2)&REPT(\"*\",3),LEFT(Ulus.İlişkiler.Sonuç!D39,2)&REPT(\"*\",3)&\" \"&MID(Ulus.İlişkiler.Sonuç!D39,FIND(\" \",Ulus.İlişkiler.Sonuç!D39)+1,2)&REPT(\"*\",3)))","v":""},{"$f":"IF(Ulus.İlişkiler.Sonuç!E39=\"\",\"\",Ulus.İlişkiler.Sonuç!E39)","v":""},{"$f":"IF(Ulus.İlişkiler.Sonuç!F39=\"\",\"\",Ulus.İlişkiler.Sonuç!F39)","v":""},{"$f":"IF(Ulus.İlişkiler.Sonuç!G39=\"\",\"\",Ulus.İlişkiler.Sonuç!G39)","v":""},{"$f":"IF(Ulus.İlişkiler.Sonuç!H39=\"\",\"\",Ulus.İlişkiler.Sonuç!H39)","v":""},{"$f":"IF(Ulus.İlişkiler.Sonuç!I39=\"\",\"\",Ulus.İlişkiler.Sonuç!I39)","v":""},{"$f":"IF(Ulus.İlişkiler.Sonuç!J39=\"\",\"\",Ulus.İlişkiler.Sonuç!J39)","v":""},{"$f":"IF(Ulus.İlişkiler.Sonuç!K39=\"\",\"\",Ulus.İlişkiler.Sonuç!K39)","v":""},{"$f":"IF(Ulus.İlişkiler.Sonuç!L39=\"\",\"\",Ulus.İlişkiler.Sonuç!L39)","v":""},{"$f":"IF(Ulus.İlişkiler.Sonuç!M39=\"\",\"\",Ulus.İlişkiler.Sonuç!M39)","v":""},{"$f":"IF(Ulus.İlişkiler.Sonuç!N39=\"\",\"\",Ulus.İlişkiler.Sonuç!N39)","v":""}]
[{"$f":"IF(Ulus.İlişkiler.Sonuç!A40=\"\",\"\",Ulus.İlişkiler.Sonuç!A40)","v":""},{"$f":"IF(Ulus.İlişkiler.Sonuç!B40=\"\",\"\",LEFT(Ulus.İlişkiler.Sonuç!B40,3)&REPT(\"*\",4)&RIGHT(Ulus.İlişkiler.Sonuç!B40,2))","v":""},{"$f":"IF(Ulus.İlişkiler.Sonuç!C40=\"\",\"\",IF(ISERR(FIND(\" \",Ulus.İlişkiler.Sonuç!C40))=TRUE,LEFT(Ulus.İlişkiler.Sonuç!C40,2)&REPT(\"*\",3),LEFT(Ulus.İlişkiler.Sonuç!C40,2)&REPT(\"*\",3)&\" \"&MID(Ulus.İlişkiler.Sonuç!C40,FIND(\" \",Ulus.İlişkiler.Sonuç!C40)+1,2)&REPT(\"*\",3)))","v":""},{"$f":"IF(Ulus.İlişkiler.Sonuç!D40=\"\",\"\",IF(ISERR(FIND(\" \",Ulus.İlişkiler.Sonuç!D40))=TRUE,LEFT(Ulus.İlişkiler.Sonuç!D40,2)&REPT(\"*\",3),LEFT(Ulus.İlişkiler.Sonuç!D40,2)&REPT(\"*\",3)&\" \"&MID(Ulus.İlişkiler.Sonuç!D40,FIND(\" \",Ulus.İlişkiler.Sonuç!D40)+1,2)&REPT(\"*\",3)))","v":""},{"$f":"IF(Ulus.İlişkiler.Sonuç!E40=\"\",\"\",Ulus.İlişkiler.Sonuç!E40)","v":""},{"$f":"IF(Ulus.İlişkiler.Sonuç!F40=\"\",\"\",Ulus.İlişkiler.Sonuç!F40)","v":""},{"$f":"IF(Ulus.İlişkiler.Sonuç!G40=\"\",\"\",Ulus.İlişkiler.Sonuç!G40)","v":""},{"$f":"IF(Ulus.İlişkiler.Sonuç!H40=\"\",\"\",Ulus.İlişkiler.Sonuç!H40)","v":""},{"$f":"IF(Ulus.İlişkiler.Sonuç!I40=\"\",\"\",Ulus.İlişkiler.Sonuç!I40)","v":""},{"$f":"IF(Ulus.İlişkiler.Sonuç!J40=\"\",\"\",Ulus.İlişkiler.Sonuç!J40)","v":""},{"$f":"IF(Ulus.İlişkiler.Sonuç!K40=\"\",\"\",Ulus.İlişkiler.Sonuç!K40)","v":""},{"$f":"IF(Ulus.İlişkiler.Sonuç!L40=\"\",\"\",Ulus.İlişkiler.Sonuç!L40)","v":""},{"$f":"IF(Ulus.İlişkiler.Sonuç!M40=\"\",\"\",Ulus.İlişkiler.Sonuç!M40)","v":""},{"$f":"IF(Ulus.İlişkiler.Sonuç!N40=\"\",\"\",Ulus.İlişkiler.Sonuç!N40)","v":""}]
[{"$f":"IF(Ulus.İlişkiler.Sonuç!A41=\"\",\"\",Ulus.İlişkiler.Sonuç!A41)","v":""},{"$f":"IF(Ulus.İlişkiler.Sonuç!B41=\"\",\"\",LEFT(Ulus.İlişkiler.Sonuç!B41,3)&REPT(\"*\",4)&RIGHT(Ulus.İlişkiler.Sonuç!B41,2))","v":""},{"$f":"IF(Ulus.İlişkiler.Sonuç!C41=\"\",\"\",IF(ISERR(FIND(\" \",Ulus.İlişkiler.Sonuç!C41))=TRUE,LEFT(Ulus.İlişkiler.Sonuç!C41,2)&REPT(\"*\",3),LEFT(Ulus.İlişkiler.Sonuç!C41,2)&REPT(\"*\",3)&\" \"&MID(Ulus.İlişkiler.Sonuç!C41,FIND(\" \",Ulus.İlişkiler.Sonuç!C41)+1,2)&REPT(\"*\",3)))","v":""},{"$f":"IF(Ulus.İlişkiler.Sonuç!D41=\"\",\"\",IF(ISERR(FIND(\" \",Ulus.İlişkiler.Sonuç!D41))=TRUE,LEFT(Ulus.İlişkiler.Sonuç!D41,2)&REPT(\"*\",3),LEFT(Ulus.İlişkiler.Sonuç!D41,2)&REPT(\"*\",3)&\" \"&MID(Ulus.İlişkiler.Sonuç!D41,FIND(\" \",Ulus.İlişkiler.Sonuç!D41)+1,2)&REPT(\"*\",3)))","v":""},{"$f":"IF(Ulus.İlişkiler.Sonuç!E41=\"\",\"\",Ulus.İlişkiler.Sonuç!E41)","v":""},{"$f":"IF(Ulus.İlişkiler.Sonuç!F41=\"\",\"\",Ulus.İlişkiler.Sonuç!F41)","v":""},{"$f":"IF(Ulus.İlişkiler.Sonuç!G41=\"\",\"\",Ulus.İlişkiler.Sonuç!G41)","v":""},{"$f":"IF(Ulus.İlişkiler.Sonuç!H41=\"\",\"\",Ulus.İlişkiler.Sonuç!H41)","v":""},{"$f":"IF(Ulus.İlişkiler.Sonuç!I41=\"\",\"\",Ulus.İlişkiler.Sonuç!I41)","v":""},{"$f":"IF(Ulus.İlişkiler.Sonuç!J41=\"\",\"\",Ulus.İlişkiler.Sonuç!J41)","v":""},{"$f":"IF(Ulus.İlişkiler.Sonuç!K41=\"\",\"\",Ulus.İlişkiler.Sonuç!K41)","v":""},{"$f":"IF(Ulus.İlişkiler.Sonuç!L41=\"\",\"\",Ulus.İlişkiler.Sonuç!L41)","v":""},{"$f":"IF(Ulus.İlişkiler.Sonuç!M41=\"\",\"\",Ulus.İlişkiler.Sonuç!M41)","v":""},{"$f":"IF(Ulus.İlişkiler.Sonuç!N41=\"\",\"\",Ulus.İlişkiler.Sonuç!N41)","v":""}]
[{"$f":"IF(Ulus.İlişkiler.Sonuç!A42=\"\",\"\",Ulus.İlişkiler.Sonuç!A42)","v":""},{"$f":"IF(Ulus.İlişkiler.Sonuç!B42=\"\",\"\",LEFT(Ulus.İlişkiler.Sonuç!B42,3)&REPT(\"*\",4)&RIGHT(Ulus.İlişkiler.Sonuç!B42,2))","v":""},{"$f":"IF(Ulus.İlişkiler.Sonuç!C42=\"\",\"\",IF(ISERR(FIND(\" \",Ulus.İlişkiler.Sonuç!C42))=TRUE,LEFT(Ulus.İlişkiler.Sonuç!C42,2)&REPT(\"*\",3),LEFT(Ulus.İlişkiler.Sonuç!C42,2)&REPT(\"*\",3)&\" \"&MID(Ulus.İlişkiler.Sonuç!C42,FIND(\" \",Ulus.İlişkiler.Sonuç!C42)+1,2)&REPT(\"*\",3)))","v":""},{"$f":"IF(Ulus.İlişkiler.Sonuç!D42=\"\",\"\",IF(ISERR(FIND(\" \",Ulus.İlişkiler.Sonuç!D42))=TRUE,LEFT(Ulus.İlişkiler.Sonuç!D42,2)&REPT(\"*\",3),LEFT(Ulus.İlişkiler.Sonuç!D42,2)&REPT(\"*\",3)&\" \"&MID(Ulus.İlişkiler.Sonuç!D42,FIND(\" \",Ulus.İlişkiler.Sonuç!D42)+1,2)&REPT(\"*\",3)))","v":""},{"$f":"IF(Ulus.İlişkiler.Sonuç!E42=\"\",\"\",Ulus.İlişkiler.Sonuç!E42)","v":""},{"$f":"IF(Ulus.İlişkiler.Sonuç!F42=\"\",\"\",Ulus.İlişkiler.Sonuç!F42)","v":""},{"$f":"IF(Ulus.İlişkiler.Sonuç!G42=\"\",\"\",Ulus.İlişkiler.Sonuç!G42)","v":""},{"$f":"IF(Ulus.İlişkiler.Sonuç!H42=\"\",\"\",Ulus.İlişkiler.Sonuç!H42)","v":""},{"$f":"IF(Ulus.İlişkiler.Sonuç!I42=\"\",\"\",Ulus.İlişkiler.Sonuç!I42)","v":""},{"$f":"IF(Ulus.İlişkiler.Sonuç!J42=\"\",\"\",Ulus.İlişkiler.Sonuç!J42)","v":""},{"$f":"IF(Ulus.İlişkiler.Sonuç!K42=\"\",\"\",Ulus.İlişkiler.Sonuç!K42)","v":""},{"$f":"IF(Ulus.İlişkiler.Sonuç!L42=\"\",\"\",Ulus.İlişkiler.Sonuç!L42)","v":""},{"$f":"IF(Ulus.İlişkiler.Sonuç!M42=\"\",\"\",Ulus.İlişkiler.Sonuç!M42)","v":""},{"$f":"IF(Ulus.İlişkiler.Sonuç!N42=\"\",\"\",Ulus.İlişkiler.Sonuç!N42)","v":""}]
[{"$f":"IF(Ulus.İlişkiler.Sonuç!A43=\"\",\"\",Ulus.İlişkiler.Sonuç!A43)","v":""},{"$f":"IF(Ulus.İlişkiler.Sonuç!B43=\"\",\"\",LEFT(Ulus.İlişkiler.Sonuç!B43,3)&REPT(\"*\",4)&RIGHT(Ulus.İlişkiler.Sonuç!B43,2))","v":""},{"$f":"IF(Ulus.İlişkiler.Sonuç!C43=\"\",\"\",IF(ISERR(FIND(\" \",Ulus.İlişkiler.Sonuç!C43))=TRUE,LEFT(Ulus.İlişkiler.Sonuç!C43,2)&REPT(\"*\",3),LEFT(Ulus.İlişkiler.Sonuç!C43,2)&REPT(\"*\",3)&\" \"&MID(Ulus.İlişkiler.Sonuç!C43,FIND(\" \",Ulus.İlişkiler.Sonuç!C43)+1,2)&REPT(\"*\",3)))","v":""},{"$f":"IF(Ulus.İlişkiler.Sonuç!D43=\"\",\"\",IF(ISERR(FIND(\" \",Ulus.İlişkiler.Sonuç!D43))=TRUE,LEFT(Ulus.İlişkiler.Sonuç!D43,2)&REPT(\"*\",3),LEFT(Ulus.İlişkiler.Sonuç!D43,2)&REPT(\"*\",3)&\" \"&MID(Ulus.İlişkiler.Sonuç!D43,FIND(\" \",Ulus.İlişkiler.Sonuç!D43)+1,2)&REPT(\"*\",3)))","v":""},{"$f":"IF(Ulus.İlişkiler.Sonuç!E43=\"\",\"\",Ulus.İlişkiler.Sonuç!E43)","v":""},{"$f":"IF(Ulus.İlişkiler.Sonuç!F43=\"\",\"\",Ulus.İlişkiler.Sonuç!F43)","v":""},{"$f":"IF(Ulus.İlişkiler.Sonuç!G43=\"\",\"\",Ulus.İlişkiler.Sonuç!G43)","v":""},{"$f":"IF(Ulus.İlişkiler.Sonuç!H43=\"\",\"\",Ulus.İlişkiler.Sonuç!H43)","v":""},{"$f":"IF(Ulus.İlişkiler.Sonuç!I43=\"\",\"\",Ulus.İlişkiler.Sonuç!I43)","v":""},{"$f":"IF(Ulus.İlişkiler.Sonuç!J43=\"\",\"\",Ulus.İlişkiler.Sonuç!J43)","v":""},{"$f":"IF(Ulus.İlişkiler.Sonuç!K43=\"\",\"\",Ulus.İlişkiler.Sonuç!K43)","v":""},{"$f":"IF(Ulus.İlişkiler.Sonuç!L43=\"\",\"\",Ulus.İlişkiler.Sonuç!L43)","v":""},{"$f":"IF(Ulus.İlişkiler.Sonuç!M43=\"\",\"\",Ulus.İlişkiler.Sonuç!M43)","v":""},{"$f":"IF(Ulus.İlişkiler.Sonuç!N43=\"\",\"\",Ulus.İlişkiler.Sonuç!N43)","v":""}]
[{"$f":"IF(Ulus.İlişkiler.Sonuç!A44=\"\",\"\",Ulus.İlişkiler.Sonuç!A44)","v":""},{"$f":"IF(Ulus.İlişkiler.Sonuç!B44=\"\",\"\",LEFT(Ulus.İlişkiler.Sonuç!B44,3)&REPT(\"*\",4)&RIGHT(Ulus.İlişkiler.Sonuç!B44,2))","v":""},{"$f":"IF(Ulus.İlişkiler.Sonuç!C44=\"\",\"\",IF(ISERR(FIND(\" \",Ulus.İlişkiler.Sonuç!C44))=TRUE,LEFT(Ulus.İlişkiler.Sonuç!C44,2)&REPT(\"*\",3),LEFT(Ulus.İlişkiler.Sonuç!C44,2)&REPT(\"*\",3)&\" \"&MID(Ulus.İlişkiler.Sonuç!C44,FIND(\" \",Ulus.İlişkiler.Sonuç!C44)+1,2)&REPT(\"*\",3)))","v":""},{"$f":"IF(Ulus.İlişkiler.Sonuç!D44=\"\",\"\",IF(ISERR(FIND(\" \",Ulus.İlişkiler.Sonuç!D44))=TRUE,LEFT(Ulus.İlişkiler.Sonuç!D44,2)&REPT(\"*\",3),LEFT(Ulus.İlişkiler.Sonuç!D44,2)&REPT(\"*\",3)&\" \"&MID(Ulus.İlişkiler.Sonuç!D44,FIND(\" \",Ulus.İlişkiler.Sonuç!D44)+1,2)&REPT(\"*\",3)))","v":""},{"$f":"IF(Ulus.İlişkiler.Sonuç!E44=\"\",\"\",Ulus.İlişkiler.Sonuç!E44)","v":""},{"$f":"IF(Ulus.İlişkiler.Sonuç!F44=\"\",\"\",Ulus.İlişkiler.Sonuç!F44)","v":""},{"$f":"IF(Ulus.İlişkiler.Sonuç!G44=\"\",\"\",Ulus.İlişkiler.Sonuç!G44)","v":""},{"$f":"IF(Ulus.İlişkiler.Sonuç!H44=\"\",\"\",Ulus.İlişkiler.Sonuç!H44)","v":""},{"$f":"IF(Ulus.İlişkiler.Sonuç!I44=\"\",\"\",Ulus.İlişkiler.Sonuç!I44)","v":""},{"$f":"IF(Ulus.İlişkiler.Sonuç!J44=\"\",\"\",Ulus.İlişkiler.Sonuç!J44)","v":""},{"$f":"IF(Ulus.İlişkiler.Sonuç!K44=\"\",\"\",Ulus.İlişkiler.Sonuç!K44)","v":""},{"$f":"IF(Ulus.İlişkiler.Sonuç!L44=\"\",\"\",Ulus.İlişkiler.Sonuç!L44)","v":""},{"$f":"IF(Ulus.İlişkiler.Sonuç!M44=\"\",\"\",Ulus.İlişkiler.Sonuç!M44)","v":""},{"$f":"IF(Ulus.İlişkiler.Sonuç!N44=\"\",\"\",Ulus.İlişkiler.Sonuç!N44)","v":""}]
[{"$f":"IF(Ulus.İlişkiler.Sonuç!A45=\"\",\"\",Ulus.İlişkiler.Sonuç!A45)","v":""},{"$f":"IF(Ulus.İlişkiler.Sonuç!B45=\"\",\"\",LEFT(Ulus.İlişkiler.Sonuç!B45,3)&REPT(\"*\",4)&RIGHT(Ulus.İlişkiler.Sonuç!B45,2))","v":""},{"$f":"IF(Ulus.İlişkiler.Sonuç!C45=\"\",\"\",IF(ISERR(FIND(\" \",Ulus.İlişkiler.Sonuç!C45))=TRUE,LEFT(Ulus.İlişkiler.Sonuç!C45,2)&REPT(\"*\",3),LEFT(Ulus.İlişkiler.Sonuç!C45,2)&REPT(\"*\",3)&\" \"&MID(Ulus.İlişkiler.Sonuç!C45,FIND(\" \",Ulus.İlişkiler.Sonuç!C45)+1,2)&REPT(\"*\",3)))","v":""},{"$f":"IF(Ulus.İlişkiler.Sonuç!D45=\"\",\"\",IF(ISERR(FIND(\" \",Ulus.İlişkiler.Sonuç!D45))=TRUE,LEFT(Ulus.İlişkiler.Sonuç!D45,2)&REPT(\"*\",3),LEFT(Ulus.İlişkiler.Sonuç!D45,2)&REPT(\"*\",3)&\" \"&MID(Ulus.İlişkiler.Sonuç!D45,FIND(\" \",Ulus.İlişkiler.Sonuç!D45)+1,2)&REPT(\"*\",3)))","v":""},{"$f":"IF(Ulus.İlişkiler.Sonuç!E45=\"\",\"\",Ulus.İlişkiler.Sonuç!E45)","v":""},{"$f":"IF(Ulus.İlişkiler.Sonuç!F45=\"\",\"\",Ulus.İlişkiler.Sonuç!F45)","v":""},{"$f":"IF(Ulus.İlişkiler.Sonuç!G45=\"\",\"\",Ulus.İlişkiler.Sonuç!G45)","v":""},{"$f":"IF(Ulus.İlişkiler.Sonuç!H45=\"\",\"\",Ulus.İlişkiler.Sonuç!H45)","v":""},{"$f":"IF(Ulus.İlişkiler.Sonuç!I45=\"\",\"\",Ulus.İlişkiler.Sonuç!I45)","v":""},{"$f":"IF(Ulus.İlişkiler.Sonuç!J45=\"\",\"\",Ulus.İlişkiler.Sonuç!J45)","v":""},{"$f":"IF(Ulus.İlişkiler.Sonuç!K45=\"\",\"\",Ulus.İlişkiler.Sonuç!K45)","v":""},{"$f":"IF(Ulus.İlişkiler.Sonuç!L45=\"\",\"\",Ulus.İlişkiler.Sonuç!L45)","v":""},{"$f":"IF(Ulus.İlişkiler.Sonuç!M45=\"\",\"\",Ulus.İlişkiler.Sonuç!M45)","v":""},{"$f":"IF(Ulus.İlişkiler.Sonuç!N45=\"\",\"\",Ulus.İlişkiler.Sonuç!N45)","v":""}]
[{"$f":"IF(Ulus.İlişkiler.Sonuç!A46=\"\",\"\",Ulus.İlişkiler.Sonuç!A46)","v":""},{"$f":"IF(Ulus.İlişkiler.Sonuç!B46=\"\",\"\",LEFT(Ulus.İlişkiler.Sonuç!B46,3)&REPT(\"*\",4)&RIGHT(Ulus.İlişkiler.Sonuç!B46,2))","v":""},{"$f":"IF(Ulus.İlişkiler.Sonuç!C46=\"\",\"\",IF(ISERR(FIND(\" \",Ulus.İlişkiler.Sonuç!C46))=TRUE,LEFT(Ulus.İlişkiler.Sonuç!C46,2)&REPT(\"*\",3),LEFT(Ulus.İlişkiler.Sonuç!C46,2)&REPT(\"*\",3)&\" \"&MID(Ulus.İlişkiler.Sonuç!C46,FIND(\" \",Ulus.İlişkiler.Sonuç!C46)+1,2)&REPT(\"*\",3)))","v":""},{"$f":"IF(Ulus.İlişkiler.Sonuç!D46=\"\",\"\",IF(ISERR(FIND(\" \",Ulus.İlişkiler.Sonuç!D46))=TRUE,LEFT(Ulus.İlişkiler.Sonuç!D46,2)&REPT(\"*\",3),LEFT(Ulus.İlişkiler.Sonuç!D46,2)&REPT(\"*\",3)&\" \"&MID(Ulus.İlişkiler.Sonuç!D46,FIND(\" \",Ulus.İlişkiler.Sonuç!D46)+1,2)&REPT(\"*\",3)))","v":""},{"$f":"IF(Ulus.İlişkiler.Sonuç!E46=\"\",\"\",Ulus.İlişkiler.Sonuç!E46)","v":""},{"$f":"IF(Ulus.İlişkiler.Sonuç!F46=\"\",\"\",Ulus.İlişkiler.Sonuç!F46)","v":""},{"$f":"IF(Ulus.İlişkiler.Sonuç!G46=\"\",\"\",Ulus.İlişkiler.Sonuç!G46)","v":""},{"$f":"IF(Ulus.İlişkiler.Sonuç!H46=\"\",\"\",Ulus.İlişkiler.Sonuç!H46)","v":""},{"$f":"IF(Ulus.İlişkiler.Sonuç!I46=\"\",\"\",Ulus.İlişkiler.Sonuç!I46)","v":""},{"$f":"IF(Ulus.İlişkiler.Sonuç!J46=\"\",\"\",Ulus.İlişkiler.Sonuç!J46)","v":""},{"$f":"IF(Ulus.İlişkiler.Sonuç!K46=\"\",\"\",Ulus.İlişkiler.Sonuç!K46)","v":""},{"$f":"IF(Ulus.İlişkiler.Sonuç!L46=\"\",\"\",Ulus.İlişkiler.Sonuç!L46)","v":""},{"$f":"IF(Ulus.İlişkiler.Sonuç!M46=\"\",\"\",Ulus.İlişkiler.Sonuç!M46)","v":""},{"$f":"IF(Ulus.İlişkiler.Sonuç!N46=\"\",\"\",Ulus.İlişkiler.Sonuç!N46)","v":""}]
[{"$f":"IF(Ulus.İlişkiler.Sonuç!A47=\"\",\"\",Ulus.İlişkiler.Sonuç!A47)","v":""},{"$f":"IF(Ulus.İlişkiler.Sonuç!B47=\"\",\"\",LEFT(Ulus.İlişkiler.Sonuç!B47,3)&REPT(\"*\",4)&RIGHT(Ulus.İlişkiler.Sonuç!B47,2))","v":""},{"$f":"IF(Ulus.İlişkiler.Sonuç!C47=\"\",\"\",IF(ISERR(FIND(\" \",Ulus.İlişkiler.Sonuç!C47))=TRUE,LEFT(Ulus.İlişkiler.Sonuç!C47,2)&REPT(\"*\",3),LEFT(Ulus.İlişkiler.Sonuç!C47,2)&REPT(\"*\",3)&\" \"&MID(Ulus.İlişkiler.Sonuç!C47,FIND(\" \",Ulus.İlişkiler.Sonuç!C47)+1,2)&REPT(\"*\",3)))","v":""},{"$f":"IF(Ulus.İlişkiler.Sonuç!D47=\"\",\"\",IF(ISERR(FIND(\" \",Ulus.İlişkiler.Sonuç!D47))=TRUE,LEFT(Ulus.İlişkiler.Sonuç!D47,2)&REPT(\"*\",3),LEFT(Ulus.İlişkiler.Sonuç!D47,2)&REPT(\"*\",3)&\" \"&MID(Ulus.İlişkiler.Sonuç!D47,FIND(\" \",Ulus.İlişkiler.Sonuç!D47)+1,2)&REPT(\"*\",3)))","v":""},{"$f":"IF(Ulus.İlişkiler.Sonuç!E47=\"\",\"\",Ulus.İlişkiler.Sonuç!E47)","v":""},{"$f":"IF(Ulus.İlişkiler.Sonuç!F47=\"\",\"\",Ulus.İlişkiler.Sonuç!F47)","v":""},{"$f":"IF(Ulus.İlişkiler.Sonuç!G47=\"\",\"\",Ulus.İlişkiler.Sonuç!G47)","v":""},{"$f":"IF(Ulus.İlişkiler.Sonuç!H47=\"\",\"\",Ulus.İlişkiler.Sonuç!H47)","v":""},{"$f":"IF(Ulus.İlişkiler.Sonuç!I47=\"\",\"\",Ulus.İlişkiler.Sonuç!I47)","v":""},{"$f":"IF(Ulus.İlişkiler.Sonuç!J47=\"\",\"\",Ulus.İlişkiler.Sonuç!J47)","v":""},{"$f":"IF(Ulus.İlişkiler.Sonuç!K47=\"\",\"\",Ulus.İlişkiler.Sonuç!K47)","v":""},{"$f":"IF(Ulus.İlişkiler.Sonuç!L47=\"\",\"\",Ulus.İlişkiler.Sonuç!L47)","v":""},{"$f":"IF(Ulus.İlişkiler.Sonuç!M47=\"\",\"\",Ulus.İlişkiler.Sonuç!M47)","v":""},{"$f":"IF(Ulus.İlişkiler.Sonuç!N47=\"\",\"\",Ulus.İlişkiler.Sonuç!N47)","v":""}]