{"text_format":"1","workbook":"xlsx","n_sheets":4,"sheets":["Öğr.Gör. Ön Değ.","Ön Değ. Rapor","Lisans Öğr.Gör. Sonuç","Sonuç Rapor"],"not_rendered":{"charts":0,"images":1,"macros":1,"external_links":0,"defined_names":2,"comments":0,"pivot_tables":0},"unopened":[],"bounds":{"document_bytes":16777216,"sheet_cells":100000,"rows_first":2000,"rows_last":500,"rows_between":2000,"halvings":0,"cell_chars":16384,"cell_head_chars":4096},"cells_cut":0,"cells_raw":0,"read":"whole","date_system":"1900"}

{"sheet":"Öğr.Gör. Ön Değ.","index":0,"n_rows":30,"n_cols":16,"rows_kept":30,"cut":false,"hidden":false,"merged":[[5,0,5,1],[5,2,5,3],[6,0,6,1],[6,4,6,7],[6,8,6,11],[5,8,5,11],[8,2,8,11],[7,0,7,1],[8,0,8,1],[0,0,0,11],[1,0,1,11],[2,0,2,11],[3,0,3,11],[4,0,4,1],[4,2,4,3],[4,4,4,7],[4,8,4,11],[6,2,6,3],[7,2,7,3],[7,4,7,7],[7,8,7,11],[5,4,5,7],[31,0,31,11],[9,0,9,3],[9,4,9,11],[10,0,11,0],[10,7,11,7],[10,8,10,11],[10,4,10,6],[10,1,10,3]]}
["T.C."]
["BAYBURT ÜNİVERSİTESİ"]
["ÖĞRETİM ELEMANI ÖN DEĞERLENDİRME TUTANAĞI"]
["Üniversitemize bağlı birimlere, 2547 sayılı Kanunun ilgili maddeleri ve 09.11.2018 tarihli ve 30590 sayılı Resmi Gazetede yayımlanan \"Öğretim Üyesi Dışındaki Öğretim Elemanı Kadrolarına Yapılacak Atamalarda Uygulanacak Merkezi Sınav İle Giriş Sınavlarına İlişkin Usul ve Esaslar Hakkında Yönetmelik” 10. Maddesi Uyarınca Lisans ve Ön Lisans Düzeyindeki Eğitim Veren Yerlere Alınacak Akademik Personele Ait Ön Değerlendirme Sonuç Tutanağı  ",null,null,null,null,null,null,null,null,null,null,null,null,null,null,"                                                                                                                                                                   "]
["İlan No:",null,null,null,"Birimi:",null,null,null,"….. Fakültesi / Rektörlük"]
["İlan Tarihi:",null,"…/.../....",null,"Bölümü:",null,null,null,"….. Bölümü / Başkanlığı / Ofisi / Merkezi"]
["Kadro Unvanı:",null,"Öğretim Görevlisi (Uygulamalı Birim) / (Lisans/Ders Verecek-Zorunlu Ortak Ders) ",null,"Anabilim Dalı/Alanı:",null,null,null,"….. Anabilim Dalı"]
["Kadro Adedi:",null,null,null,"Öndeğerlendirme Tarihi:",null,null,null,"…/.../...."]
["İlan Özel Şartı:"]
["SINAVIN YAPILACAĞI YER, TARİH ve SAAT :",null,null,null,"……...     ../…/…. Günü Saat: …:…."]
["Sıra No","Başvuranın",null,null,"Başvuru Şartı",null,null,"İlan Şartına Uygunluğu (Tecrübe / Nitelikler)","Ön Sıralama Değerlendirme Sonuçları"]
[null,"T.C. Kimlik No","Adı","Soyadı","Alanındaki Ales Puanı","Yabancı Dil Puanı","Tezli Yüksek Lisans Belgesi",null,"ALES  (%60)","Yabancı Dil Puanı (%40)","Toplam Puan","Ön Değerlendirme Sonucu      "]
[1,11111111111,"Örnek","Örnek",81.505549999999999,81.56,"Mevcut","Uygun",{"$f":"E13*0.6","v":48.903329999999997},{"$f":"F13*0.4","v":32.624000000000002},{"$f":"I13+J13","v":81.527330000000006},"Sınava Girebilir"]
[2,11111111111,"Örnek Örnek","Örnek",80.607429999999994,82.03,"Mevcut","Uygun",48.364457999999992,32.812000000000005,81.176457999999997,"Sınava Girebilir"]
[3,11111111111,"Örnek","Örnek Örnek",79.275630000000007,82.53,"Mevcut","Uygun",47.565378000000003,33.012,80.57737800000001,"Sınava Girebilir"]
[4,11111111111,"Örnek Örnek","Örnek Örnek",78.113749999999996,81.56,"Mevcut","Uygun",46.868249999999996,32.624000000000002,79.492249999999999,"Sınava Girebilir"]
[5,11111111111,"Örnek","Örnek",77.505549999999999,80.56,"Mevcut","Uygun",46.503329999999998,32.224000000000004,78.727329999999995,"Sınava Girebilir"]
[6,11111111111,"Örnek","Örnek",76.607429999999994,79.03,"Mevcut","Uygun",45.964457999999993,31.612000000000002,77.576458000000002,"Sınava Girebilir"]
[7,11111111111,"Örnek","Örnek",75.275630000000007,78.53,"Mevcut","Uygun",45.165378000000004,31.412000000000003,76.57737800000001,"Sınava Girebilir"]
[8,11111111111,"Örnek","Örnek",74.113749999999996,77.56,"Mevcut","Uygun",44.468249999999998,31.024000000000001,75.492249999999999,"Sınava Girebilir"]
[9,11111111111,"Örnek","Örnek",73.505549999999999,76.56,"Mevcut","Uygun",44.10333,30.624000000000002,74.727329999999995,"Sınava Girebilir"]
[10,11111111111,"Örnek","Örnek",72.607429999999994,75.03,"Mevcut","Uygun",43.564457999999995,30.012,73.576458000000002,"Sınava Girebilir"]
[11,11111111111,"Örnek","Örnek",71.275630000000007,74.53,"Mevcut","Uygun",42.765378000000005,29.812000000000001,72.57737800000001,"Yönetmelik Gereği Elendi *"]
[12,11111111111,"Örnek","Örnek",70.113749999999996,73.56,"Mevcut","Uygun",42.068249999999999,29.424000000000003,71.492249999999999,"Yönetmelik Gereği Elendi *"]
[13,11111111111,"Örnek","Örnek",70.505549999999999,72.56,"Mevcut","Uygun",42.303329999999995,29.024000000000001,71.327329999999989,"Yönetmelik Gereği Elendi *"]
[14,11111111111,"Örnek","Örnek",70.607429999999994,72.03,"Mevcut","Uygun Değil",42.364457999999992,28.812000000000001,71.176457999999997,"Başvuru Şartını Sağlamıyor (Tecrübe süresi ilan şartını taşımıyor)"]
[15,11111111111,"Örnek","Örnek",70.275630000000007,71.53,"Mevcut Değil","Uygun Değil",42.165378000000004,28.612000000000002,70.777377999999999,"Başvuru Şartını Sağlamıyor (Tezli Yüksek Şartını Sağlamıyor)"]
[16,11111111111,"Örnek","Örnek",68,95,"Mevcut","Uygun Değil",40.799999999999997,38,78.8,"Başvuru Şartını Sağlamıyor (Ales puanı yetersiz)"]
[17,11111111111,"Örnek","Örnek",80,75,"Mevcut","Uygun Değil",48,30,78,"Başvuru Şartını Sağlamıyor (Lisans Mezuniyet alanı ilanla uyumlu değil)"]
[18,11111111111,"Örnek","Örnek",80,45,"Mevcut","Uygun Değil",48,18,66,"Başvuru Şartını Sağlamıyor (Yabancı Dil Puanı Yetersiz)"]

{"sheet":"Ön Değ. Rapor","index":1,"n_rows":75,"n_cols":16,"rows_kept":75,"cut":false,"hidden":false,"merged":[[0,0,0,11],[1,0,1,11],[2,0,2,11],[3,0,3,11],[4,0,4,1],[4,2,4,3],[4,4,4,7],[4,8,4,11],[5,0,5,1],[5,2,5,3],[5,4,5,7],[5,8,5,11],[6,0,6,1],[6,2,6,3],[6,4,6,7],[6,8,6,11],[7,0,7,1],[7,2,7,3],[7,4,7,7],[7,8,7,11],[8,0,8,1],[8,2,8,11],[9,0,9,3],[9,4,9,11],[10,0,11,0],[10,1,10,3],[10,4,10,6],[10,7,11,7],[10,8,10,11]]}
["T.C."]
["BAYBURT ÜNİVERSİTESİ"]
["ÖĞRETİM ELEMANI ÖN DEĞERLENDİRME TUTANAĞI"]
["Üniversitemize bağlı birimlere, 2547 sayılı Kanunun ilgili maddeleri ve 09.11.2018 tarihli ve 30590 sayılı Resmi Gazetede yayımlanan \"Öğretim Üyesi Dışındaki Öğretim Elemanı Kadrolarına Yapılacak Atamalarda Uygulanacak Merkezi Sınav İle Giriş Sınavlarına İlişkin Usul ve Esaslar Hakkında Yönetmelik” 10. Maddesi Uyarınca Lisans ve Ön Lisans Düzeyindeki Eğitim Veren Yerlere Alınacak Akademik Personele Ait Ön Değerlendirme Sonuç Tutanağı  ",null,null,null,null,null,null,null,null,null,null,null,null,null,null,"                                                                                                                                                                   "]
["İlan No:",null,{"$f":"IF('Öğr.Gör. Ön Değ.'!C5=\"\",\"\",'Öğr.Gör. Ön Değ.'!C5)","v":""},null,"Birimi:",null,null,null,{"$f":"IF('Öğr.Gör. Ön Değ.'!I5=\"\",\"\",'Öğr.Gör. Ön Değ.'!I5)","v":"….. Fakültesi / Rektörlük"}]
["İlan Tarihi:",null,{"$f":"IF('Öğr.Gör. Ön Değ.'!C6=\"\",\"\",'Öğr.Gör. Ön Değ.'!C6)","v":"…/.../...."},null,"Bölümü:",null,null,null,{"$f":"IF('Öğr.Gör. Ön Değ.'!I6=\"\",\"\",'Öğr.Gör. Ön Değ.'!I6)","v":"….. Bölümü / Başkanlığı / Ofisi / Merkezi"}]
["Kadro Unvanı:",null,{"$f":"IF('Öğr.Gör. Ön Değ.'!C7=\"\",\"\",'Öğr.Gör. Ön Değ.'!C7)","v":"Öğretim Görevlisi (Uygulamalı Birim) / (Lisans/Ders Verecek-Zorunlu Ortak Ders) "},null,"Anabilim Dalı/Alanı:",null,null,null,{"$f":"IF('Öğr.Gör. Ön Değ.'!I7=\"\",\"\",'Öğr.Gör. Ön Değ.'!I7)","v":"….. Anabilim Dalı"}]
["Kadro Adedi:",null,{"$f":"IF('Öğr.Gör. Ön Değ.'!C8=\"\",\"\",'Öğr.Gör. Ön Değ.'!C8)","v":""},null,"Öndeğerlendirme Tarihi:",null,null,null,{"$f":"IF('Öğr.Gör. Ön Değ.'!I8=\"\",\"\",'Öğr.Gör. Ön Değ.'!I8)","v":"…/.../...."}]
["İlan Özel Şartı:",null,{"$f":"IF('Öğr.Gör. Ön Değ.'!C9=\"\",\"\",'Öğr.Gör. Ön Değ.'!C9)","v":""}]
["SINAVIN YAPILACAĞI YER, TARİH ve SAAT :",null,null,null,{"$f":"IF('Öğr.Gör. Ön Değ.'!E10=\"\",\"\",'Öğr.Gör. Ön Değ.'!E10)","v":"……...     ../…/…. Günü Saat: …:…."}]
["Sıra No","Başvuranın",null,null,"Başvuru Şartı",null,null,"İlan Şartına Uygunluğu (Tecrübe / Nitelikler)","Ön Sıralama Değerlendirme Sonuçları"]
[null,"T.C. Kimlik No","Adı","Soyadı","Alanındaki Ales Puanı","Yabancı Dil Puanı","Tezli Yüksek Lisans Belgesi",null,"ALES  (%60)","Yabancı Dil Puanı (%40)","Toplam Puan","Ön Değerlendirme Sonucu      "]
[{"$f":"IF('Öğr.Gör. Ön Değ.'!A13=\"\",\"\",'Öğr.Gör. Ön Değ.'!A13)","v":1},{"$f":"IF('Öğr.Gör. Ön Değ.'!B13=\"\",\"\",LEFT('Öğr.Gör. Ön Değ.'!B13,3)&REPT(\"*\",4)&RIGHT('Öğr.Gör. Ön Değ.'!B13,2))","v":"111****11"},{"$f":"IF('Öğr.Gör. Ön Değ.'!C13=\"\",\"\",IF(ISERR(FIND(\" \",'Öğr.Gör. Ön Değ.'!C13))=TRUE,LEFT('Öğr.Gör. Ön Değ.'!C13,2)&REPT(\"*\",3),LEFT('Öğr.Gör. Ön Değ.'!C13,2)&REPT(\"*\",3)&\" \"&MID('Öğr.Gör. Ön Değ.'!C13,FIND(\" \",'Öğr.Gör. Ön Değ.'!C13)+1,2)&REPT(\"*\",3)))","v":"Ör***"},{"$f":"IF('Öğr.Gör. Ön Değ.'!D13=\"\",\"\",IF(ISERR(FIND(\" \",'Öğr.Gör. Ön Değ.'!D13))=TRUE,LEFT('Öğr.Gör. Ön Değ.'!D13,2)&REPT(\"*\",3),LEFT('Öğr.Gör. Ön Değ.'!D13,2)&REPT(\"*\",3)&\" \"&MID('Öğr.Gör. Ön Değ.'!D13,FIND(\" \",'Öğr.Gör. Ön Değ.'!D13)+1,2)&REPT(\"*\",3)))","v":"Ör***"},{"$f":"IF('Öğr.Gör. Ön Değ.'!E13=\"\",\"\",'Öğr.Gör. Ön Değ.'!E13)","v":81.505549999999999},{"$f":"IF('Öğr.Gör. Ön Değ.'!F13=\"\",\"\",'Öğr.Gör. Ön Değ.'!F13)","v":81.56},{"$f":"IF('Öğr.Gör. Ön Değ.'!G13=\"\",\"\",'Öğr.Gör. Ön Değ.'!G13)","v":"Mevcut"},{"$f":"IF('Öğr.Gör. Ön Değ.'!H13=\"\",\"\",'Öğr.Gör. Ön Değ.'!H13)","v":"Uygun"},{"$f":"IF('Öğr.Gör. Ön Değ.'!I13=\"\",\"\",'Öğr.Gör. Ön Değ.'!I13)","v":48.903329999999997},{"$f":"IF('Öğr.Gör. Ön Değ.'!J13=\"\",\"\",'Öğr.Gör. Ön Değ.'!J13)","v":32.624000000000002},{"$f":"IF('Öğr.Gör. Ön Değ.'!K13=\"\",\"\",'Öğr.Gör. Ön Değ.'!K13)","v":81.527330000000006},{"$f":"IF('Öğr.Gör. Ön Değ.'!L13=\"\",\"\",'Öğr.Gör. Ön Değ.'!L13)","v":"Sınava Girebilir"}]
[{"$f":"IF('Öğr.Gör. Ön Değ.'!A14=\"\",\"\",'Öğr.Gör. Ön Değ.'!A14)","v":2},{"$f":"IF('Öğr.Gör. Ön Değ.'!B14=\"\",\"\",LEFT('Öğr.Gör. Ön Değ.'!B14,3)&REPT(\"*\",4)&RIGHT('Öğr.Gör. Ön Değ.'!B14,2))","v":"111****11"},{"$f":"IF('Öğr.Gör. Ön Değ.'!C14=\"\",\"\",IF(ISERR(FIND(\" \",'Öğr.Gör. Ön Değ.'!C14))=TRUE,LEFT('Öğr.Gör. Ön Değ.'!C14,2)&REPT(\"*\",3),LEFT('Öğr.Gör. Ön Değ.'!C14,2)&REPT(\"*\",3)&\" \"&MID('Öğr.Gör. Ön Değ.'!C14,FIND(\" \",'Öğr.Gör. Ön Değ.'!C14)+1,2)&REPT(\"*\",3)))","v":"Ör*** Ör***"},{"$f":"IF('Öğr.Gör. Ön Değ.'!D14=\"\",\"\",IF(ISERR(FIND(\" \",'Öğr.Gör. Ön Değ.'!D14))=TRUE,LEFT('Öğr.Gör. Ön Değ.'!D14,2)&REPT(\"*\",3),LEFT('Öğr.Gör. Ön Değ.'!D14,2)&REPT(\"*\",3)&\" \"&MID('Öğr.Gör. Ön Değ.'!D14,FIND(\" \",'Öğr.Gör. Ön Değ.'!D14)+1,2)&REPT(\"*\",3)))","v":"Ör***"},{"$f":"IF('Öğr.Gör. Ön Değ.'!E14=\"\",\"\",'Öğr.Gör. Ön Değ.'!E14)","v":80.607429999999994},{"$f":"IF('Öğr.Gör. Ön Değ.'!F14=\"\",\"\",'Öğr.Gör. Ön Değ.'!F14)","v":82.03},{"$f":"IF('Öğr.Gör. Ön Değ.'!G14=\"\",\"\",'Öğr.Gör. Ön Değ.'!G14)","v":"Mevcut"},{"$f":"IF('Öğr.Gör. Ön Değ.'!H14=\"\",\"\",'Öğr.Gör. Ön Değ.'!H14)","v":"Uygun"},{"$f":"IF('Öğr.Gör. Ön Değ.'!I14=\"\",\"\",'Öğr.Gör. Ön Değ.'!I14)","v":48.364457999999992},{"$f":"IF('Öğr.Gör. Ön Değ.'!J14=\"\",\"\",'Öğr.Gör. Ön Değ.'!J14)","v":32.812000000000005},{"$f":"IF('Öğr.Gör. Ön Değ.'!K14=\"\",\"\",'Öğr.Gör. Ön Değ.'!K14)","v":81.176457999999997},{"$f":"IF('Öğr.Gör. Ön Değ.'!L14=\"\",\"\",'Öğr.Gör. Ön Değ.'!L14)","v":"Sınava Girebilir"}]
[{"$f":"IF('Öğr.Gör. Ön Değ.'!A15=\"\",\"\",'Öğr.Gör. Ön Değ.'!A15)","v":3},{"$f":"IF('Öğr.Gör. Ön Değ.'!B15=\"\",\"\",LEFT('Öğr.Gör. Ön Değ.'!B15,3)&REPT(\"*\",4)&RIGHT('Öğr.Gör. Ön Değ.'!B15,2))","v":"111****11"},{"$f":"IF('Öğr.Gör. Ön Değ.'!C15=\"\",\"\",IF(ISERR(FIND(\" \",'Öğr.Gör. Ön Değ.'!C15))=TRUE,LEFT('Öğr.Gör. Ön Değ.'!C15,2)&REPT(\"*\",3),LEFT('Öğr.Gör. Ön Değ.'!C15,2)&REPT(\"*\",3)&\" \"&MID('Öğr.Gör. Ön Değ.'!C15,FIND(\" \",'Öğr.Gör. Ön Değ.'!C15)+1,2)&REPT(\"*\",3)))","v":"Ör***"},{"$f":"IF('Öğr.Gör. Ön Değ.'!D15=\"\",\"\",IF(ISERR(FIND(\" \",'Öğr.Gör. Ön Değ.'!D15))=TRUE,LEFT('Öğr.Gör. Ön Değ.'!D15,2)&REPT(\"*\",3),LEFT('Öğr.Gör. Ön Değ.'!D15,2)&REPT(\"*\",3)&\" \"&MID('Öğr.Gör. Ön Değ.'!D15,FIND(\" \",'Öğr.Gör. Ön Değ.'!D15)+1,2)&REPT(\"*\",3)))","v":"Ör*** Ör***"},{"$f":"IF('Öğr.Gör. Ön Değ.'!E15=\"\",\"\",'Öğr.Gör. Ön Değ.'!E15)","v":79.275630000000007},{"$f":"IF('Öğr.Gör. Ön Değ.'!F15=\"\",\"\",'Öğr.Gör. Ön Değ.'!F15)","v":82.53},{"$f":"IF('Öğr.Gör. Ön Değ.'!G15=\"\",\"\",'Öğr.Gör. Ön Değ.'!G15)","v":"Mevcut"},{"$f":"IF('Öğr.Gör. Ön Değ.'!H15=\"\",\"\",'Öğr.Gör. Ön Değ.'!H15)","v":"Uygun"},{"$f":"IF('Öğr.Gör. Ön Değ.'!I15=\"\",\"\",'Öğr.Gör. Ön Değ.'!I15)","v":47.565378000000003},{"$f":"IF('Öğr.Gör. Ön Değ.'!J15=\"\",\"\",'Öğr.Gör. Ön Değ.'!J15)","v":33.012},{"$f":"IF('Öğr.Gör. Ön Değ.'!K15=\"\",\"\",'Öğr.Gör. Ön Değ.'!K15)","v":80.57737800000001},{"$f":"IF('Öğr.Gör. Ön Değ.'!L15=\"\",\"\",'Öğr.Gör. Ön Değ.'!L15)","v":"Sınava Girebilir"}]
[{"$f":"IF('Öğr.Gör. Ön Değ.'!A16=\"\",\"\",'Öğr.Gör. Ön Değ.'!A16)","v":4},{"$f":"IF('Öğr.Gör. Ön Değ.'!B16=\"\",\"\",LEFT('Öğr.Gör. Ön Değ.'!B16,3)&REPT(\"*\",4)&RIGHT('Öğr.Gör. Ön Değ.'!B16,2))","v":"111****11"},{"$f":"IF('Öğr.Gör. Ön Değ.'!C16=\"\",\"\",IF(ISERR(FIND(\" \",'Öğr.Gör. Ön Değ.'!C16))=TRUE,LEFT('Öğr.Gör. Ön Değ.'!C16,2)&REPT(\"*\",3),LEFT('Öğr.Gör. Ön Değ.'!C16,2)&REPT(\"*\",3)&\" \"&MID('Öğr.Gör. Ön Değ.'!C16,FIND(\" \",'Öğr.Gör. Ön Değ.'!C16)+1,2)&REPT(\"*\",3)))","v":"Ör*** Ör***"},{"$f":"IF('Öğr.Gör. Ön Değ.'!D16=\"\",\"\",IF(ISERR(FIND(\" \",'Öğr.Gör. Ön Değ.'!D16))=TRUE,LEFT('Öğr.Gör. Ön Değ.'!D16,2)&REPT(\"*\",3),LEFT('Öğr.Gör. Ön Değ.'!D16,2)&REPT(\"*\",3)&\" \"&MID('Öğr.Gör. Ön Değ.'!D16,FIND(\" \",'Öğr.Gör. Ön Değ.'!D16)+1,2)&REPT(\"*\",3)))","v":"Ör*** Ör***"},{"$f":"IF('Öğr.Gör. Ön Değ.'!E16=\"\",\"\",'Öğr.Gör. Ön Değ.'!E16)","v":78.113749999999996},{"$f":"IF('Öğr.Gör. Ön Değ.'!F16=\"\",\"\",'Öğr.Gör. Ön Değ.'!F16)","v":81.56},{"$f":"IF('Öğr.Gör. Ön Değ.'!G16=\"\",\"\",'Öğr.Gör. Ön Değ.'!G16)","v":"Mevcut"},{"$f":"IF('Öğr.Gör. Ön Değ.'!H16=\"\",\"\",'Öğr.Gör. Ön Değ.'!H16)","v":"Uygun"},{"$f":"IF('Öğr.Gör. Ön Değ.'!I16=\"\",\"\",'Öğr.Gör. Ön Değ.'!I16)","v":46.868249999999996},{"$f":"IF('Öğr.Gör. Ön Değ.'!J16=\"\",\"\",'Öğr.Gör. Ön Değ.'!J16)","v":32.624000000000002},{"$f":"IF('Öğr.Gör. Ön Değ.'!K16=\"\",\"\",'Öğr.Gör. Ön Değ.'!K16)","v":79.492249999999999},{"$f":"IF('Öğr.Gör. Ön Değ.'!L16=\"\",\"\",'Öğr.Gör. Ön Değ.'!L16)","v":"Sınava Girebilir"}]
[{"$f":"IF('Öğr.Gör. Ön Değ.'!A17=\"\",\"\",'Öğr.Gör. Ön Değ.'!A17)","v":5},{"$f":"IF('Öğr.Gör. Ön Değ.'!B17=\"\",\"\",LEFT('Öğr.Gör. Ön Değ.'!B17,3)&REPT(\"*\",4)&RIGHT('Öğr.Gör. Ön Değ.'!B17,2))","v":"111****11"},{"$f":"IF('Öğr.Gör. Ön Değ.'!C17=\"\",\"\",IF(ISERR(FIND(\" \",'Öğr.Gör. Ön Değ.'!C17))=TRUE,LEFT('Öğr.Gör. Ön Değ.'!C17,2)&REPT(\"*\",3),LEFT('Öğr.Gör. Ön Değ.'!C17,2)&REPT(\"*\",3)&\" \"&MID('Öğr.Gör. Ön Değ.'!C17,FIND(\" \",'Öğr.Gör. Ön Değ.'!C17)+1,2)&REPT(\"*\",3)))","v":"Ör***"},{"$f":"IF('Öğr.Gör. Ön Değ.'!D17=\"\",\"\",IF(ISERR(FIND(\" \",'Öğr.Gör. Ön Değ.'!D17))=TRUE,LEFT('Öğr.Gör. Ön Değ.'!D17,2)&REPT(\"*\",3),LEFT('Öğr.Gör. Ön Değ.'!D17,2)&REPT(\"*\",3)&\" \"&MID('Öğr.Gör. Ön Değ.'!D17,FIND(\" \",'Öğr.Gör. Ön Değ.'!D17)+1,2)&REPT(\"*\",3)))","v":"Ör***"},{"$f":"IF('Öğr.Gör. Ön Değ.'!E17=\"\",\"\",'Öğr.Gör. Ön Değ.'!E17)","v":77.505549999999999},{"$f":"IF('Öğr.Gör. Ön Değ.'!F17=\"\",\"\",'Öğr.Gör. Ön Değ.'!F17)","v":80.56},{"$f":"IF('Öğr.Gör. Ön Değ.'!G17=\"\",\"\",'Öğr.Gör. Ön Değ.'!G17)","v":"Mevcut"},{"$f":"IF('Öğr.Gör. Ön Değ.'!H17=\"\",\"\",'Öğr.Gör. Ön Değ.'!H17)","v":"Uygun"},{"$f":"IF('Öğr.Gör. Ön Değ.'!I17=\"\",\"\",'Öğr.Gör. Ön Değ.'!I17)","v":46.503329999999998},{"$f":"IF('Öğr.Gör. Ön Değ.'!J17=\"\",\"\",'Öğr.Gör. Ön Değ.'!J17)","v":32.224000000000004},{"$f":"IF('Öğr.Gör. Ön Değ.'!K17=\"\",\"\",'Öğr.Gör. Ön Değ.'!K17)","v":78.727329999999995},{"$f":"IF('Öğr.Gör. Ön Değ.'!L17=\"\",\"\",'Öğr.Gör. Ön Değ.'!L17)","v":"Sınava Girebilir"}]
[{"$f":"IF('Öğr.Gör. Ön Değ.'!A18=\"\",\"\",'Öğr.Gör. Ön Değ.'!A18)","v":6},{"$f":"IF('Öğr.Gör. Ön Değ.'!B18=\"\",\"\",LEFT('Öğr.Gör. Ön Değ.'!B18,3)&REPT(\"*\",4)&RIGHT('Öğr.Gör. Ön Değ.'!B18,2))","v":"111****11"},{"$f":"IF('Öğr.Gör. Ön Değ.'!C18=\"\",\"\",IF(ISERR(FIND(\" \",'Öğr.Gör. Ön Değ.'!C18))=TRUE,LEFT('Öğr.Gör. Ön Değ.'!C18,2)&REPT(\"*\",3),LEFT('Öğr.Gör. Ön Değ.'!C18,2)&REPT(\"*\",3)&\" \"&MID('Öğr.Gör. Ön Değ.'!C18,FIND(\" \",'Öğr.Gör. Ön Değ.'!C18)+1,2)&REPT(\"*\",3)))","v":"Ör***"},{"$f":"IF('Öğr.Gör. Ön Değ.'!D18=\"\",\"\",IF(ISERR(FIND(\" \",'Öğr.Gör. Ön Değ.'!D18))=TRUE,LEFT('Öğr.Gör. Ön Değ.'!D18,2)&REPT(\"*\",3),LEFT('Öğr.Gör. Ön Değ.'!D18,2)&REPT(\"*\",3)&\" \"&MID('Öğr.Gör. Ön Değ.'!D18,FIND(\" \",'Öğr.Gör. Ön Değ.'!D18)+1,2)&REPT(\"*\",3)))","v":"Ör***"},{"$f":"IF('Öğr.Gör. Ön Değ.'!E18=\"\",\"\",'Öğr.Gör. Ön Değ.'!E18)","v":76.607429999999994},{"$f":"IF('Öğr.Gör. Ön Değ.'!F18=\"\",\"\",'Öğr.Gör. Ön Değ.'!F18)","v":79.03},{"$f":"IF('Öğr.Gör. Ön Değ.'!G18=\"\",\"\",'Öğr.Gör. Ön Değ.'!G18)","v":"Mevcut"},{"$f":"IF('Öğr.Gör. Ön Değ.'!H18=\"\",\"\",'Öğr.Gör. Ön Değ.'!H18)","v":"Uygun"},{"$f":"IF('Öğr.Gör. Ön Değ.'!I18=\"\",\"\",'Öğr.Gör. Ön Değ.'!I18)","v":45.964457999999993},{"$f":"IF('Öğr.Gör. Ön Değ.'!J18=\"\",\"\",'Öğr.Gör. Ön Değ.'!J18)","v":31.612000000000002},{"$f":"IF('Öğr.Gör. Ön Değ.'!K18=\"\",\"\",'Öğr.Gör. Ön Değ.'!K18)","v":77.576458000000002},{"$f":"IF('Öğr.Gör. Ön Değ.'!L18=\"\",\"\",'Öğr.Gör. Ön Değ.'!L18)","v":"Sınava Girebilir"}]
[{"$f":"IF('Öğr.Gör. Ön Değ.'!A19=\"\",\"\",'Öğr.Gör. Ön Değ.'!A19)","v":7},{"$f":"IF('Öğr.Gör. Ön Değ.'!B19=\"\",\"\",LEFT('Öğr.Gör. Ön Değ.'!B19,3)&REPT(\"*\",4)&RIGHT('Öğr.Gör. Ön Değ.'!B19,2))","v":"111****11"},{"$f":"IF('Öğr.Gör. Ön Değ.'!C19=\"\",\"\",IF(ISERR(FIND(\" \",'Öğr.Gör. Ön Değ.'!C19))=TRUE,LEFT('Öğr.Gör. Ön Değ.'!C19,2)&REPT(\"*\",3),LEFT('Öğr.Gör. Ön Değ.'!C19,2)&REPT(\"*\",3)&\" \"&MID('Öğr.Gör. Ön Değ.'!C19,FIND(\" \",'Öğr.Gör. Ön Değ.'!C19)+1,2)&REPT(\"*\",3)))","v":"Ör***"},{"$f":"IF('Öğr.Gör. Ön Değ.'!D19=\"\",\"\",IF(ISERR(FIND(\" \",'Öğr.Gör. Ön Değ.'!D19))=TRUE,LEFT('Öğr.Gör. Ön Değ.'!D19,2)&REPT(\"*\",3),LEFT('Öğr.Gör. Ön Değ.'!D19,2)&REPT(\"*\",3)&\" \"&MID('Öğr.Gör. Ön Değ.'!D19,FIND(\" \",'Öğr.Gör. Ön Değ.'!D19)+1,2)&REPT(\"*\",3)))","v":"Ör***"},{"$f":"IF('Öğr.Gör. Ön Değ.'!E19=\"\",\"\",'Öğr.Gör. Ön Değ.'!E19)","v":75.275630000000007},{"$f":"IF('Öğr.Gör. Ön Değ.'!F19=\"\",\"\",'Öğr.Gör. Ön Değ.'!F19)","v":78.53},{"$f":"IF('Öğr.Gör. Ön Değ.'!G19=\"\",\"\",'Öğr.Gör. Ön Değ.'!G19)","v":"Mevcut"},{"$f":"IF('Öğr.Gör. Ön Değ.'!H19=\"\",\"\",'Öğr.Gör. Ön Değ.'!H19)","v":"Uygun"},{"$f":"IF('Öğr.Gör. Ön Değ.'!I19=\"\",\"\",'Öğr.Gör. Ön Değ.'!I19)","v":45.165378000000004},{"$f":"IF('Öğr.Gör. Ön Değ.'!J19=\"\",\"\",'Öğr.Gör. Ön Değ.'!J19)","v":31.412000000000003},{"$f":"IF('Öğr.Gör. Ön Değ.'!K19=\"\",\"\",'Öğr.Gör. Ön Değ.'!K19)","v":76.57737800000001},{"$f":"IF('Öğr.Gör. Ön Değ.'!L19=\"\",\"\",'Öğr.Gör. Ön Değ.'!L19)","v":"Sınava Girebilir"}]
[{"$f":"IF('Öğr.Gör. Ön Değ.'!A20=\"\",\"\",'Öğr.Gör. Ön Değ.'!A20)","v":8},{"$f":"IF('Öğr.Gör. Ön Değ.'!B20=\"\",\"\",LEFT('Öğr.Gör. Ön Değ.'!B20,3)&REPT(\"*\",4)&RIGHT('Öğr.Gör. Ön Değ.'!B20,2))","v":"111****11"},{"$f":"IF('Öğr.Gör. Ön Değ.'!C20=\"\",\"\",IF(ISERR(FIND(\" \",'Öğr.Gör. Ön Değ.'!C20))=TRUE,LEFT('Öğr.Gör. Ön Değ.'!C20,2)&REPT(\"*\",3),LEFT('Öğr.Gör. Ön Değ.'!C20,2)&REPT(\"*\",3)&\" \"&MID('Öğr.Gör. Ön Değ.'!C20,FIND(\" \",'Öğr.Gör. Ön Değ.'!C20)+1,2)&REPT(\"*\",3)))","v":"Ör***"},{"$f":"IF('Öğr.Gör. Ön Değ.'!D20=\"\",\"\",IF(ISERR(FIND(\" \",'Öğr.Gör. Ön Değ.'!D20))=TRUE,LEFT('Öğr.Gör. Ön Değ.'!D20,2)&REPT(\"*\",3),LEFT('Öğr.Gör. Ön Değ.'!D20,2)&REPT(\"*\",3)&\" \"&MID('Öğr.Gör. Ön Değ.'!D20,FIND(\" \",'Öğr.Gör. Ön Değ.'!D20)+1,2)&REPT(\"*\",3)))","v":"Ör***"},{"$f":"IF('Öğr.Gör. Ön Değ.'!E20=\"\",\"\",'Öğr.Gör. Ön Değ.'!E20)","v":74.113749999999996},{"$f":"IF('Öğr.Gör. Ön Değ.'!F20=\"\",\"\",'Öğr.Gör. Ön Değ.'!F20)","v":77.56},{"$f":"IF('Öğr.Gör. Ön Değ.'!G20=\"\",\"\",'Öğr.Gör. Ön Değ.'!G20)","v":"Mevcut"},{"$f":"IF('Öğr.Gör. Ön Değ.'!H20=\"\",\"\",'Öğr.Gör. Ön Değ.'!H20)","v":"Uygun"},{"$f":"IF('Öğr.Gör. Ön Değ.'!I20=\"\",\"\",'Öğr.Gör. Ön Değ.'!I20)","v":44.468249999999998},{"$f":"IF('Öğr.Gör. Ön Değ.'!J20=\"\",\"\",'Öğr.Gör. Ön Değ.'!J20)","v":31.024000000000001},{"$f":"IF('Öğr.Gör. Ön Değ.'!K20=\"\",\"\",'Öğr.Gör. Ön Değ.'!K20)","v":75.492249999999999},{"$f":"IF('Öğr.Gör. Ön Değ.'!L20=\"\",\"\",'Öğr.Gör. Ön Değ.'!L20)","v":"Sınava Girebilir"}]
[{"$f":"IF('Öğr.Gör. Ön Değ.'!A21=\"\",\"\",'Öğr.Gör. Ön Değ.'!A21)","v":9},{"$f":"IF('Öğr.Gör. Ön Değ.'!B21=\"\",\"\",LEFT('Öğr.Gör. Ön Değ.'!B21,3)&REPT(\"*\",4)&RIGHT('Öğr.Gör. Ön Değ.'!B21,2))","v":"111****11"},{"$f":"IF('Öğr.Gör. Ön Değ.'!C21=\"\",\"\",IF(ISERR(FIND(\" \",'Öğr.Gör. Ön Değ.'!C21))=TRUE,LEFT('Öğr.Gör. Ön Değ.'!C21,2)&REPT(\"*\",3),LEFT('Öğr.Gör. Ön Değ.'!C21,2)&REPT(\"*\",3)&\" \"&MID('Öğr.Gör. Ön Değ.'!C21,FIND(\" \",'Öğr.Gör. Ön Değ.'!C21)+1,2)&REPT(\"*\",3)))","v":"Ör***"},{"$f":"IF('Öğr.Gör. Ön Değ.'!D21=\"\",\"\",IF(ISERR(FIND(\" \",'Öğr.Gör. Ön Değ.'!D21))=TRUE,LEFT('Öğr.Gör. Ön Değ.'!D21,2)&REPT(\"*\",3),LEFT('Öğr.Gör. Ön Değ.'!D21,2)&REPT(\"*\",3)&\" \"&MID('Öğr.Gör. Ön Değ.'!D21,FIND(\" \",'Öğr.Gör. Ön Değ.'!D21)+1,2)&REPT(\"*\",3)))","v":"Ör***"},{"$f":"IF('Öğr.Gör. Ön Değ.'!E21=\"\",\"\",'Öğr.Gör. Ön Değ.'!E21)","v":73.505549999999999},{"$f":"IF('Öğr.Gör. Ön Değ.'!F21=\"\",\"\",'Öğr.Gör. Ön Değ.'!F21)","v":76.56},{"$f":"IF('Öğr.Gör. Ön Değ.'!G21=\"\",\"\",'Öğr.Gör. Ön Değ.'!G21)","v":"Mevcut"},{"$f":"IF('Öğr.Gör. Ön Değ.'!H21=\"\",\"\",'Öğr.Gör. Ön Değ.'!H21)","v":"Uygun"},{"$f":"IF('Öğr.Gör. Ön Değ.'!I21=\"\",\"\",'Öğr.Gör. Ön Değ.'!I21)","v":44.10333},{"$f":"IF('Öğr.Gör. Ön Değ.'!J21=\"\",\"\",'Öğr.Gör. Ön Değ.'!J21)","v":30.624000000000002},{"$f":"IF('Öğr.Gör. Ön Değ.'!K21=\"\",\"\",'Öğr.Gör. Ön Değ.'!K21)","v":74.727329999999995},{"$f":"IF('Öğr.Gör. Ön Değ.'!L21=\"\",\"\",'Öğr.Gör. Ön Değ.'!L21)","v":"Sınava Girebilir"}]
[{"$f":"IF('Öğr.Gör. Ön Değ.'!A22=\"\",\"\",'Öğr.Gör. Ön Değ.'!A22)","v":10},{"$f":"IF('Öğr.Gör. Ön Değ.'!B22=\"\",\"\",LEFT('Öğr.Gör. Ön Değ.'!B22,3)&REPT(\"*\",4)&RIGHT('Öğr.Gör. Ön Değ.'!B22,2))","v":"111****11"},{"$f":"IF('Öğr.Gör. Ön Değ.'!C22=\"\",\"\",IF(ISERR(FIND(\" \",'Öğr.Gör. Ön Değ.'!C22))=TRUE,LEFT('Öğr.Gör. Ön Değ.'!C22,2)&REPT(\"*\",3),LEFT('Öğr.Gör. Ön Değ.'!C22,2)&REPT(\"*\",3)&\" \"&MID('Öğr.Gör. Ön Değ.'!C22,FIND(\" \",'Öğr.Gör. Ön Değ.'!C22)+1,2)&REPT(\"*\",3)))","v":"Ör***"},{"$f":"IF('Öğr.Gör. Ön Değ.'!D22=\"\",\"\",IF(ISERR(FIND(\" \",'Öğr.Gör. Ön Değ.'!D22))=TRUE,LEFT('Öğr.Gör. Ön Değ.'!D22,2)&REPT(\"*\",3),LEFT('Öğr.Gör. Ön Değ.'!D22,2)&REPT(\"*\",3)&\" \"&MID('Öğr.Gör. Ön Değ.'!D22,FIND(\" \",'Öğr.Gör. Ön Değ.'!D22)+1,2)&REPT(\"*\",3)))","v":"Ör***"},{"$f":"IF('Öğr.Gör. Ön Değ.'!E22=\"\",\"\",'Öğr.Gör. Ön Değ.'!E22)","v":72.607429999999994},{"$f":"IF('Öğr.Gör. Ön Değ.'!F22=\"\",\"\",'Öğr.Gör. Ön Değ.'!F22)","v":75.03},{"$f":"IF('Öğr.Gör. Ön Değ.'!G22=\"\",\"\",'Öğr.Gör. Ön Değ.'!G22)","v":"Mevcut"},{"$f":"IF('Öğr.Gör. Ön Değ.'!H22=\"\",\"\",'Öğr.Gör. Ön Değ.'!H22)","v":"Uygun"},{"$f":"IF('Öğr.Gör. Ön Değ.'!I22=\"\",\"\",'Öğr.Gör. Ön Değ.'!I22)","v":43.564457999999995},{"$f":"IF('Öğr.Gör. Ön Değ.'!J22=\"\",\"\",'Öğr.Gör. Ön Değ.'!J22)","v":30.012},{"$f":"IF('Öğr.Gör. Ön Değ.'!K22=\"\",\"\",'Öğr.Gör. Ön Değ.'!K22)","v":73.576458000000002},{"$f":"IF('Öğr.Gör. Ön Değ.'!L22=\"\",\"\",'Öğr.Gör. Ön Değ.'!L22)","v":"Sınava Girebilir"}]
[{"$f":"IF('Öğr.Gör. Ön Değ.'!A23=\"\",\"\",'Öğr.Gör. Ön Değ.'!A23)","v":11},{"$f":"IF('Öğr.Gör. Ön Değ.'!B23=\"\",\"\",LEFT('Öğr.Gör. Ön Değ.'!B23,3)&REPT(\"*\",4)&RIGHT('Öğr.Gör. Ön Değ.'!B23,2))","v":"111****11"},{"$f":"IF('Öğr.Gör. Ön Değ.'!C23=\"\",\"\",IF(ISERR(FIND(\" \",'Öğr.Gör. Ön Değ.'!C23))=TRUE,LEFT('Öğr.Gör. Ön Değ.'!C23,2)&REPT(\"*\",3),LEFT('Öğr.Gör. Ön Değ.'!C23,2)&REPT(\"*\",3)&\" \"&MID('Öğr.Gör. Ön Değ.'!C23,FIND(\" \",'Öğr.Gör. Ön Değ.'!C23)+1,2)&REPT(\"*\",3)))","v":"Ör***"},{"$f":"IF('Öğr.Gör. Ön Değ.'!D23=\"\",\"\",IF(ISERR(FIND(\" \",'Öğr.Gör. Ön Değ.'!D23))=TRUE,LEFT('Öğr.Gör. Ön Değ.'!D23,2)&REPT(\"*\",3),LEFT('Öğr.Gör. Ön Değ.'!D23,2)&REPT(\"*\",3)&\" \"&MID('Öğr.Gör. Ön Değ.'!D23,FIND(\" \",'Öğr.Gör. Ön Değ.'!D23)+1,2)&REPT(\"*\",3)))","v":"Ör***"},{"$f":"IF('Öğr.Gör. Ön Değ.'!E23=\"\",\"\",'Öğr.Gör. Ön Değ.'!E23)","v":71.275630000000007},{"$f":"IF('Öğr.Gör. Ön Değ.'!F23=\"\",\"\",'Öğr.Gör. Ön Değ.'!F23)","v":74.53},{"$f":"IF('Öğr.Gör. Ön Değ.'!G23=\"\",\"\",'Öğr.Gör. Ön Değ.'!G23)","v":"Mevcut"},{"$f":"IF('Öğr.Gör. Ön Değ.'!H23=\"\",\"\",'Öğr.Gör. Ön Değ.'!H23)","v":"Uygun"},{"$f":"IF('Öğr.Gör. Ön Değ.'!I23=\"\",\"\",'Öğr.Gör. Ön Değ.'!I23)","v":42.765378000000005},{"$f":"IF('Öğr.Gör. Ön Değ.'!J23=\"\",\"\",'Öğr.Gör. Ön Değ.'!J23)","v":29.812000000000001},{"$f":"IF('Öğr.Gör. Ön Değ.'!K23=\"\",\"\",'Öğr.Gör. Ön Değ.'!K23)","v":72.57737800000001},{"$f":"IF('Öğr.Gör. Ön Değ.'!L23=\"\",\"\",'Öğr.Gör. Ön Değ.'!L23)","v":"Yönetmelik Gereği Elendi *"}]
[{"$f":"IF('Öğr.Gör. Ön Değ.'!A24=\"\",\"\",'Öğr.Gör. Ön Değ.'!A24)","v":12},{"$f":"IF('Öğr.Gör. Ön Değ.'!B24=\"\",\"\",LEFT('Öğr.Gör. Ön Değ.'!B24,3)&REPT(\"*\",4)&RIGHT('Öğr.Gör. Ön Değ.'!B24,2))","v":"111****11"},{"$f":"IF('Öğr.Gör. Ön Değ.'!C24=\"\",\"\",IF(ISERR(FIND(\" \",'Öğr.Gör. Ön Değ.'!C24))=TRUE,LEFT('Öğr.Gör. Ön Değ.'!C24,2)&REPT(\"*\",3),LEFT('Öğr.Gör. Ön Değ.'!C24,2)&REPT(\"*\",3)&\" \"&MID('Öğr.Gör. Ön Değ.'!C24,FIND(\" \",'Öğr.Gör. Ön Değ.'!C24)+1,2)&REPT(\"*\",3)))","v":"Ör***"},{"$f":"IF('Öğr.Gör. Ön Değ.'!D24=\"\",\"\",IF(ISERR(FIND(\" \",'Öğr.Gör. Ön Değ.'!D24))=TRUE,LEFT('Öğr.Gör. Ön Değ.'!D24,2)&REPT(\"*\",3),LEFT('Öğr.Gör. Ön Değ.'!D24,2)&REPT(\"*\",3)&\" \"&MID('Öğr.Gör. Ön Değ.'!D24,FIND(\" \",'Öğr.Gör. Ön Değ.'!D24)+1,2)&REPT(\"*\",3)))","v":"Ör***"},{"$f":"IF('Öğr.Gör. Ön Değ.'!E24=\"\",\"\",'Öğr.Gör. Ön Değ.'!E24)","v":70.113749999999996},{"$f":"IF('Öğr.Gör. Ön Değ.'!F24=\"\",\"\",'Öğr.Gör. Ön Değ.'!F24)","v":73.56},{"$f":"IF('Öğr.Gör. Ön Değ.'!G24=\"\",\"\",'Öğr.Gör. Ön Değ.'!G24)","v":"Mevcut"},{"$f":"IF('Öğr.Gör. Ön Değ.'!H24=\"\",\"\",'Öğr.Gör. Ön Değ.'!H24)","v":"Uygun"},{"$f":"IF('Öğr.Gör. Ön Değ.'!I24=\"\",\"\",'Öğr.Gör. Ön Değ.'!I24)","v":42.068249999999999},{"$f":"IF('Öğr.Gör. Ön Değ.'!J24=\"\",\"\",'Öğr.Gör. Ön Değ.'!J24)","v":29.424000000000003},{"$f":"IF('Öğr.Gör. Ön Değ.'!K24=\"\",\"\",'Öğr.Gör. Ön Değ.'!K24)","v":71.492249999999999},{"$f":"IF('Öğr.Gör. Ön Değ.'!L24=\"\",\"\",'Öğr.Gör. Ön Değ.'!L24)","v":"Yönetmelik Gereği Elendi *"}]
[{"$f":"IF('Öğr.Gör. Ön Değ.'!A25=\"\",\"\",'Öğr.Gör. Ön Değ.'!A25)","v":13},{"$f":"IF('Öğr.Gör. Ön Değ.'!B25=\"\",\"\",LEFT('Öğr.Gör. Ön Değ.'!B25,3)&REPT(\"*\",4)&RIGHT('Öğr.Gör. Ön Değ.'!B25,2))","v":"111****11"},{"$f":"IF('Öğr.Gör. Ön Değ.'!C25=\"\",\"\",IF(ISERR(FIND(\" \",'Öğr.Gör. Ön Değ.'!C25))=TRUE,LEFT('Öğr.Gör. Ön Değ.'!C25,2)&REPT(\"*\",3),LEFT('Öğr.Gör. Ön Değ.'!C25,2)&REPT(\"*\",3)&\" \"&MID('Öğr.Gör. Ön Değ.'!C25,FIND(\" \",'Öğr.Gör. Ön Değ.'!C25)+1,2)&REPT(\"*\",3)))","v":"Ör***"},{"$f":"IF('Öğr.Gör. Ön Değ.'!D25=\"\",\"\",IF(ISERR(FIND(\" \",'Öğr.Gör. Ön Değ.'!D25))=TRUE,LEFT('Öğr.Gör. Ön Değ.'!D25,2)&REPT(\"*\",3),LEFT('Öğr.Gör. Ön Değ.'!D25,2)&REPT(\"*\",3)&\" \"&MID('Öğr.Gör. Ön Değ.'!D25,FIND(\" \",'Öğr.Gör. Ön Değ.'!D25)+1,2)&REPT(\"*\",3)))","v":"Ör***"},{"$f":"IF('Öğr.Gör. Ön Değ.'!E25=\"\",\"\",'Öğr.Gör. Ön Değ.'!E25)","v":70.505549999999999},{"$f":"IF('Öğr.Gör. Ön Değ.'!F25=\"\",\"\",'Öğr.Gör. Ön Değ.'!F25)","v":72.56},{"$f":"IF('Öğr.Gör. Ön Değ.'!G25=\"\",\"\",'Öğr.Gör. Ön Değ.'!G25)","v":"Mevcut"},{"$f":"IF('Öğr.Gör. Ön Değ.'!H25=\"\",\"\",'Öğr.Gör. Ön Değ.'!H25)","v":"Uygun"},{"$f":"IF('Öğr.Gör. Ön Değ.'!I25=\"\",\"\",'Öğr.Gör. Ön Değ.'!I25)","v":42.303329999999995},{"$f":"IF('Öğr.Gör. Ön Değ.'!J25=\"\",\"\",'Öğr.Gör. Ön Değ.'!J25)","v":29.024000000000001},{"$f":"IF('Öğr.Gör. Ön Değ.'!K25=\"\",\"\",'Öğr.Gör. Ön Değ.'!K25)","v":71.327329999999989},{"$f":"IF('Öğr.Gör. Ön Değ.'!L25=\"\",\"\",'Öğr.Gör. Ön Değ.'!L25)","v":"Yönetmelik Gereği Elendi *"}]
[{"$f":"IF('Öğr.Gör. Ön Değ.'!A26=\"\",\"\",'Öğr.Gör. Ön Değ.'!A26)","v":14},{"$f":"IF('Öğr.Gör. Ön Değ.'!B26=\"\",\"\",LEFT('Öğr.Gör. Ön Değ.'!B26,3)&REPT(\"*\",4)&RIGHT('Öğr.Gör. Ön Değ.'!B26,2))","v":"111****11"},{"$f":"IF('Öğr.Gör. Ön Değ.'!C26=\"\",\"\",IF(ISERR(FIND(\" \",'Öğr.Gör. Ön Değ.'!C26))=TRUE,LEFT('Öğr.Gör. Ön Değ.'!C26,2)&REPT(\"*\",3),LEFT('Öğr.Gör. Ön Değ.'!C26,2)&REPT(\"*\",3)&\" \"&MID('Öğr.Gör. Ön Değ.'!C26,FIND(\" \",'Öğr.Gör. Ön Değ.'!C26)+1,2)&REPT(\"*\",3)))","v":"Ör***"},{"$f":"IF('Öğr.Gör. Ön Değ.'!D26=\"\",\"\",IF(ISERR(FIND(\" \",'Öğr.Gör. Ön Değ.'!D26))=TRUE,LEFT('Öğr.Gör. Ön Değ.'!D26,2)&REPT(\"*\",3),LEFT('Öğr.Gör. Ön Değ.'!D26,2)&REPT(\"*\",3)&\" \"&MID('Öğr.Gör. Ön Değ.'!D26,FIND(\" \",'Öğr.Gör. Ön Değ.'!D26)+1,2)&REPT(\"*\",3)))","v":"Ör***"},{"$f":"IF('Öğr.Gör. Ön Değ.'!E26=\"\",\"\",'Öğr.Gör. Ön Değ.'!E26)","v":70.607429999999994},{"$f":"IF('Öğr.Gör. Ön Değ.'!F26=\"\",\"\",'Öğr.Gör. Ön Değ.'!F26)","v":72.03},{"$f":"IF('Öğr.Gör. Ön Değ.'!G26=\"\",\"\",'Öğr.Gör. Ön Değ.'!G26)","v":"Mevcut"},{"$f":"IF('Öğr.Gör. Ön Değ.'!H26=\"\",\"\",'Öğr.Gör. Ön Değ.'!H26)","v":"Uygun Değil"},{"$f":"IF('Öğr.Gör. Ön Değ.'!I26=\"\",\"\",'Öğr.Gör. Ön Değ.'!I26)","v":42.364457999999992},{"$f":"IF('Öğr.Gör. Ön Değ.'!J26=\"\",\"\",'Öğr.Gör. Ön Değ.'!J26)","v":28.812000000000001},{"$f":"IF('Öğr.Gör. Ön Değ.'!K26=\"\",\"\",'Öğr.Gör. Ön Değ.'!K26)","v":71.176457999999997},{"$f":"IF('Öğr.Gör. Ön Değ.'!L26=\"\",\"\",'Öğr.Gör. Ön Değ.'!L26)","v":"Başvuru Şartını Sağlamıyor (Tecrübe süresi ilan şartını taşımıyor)"}]
[{"$f":"IF('Öğr.Gör. Ön Değ.'!A27=\"\",\"\",'Öğr.Gör. Ön Değ.'!A27)","v":15},{"$f":"IF('Öğr.Gör. Ön Değ.'!B27=\"\",\"\",LEFT('Öğr.Gör. Ön Değ.'!B27,3)&REPT(\"*\",4)&RIGHT('Öğr.Gör. Ön Değ.'!B27,2))","v":"111****11"},{"$f":"IF('Öğr.Gör. Ön Değ.'!C27=\"\",\"\",IF(ISERR(FIND(\" \",'Öğr.Gör. Ön Değ.'!C27))=TRUE,LEFT('Öğr.Gör. Ön Değ.'!C27,2)&REPT(\"*\",3),LEFT('Öğr.Gör. Ön Değ.'!C27,2)&REPT(\"*\",3)&\" \"&MID('Öğr.Gör. Ön Değ.'!C27,FIND(\" \",'Öğr.Gör. Ön Değ.'!C27)+1,2)&REPT(\"*\",3)))","v":"Ör***"},{"$f":"IF('Öğr.Gör. Ön Değ.'!D27=\"\",\"\",IF(ISERR(FIND(\" \",'Öğr.Gör. Ön Değ.'!D27))=TRUE,LEFT('Öğr.Gör. Ön Değ.'!D27,2)&REPT(\"*\",3),LEFT('Öğr.Gör. Ön Değ.'!D27,2)&REPT(\"*\",3)&\" \"&MID('Öğr.Gör. Ön Değ.'!D27,FIND(\" \",'Öğr.Gör. Ön Değ.'!D27)+1,2)&REPT(\"*\",3)))","v":"Ör***"},{"$f":"IF('Öğr.Gör. Ön Değ.'!E27=\"\",\"\",'Öğr.Gör. Ön Değ.'!E27)","v":70.275630000000007},{"$f":"IF('Öğr.Gör. Ön Değ.'!F27=\"\",\"\",'Öğr.Gör. Ön Değ.'!F27)","v":71.53},{"$f":"IF('Öğr.Gör. Ön Değ.'!G27=\"\",\"\",'Öğr.Gör. Ön Değ.'!G27)","v":"Mevcut Değil"},{"$f":"IF('Öğr.Gör. Ön Değ.'!H27=\"\",\"\",'Öğr.Gör. Ön Değ.'!H27)","v":"Uygun Değil"},{"$f":"IF('Öğr.Gör. Ön Değ.'!I27=\"\",\"\",'Öğr.Gör. Ön Değ.'!I27)","v":42.165378000000004},{"$f":"IF('Öğr.Gör. Ön Değ.'!J27=\"\",\"\",'Öğr.Gör. Ön Değ.'!J27)","v":28.612000000000002},{"$f":"IF('Öğr.Gör. Ön Değ.'!K27=\"\",\"\",'Öğr.Gör. Ön Değ.'!K27)","v":70.777377999999999},{"$f":"IF('Öğr.Gör. Ön Değ.'!L27=\"\",\"\",'Öğr.Gör. Ön Değ.'!L27)","v":"Başvuru Şartını Sağlamıyor (Tezli Yüksek Şartını Sağlamıyor)"}]
[{"$f":"IF('Öğr.Gör. Ön Değ.'!A28=\"\",\"\",'Öğr.Gör. Ön Değ.'!A28)","v":16},{"$f":"IF('Öğr.Gör. Ön Değ.'!B28=\"\",\"\",LEFT('Öğr.Gör. Ön Değ.'!B28,3)&REPT(\"*\",4)&RIGHT('Öğr.Gör. Ön Değ.'!B28,2))","v":"111****11"},{"$f":"IF('Öğr.Gör. Ön Değ.'!C28=\"\",\"\",IF(ISERR(FIND(\" \",'Öğr.Gör. Ön Değ.'!C28))=TRUE,LEFT('Öğr.Gör. Ön Değ.'!C28,2)&REPT(\"*\",3),LEFT('Öğr.Gör. Ön Değ.'!C28,2)&REPT(\"*\",3)&\" \"&MID('Öğr.Gör. Ön Değ.'!C28,FIND(\" \",'Öğr.Gör. Ön Değ.'!C28)+1,2)&REPT(\"*\",3)))","v":"Ör***"},{"$f":"IF('Öğr.Gör. Ön Değ.'!D28=\"\",\"\",IF(ISERR(FIND(\" \",'Öğr.Gör. Ön Değ.'!D28))=TRUE,LEFT('Öğr.Gör. Ön Değ.'!D28,2)&REPT(\"*\",3),LEFT('Öğr.Gör. Ön Değ.'!D28,2)&REPT(\"*\",3)&\" \"&MID('Öğr.Gör. Ön Değ.'!D28,FIND(\" \",'Öğr.Gör. Ön Değ.'!D28)+1,2)&REPT(\"*\",3)))","v":"Ör***"},{"$f":"IF('Öğr.Gör. Ön Değ.'!E28=\"\",\"\",'Öğr.Gör. Ön Değ.'!E28)","v":68},{"$f":"IF('Öğr.Gör. Ön Değ.'!F28=\"\",\"\",'Öğr.Gör. Ön Değ.'!F28)","v":95},{"$f":"IF('Öğr.Gör. Ön Değ.'!G28=\"\",\"\",'Öğr.Gör. Ön Değ.'!G28)","v":"Mevcut"},{"$f":"IF('Öğr.Gör. Ön Değ.'!H28=\"\",\"\",'Öğr.Gör. Ön Değ.'!H28)","v":"Uygun Değil"},{"$f":"IF('Öğr.Gör. Ön Değ.'!I28=\"\",\"\",'Öğr.Gör. Ön Değ.'!I28)","v":40.799999999999997},{"$f":"IF('Öğr.Gör. Ön Değ.'!J28=\"\",\"\",'Öğr.Gör. Ön Değ.'!J28)","v":38},{"$f":"IF('Öğr.Gör. Ön Değ.'!K28=\"\",\"\",'Öğr.Gör. Ön Değ.'!K28)","v":78.8},{"$f":"IF('Öğr.Gör. Ön Değ.'!L28=\"\",\"\",'Öğr.Gör. Ön Değ.'!L28)","v":"Başvuru Şartını Sağlamıyor (Ales puanı yetersiz)"}]
[{"$f":"IF('Öğr.Gör. Ön Değ.'!A29=\"\",\"\",'Öğr.Gör. Ön Değ.'!A29)","v":17},{"$f":"IF('Öğr.Gör. Ön Değ.'!B29=\"\",\"\",LEFT('Öğr.Gör. Ön Değ.'!B29,3)&REPT(\"*\",4)&RIGHT('Öğr.Gör. Ön Değ.'!B29,2))","v":"111****11"},{"$f":"IF('Öğr.Gör. Ön Değ.'!C29=\"\",\"\",IF(ISERR(FIND(\" \",'Öğr.Gör. Ön Değ.'!C29))=TRUE,LEFT('Öğr.Gör. Ön Değ.'!C29,2)&REPT(\"*\",3),LEFT('Öğr.Gör. Ön Değ.'!C29,2)&REPT(\"*\",3)&\" \"&MID('Öğr.Gör. Ön Değ.'!C29,FIND(\" \",'Öğr.Gör. Ön Değ.'!C29)+1,2)&REPT(\"*\",3)))","v":"Ör***"},{"$f":"IF('Öğr.Gör. Ön Değ.'!D29=\"\",\"\",IF(ISERR(FIND(\" \",'Öğr.Gör. Ön Değ.'!D29))=TRUE,LEFT('Öğr.Gör. Ön Değ.'!D29,2)&REPT(\"*\",3),LEFT('Öğr.Gör. Ön Değ.'!D29,2)&REPT(\"*\",3)&\" \"&MID('Öğr.Gör. Ön Değ.'!D29,FIND(\" \",'Öğr.Gör. Ön Değ.'!D29)+1,2)&REPT(\"*\",3)))","v":"Ör***"},{"$f":"IF('Öğr.Gör. Ön Değ.'!E29=\"\",\"\",'Öğr.Gör. Ön Değ.'!E29)","v":80},{"$f":"IF('Öğr.Gör. Ön Değ.'!F29=\"\",\"\",'Öğr.Gör. Ön Değ.'!F29)","v":75},{"$f":"IF('Öğr.Gör. Ön Değ.'!G29=\"\",\"\",'Öğr.Gör. Ön Değ.'!G29)","v":"Mevcut"},{"$f":"IF('Öğr.Gör. Ön Değ.'!H29=\"\",\"\",'Öğr.Gör. Ön Değ.'!H29)","v":"Uygun Değil"},{"$f":"IF('Öğr.Gör. Ön Değ.'!I29=\"\",\"\",'Öğr.Gör. Ön Değ.'!I29)","v":48},{"$f":"IF('Öğr.Gör. Ön Değ.'!J29=\"\",\"\",'Öğr.Gör. Ön Değ.'!J29)","v":30},{"$f":"IF('Öğr.Gör. Ön Değ.'!K29=\"\",\"\",'Öğr.Gör. Ön Değ.'!K29)","v":78},{"$f":"IF('Öğr.Gör. Ön Değ.'!L29=\"\",\"\",'Öğr.Gör. Ön Değ.'!L29)","v":"Başvuru Şartını Sağlamıyor (Lisans Mezuniyet alanı ilanla uyumlu değil)"}]
[{"$f":"IF('Öğr.Gör. Ön Değ.'!A30=\"\",\"\",'Öğr.Gör. Ön Değ.'!A30)","v":18},{"$f":"IF('Öğr.Gör. Ön Değ.'!B30=\"\",\"\",LEFT('Öğr.Gör. Ön Değ.'!B30,3)&REPT(\"*\",4)&RIGHT('Öğr.Gör. Ön Değ.'!B30,2))","v":"111****11"},{"$f":"IF('Öğr.Gör. Ön Değ.'!C30=\"\",\"\",IF(ISERR(FIND(\" \",'Öğr.Gör. Ön Değ.'!C30))=TRUE,LEFT('Öğr.Gör. Ön Değ.'!C30,2)&REPT(\"*\",3),LEFT('Öğr.Gör. Ön Değ.'!C30,2)&REPT(\"*\",3)&\" \"&MID('Öğr.Gör. Ön Değ.'!C30,FIND(\" \",'Öğr.Gör. Ön Değ.'!C30)+1,2)&REPT(\"*\",3)))","v":"Ör***"},{"$f":"IF('Öğr.Gör. Ön Değ.'!D30=\"\",\"\",IF(ISERR(FIND(\" \",'Öğr.Gör. Ön Değ.'!D30))=TRUE,LEFT('Öğr.Gör. Ön Değ.'!D30,2)&REPT(\"*\",3),LEFT('Öğr.Gör. Ön Değ.'!D30,2)&REPT(\"*\",3)&\" \"&MID('Öğr.Gör. Ön Değ.'!D30,FIND(\" \",'Öğr.Gör. Ön Değ.'!D30)+1,2)&REPT(\"*\",3)))","v":"Ör***"},{"$f":"IF('Öğr.Gör. Ön Değ.'!E30=\"\",\"\",'Öğr.Gör. Ön Değ.'!E30)","v":80},{"$f":"IF('Öğr.Gör. Ön Değ.'!F30=\"\",\"\",'Öğr.Gör. Ön Değ.'!F30)","v":45},{"$f":"IF('Öğr.Gör. Ön Değ.'!G30=\"\",\"\",'Öğr.Gör. Ön Değ.'!G30)","v":"Mevcut"},{"$f":"IF('Öğr.Gör. Ön Değ.'!H30=\"\",\"\",'Öğr.Gör. Ön Değ.'!H30)","v":"Uygun Değil"},{"$f":"IF('Öğr.Gör. Ön Değ.'!I30=\"\",\"\",'Öğr.Gör. Ön Değ.'!I30)","v":48},{"$f":"IF('Öğr.Gör. Ön Değ.'!J30=\"\",\"\",'Öğr.Gör. Ön Değ.'!J30)","v":18},{"$f":"IF('Öğr.Gör. Ön Değ.'!K30=\"\",\"\",'Öğr.Gör. Ön Değ.'!K30)","v":66},{"$f":"IF('Öğr.Gör. Ön Değ.'!L30=\"\",\"\",'Öğr.Gör. Ön Değ.'!L30)","v":"Başvuru Şartını Sağlamıyor (Yabancı Dil Puanı Yetersiz)"}]
[{"$f":"IF('Öğr.Gör. Ön Değ.'!A31=\"\",\"\",'Öğr.Gör. Ön Değ.'!A31)","v":""},{"$f":"IF('Öğr.Gör. Ön Değ.'!B31=\"\",\"\",LEFT('Öğr.Gör. Ön Değ.'!B31,3)&REPT(\"*\",4)&RIGHT('Öğr.Gör. Ön Değ.'!B31,2))","v":""},{"$f":"IF('Öğr.Gör. Ön Değ.'!C31=\"\",\"\",IF(ISERR(FIND(\" \",'Öğr.Gör. Ön Değ.'!C31))=TRUE,LEFT('Öğr.Gör. Ön Değ.'!C31,2)&REPT(\"*\",3),LEFT('Öğr.Gör. Ön Değ.'!C31,2)&REPT(\"*\",3)&\" \"&MID('Öğr.Gör. Ön Değ.'!C31,FIND(\" \",'Öğr.Gör. Ön Değ.'!C31)+1,2)&REPT(\"*\",3)))","v":""},{"$f":"IF('Öğr.Gör. Ön Değ.'!D31=\"\",\"\",IF(ISERR(FIND(\" \",'Öğr.Gör. Ön Değ.'!D31))=TRUE,LEFT('Öğr.Gör. Ön Değ.'!D31,2)&REPT(\"*\",3),LEFT('Öğr.Gör. Ön Değ.'!D31,2)&REPT(\"*\",3)&\" \"&MID('Öğr.Gör. Ön Değ.'!D31,FIND(\" \",'Öğr.Gör. Ön Değ.'!D31)+1,2)&REPT(\"*\",3)))","v":""},{"$f":"IF('Öğr.Gör. Ön Değ.'!E31=\"\",\"\",'Öğr.Gör. Ön Değ.'!E31)","v":""},{"$f":"IF('Öğr.Gör. Ön Değ.'!F31=\"\",\"\",'Öğr.Gör. Ön Değ.'!F31)","v":""},{"$f":"IF('Öğr.Gör. Ön Değ.'!G31=\"\",\"\",'Öğr.Gör. Ön Değ.'!G31)","v":""},{"$f":"IF('Öğr.Gör. Ön Değ.'!H31=\"\",\"\",'Öğr.Gör. Ön Değ.'!H31)","v":""},{"$f":"IF('Öğr.Gör. Ön Değ.'!I31=\"\",\"\",'Öğr.Gör. Ön Değ.'!I31)","v":""},{"$f":"IF('Öğr.Gör. Ön Değ.'!J31=\"\",\"\",'Öğr.Gör. Ön Değ.'!J31)","v":""},{"$f":"IF('Öğr.Gör. Ön Değ.'!K31=\"\",\"\",'Öğr.Gör. Ön Değ.'!K31)","v":""},{"$f":"IF('Öğr.Gör. Ön Değ.'!L31=\"\",\"\",'Öğr.Gör. Ön Değ.'!L31)","v":""}]
[{"$f":"IF('Öğr.Gör. Ön Değ.'!A32=\"\",\"\",'Öğr.Gör. Ön Değ.'!A32)","v":""},{"$f":"IF('Öğr.Gör. Ön Değ.'!B32=\"\",\"\",LEFT('Öğr.Gör. Ön Değ.'!B32,3)&REPT(\"*\",4)&RIGHT('Öğr.Gör. Ön Değ.'!B32,2))","v":""},{"$f":"IF('Öğr.Gör. Ön Değ.'!C32=\"\",\"\",IF(ISERR(FIND(\" \",'Öğr.Gör. Ön Değ.'!C32))=TRUE,LEFT('Öğr.Gör. Ön Değ.'!C32,2)&REPT(\"*\",3),LEFT('Öğr.Gör. Ön Değ.'!C32,2)&REPT(\"*\",3)&\" \"&MID('Öğr.Gör. Ön Değ.'!C32,FIND(\" \",'Öğr.Gör. Ön Değ.'!C32)+1,2)&REPT(\"*\",3)))","v":""},{"$f":"IF('Öğr.Gör. Ön Değ.'!D32=\"\",\"\",IF(ISERR(FIND(\" \",'Öğr.Gör. Ön Değ.'!D32))=TRUE,LEFT('Öğr.Gör. Ön Değ.'!D32,2)&REPT(\"*\",3),LEFT('Öğr.Gör. Ön Değ.'!D32,2)&REPT(\"*\",3)&\" \"&MID('Öğr.Gör. Ön Değ.'!D32,FIND(\" \",'Öğr.Gör. Ön Değ.'!D32)+1,2)&REPT(\"*\",3)))","v":""},{"$f":"IF('Öğr.Gör. Ön Değ.'!E32=\"\",\"\",'Öğr.Gör. Ön Değ.'!E32)","v":""},{"$f":"IF('Öğr.Gör. Ön Değ.'!F32=\"\",\"\",'Öğr.Gör. Ön Değ.'!F32)","v":""},{"$f":"IF('Öğr.Gör. Ön Değ.'!G32=\"\",\"\",'Öğr.Gör. Ön Değ.'!G32)","v":""},{"$f":"IF('Öğr.Gör. Ön Değ.'!H32=\"\",\"\",'Öğr.Gör. Ön Değ.'!H32)","v":""},{"$f":"IF('Öğr.Gör. Ön Değ.'!I32=\"\",\"\",'Öğr.Gör. Ön Değ.'!I32)","v":""},{"$f":"IF('Öğr.Gör. Ön Değ.'!J32=\"\",\"\",'Öğr.Gör. Ön Değ.'!J32)","v":""},{"$f":"IF('Öğr.Gör. Ön Değ.'!K32=\"\",\"\",'Öğr.Gör. Ön Değ.'!K32)","v":""},{"$f":"IF('Öğr.Gör. Ön Değ.'!L32=\"\",\"\",'Öğr.Gör. Ön Değ.'!L32)","v":""}]
[{"$f":"IF('Öğr.Gör. Ön Değ.'!A33=\"\",\"\",'Öğr.Gör. Ön Değ.'!A33)","v":""},{"$f":"IF('Öğr.Gör. Ön Değ.'!B33=\"\",\"\",LEFT('Öğr.Gör. Ön Değ.'!B33,3)&REPT(\"*\",4)&RIGHT('Öğr.Gör. Ön Değ.'!B33,2))","v":""},{"$f":"IF('Öğr.Gör. Ön Değ.'!C33=\"\",\"\",IF(ISERR(FIND(\" \",'Öğr.Gör. Ön Değ.'!C33))=TRUE,LEFT('Öğr.Gör. Ön Değ.'!C33,2)&REPT(\"*\",3),LEFT('Öğr.Gör. Ön Değ.'!C33,2)&REPT(\"*\",3)&\" \"&MID('Öğr.Gör. Ön Değ.'!C33,FIND(\" \",'Öğr.Gör. Ön Değ.'!C33)+1,2)&REPT(\"*\",3)))","v":""},{"$f":"IF('Öğr.Gör. Ön Değ.'!D33=\"\",\"\",IF(ISERR(FIND(\" \",'Öğr.Gör. Ön Değ.'!D33))=TRUE,LEFT('Öğr.Gör. Ön Değ.'!D33,2)&REPT(\"*\",3),LEFT('Öğr.Gör. Ön Değ.'!D33,2)&REPT(\"*\",3)&\" \"&MID('Öğr.Gör. Ön Değ.'!D33,FIND(\" \",'Öğr.Gör. Ön Değ.'!D33)+1,2)&REPT(\"*\",3)))","v":""},{"$f":"IF('Öğr.Gör. Ön Değ.'!E33=\"\",\"\",'Öğr.Gör. Ön Değ.'!E33)","v":""},{"$f":"IF('Öğr.Gör. Ön Değ.'!F33=\"\",\"\",'Öğr.Gör. Ön Değ.'!F33)","v":""},{"$f":"IF('Öğr.Gör. Ön Değ.'!G33=\"\",\"\",'Öğr.Gör. Ön Değ.'!G33)","v":""},{"$f":"IF('Öğr.Gör. Ön Değ.'!H33=\"\",\"\",'Öğr.Gör. Ön Değ.'!H33)","v":""},{"$f":"IF('Öğr.Gör. Ön Değ.'!I33=\"\",\"\",'Öğr.Gör. Ön Değ.'!I33)","v":""},{"$f":"IF('Öğr.Gör. Ön Değ.'!J33=\"\",\"\",'Öğr.Gör. Ön Değ.'!J33)","v":""},{"$f":"IF('Öğr.Gör. Ön Değ.'!K33=\"\",\"\",'Öğr.Gör. Ön Değ.'!K33)","v":""},{"$f":"IF('Öğr.Gör. Ön Değ.'!L33=\"\",\"\",'Öğr.Gör. Ön Değ.'!L33)","v":""}]
[{"$f":"IF('Öğr.Gör. Ön Değ.'!A34=\"\",\"\",'Öğr.Gör. Ön Değ.'!A34)","v":""},{"$f":"IF('Öğr.Gör. Ön Değ.'!B34=\"\",\"\",LEFT('Öğr.Gör. Ön Değ.'!B34,3)&REPT(\"*\",4)&RIGHT('Öğr.Gör. Ön Değ.'!B34,2))","v":""},{"$f":"IF('Öğr.Gör. Ön Değ.'!C34=\"\",\"\",IF(ISERR(FIND(\" \",'Öğr.Gör. Ön Değ.'!C34))=TRUE,LEFT('Öğr.Gör. Ön Değ.'!C34,2)&REPT(\"*\",3),LEFT('Öğr.Gör. Ön Değ.'!C34,2)&REPT(\"*\",3)&\" \"&MID('Öğr.Gör. Ön Değ.'!C34,FIND(\" \",'Öğr.Gör. Ön Değ.'!C34)+1,2)&REPT(\"*\",3)))","v":""},{"$f":"IF('Öğr.Gör. Ön Değ.'!D34=\"\",\"\",IF(ISERR(FIND(\" \",'Öğr.Gör. Ön Değ.'!D34))=TRUE,LEFT('Öğr.Gör. Ön Değ.'!D34,2)&REPT(\"*\",3),LEFT('Öğr.Gör. Ön Değ.'!D34,2)&REPT(\"*\",3)&\" \"&MID('Öğr.Gör. Ön Değ.'!D34,FIND(\" \",'Öğr.Gör. Ön Değ.'!D34)+1,2)&REPT(\"*\",3)))","v":""},{"$f":"IF('Öğr.Gör. Ön Değ.'!E34=\"\",\"\",'Öğr.Gör. Ön Değ.'!E34)","v":""},{"$f":"IF('Öğr.Gör. Ön Değ.'!F34=\"\",\"\",'Öğr.Gör. Ön Değ.'!F34)","v":""},{"$f":"IF('Öğr.Gör. Ön Değ.'!G34=\"\",\"\",'Öğr.Gör. Ön Değ.'!G34)","v":""},{"$f":"IF('Öğr.Gör. Ön Değ.'!H34=\"\",\"\",'Öğr.Gör. Ön Değ.'!H34)","v":""},{"$f":"IF('Öğr.Gör. Ön Değ.'!I34=\"\",\"\",'Öğr.Gör. Ön Değ.'!I34)","v":""},{"$f":"IF('Öğr.Gör. Ön Değ.'!J34=\"\",\"\",'Öğr.Gör. Ön Değ.'!J34)","v":""},{"$f":"IF('Öğr.Gör. Ön Değ.'!K34=\"\",\"\",'Öğr.Gör. Ön Değ.'!K34)","v":""},{"$f":"IF('Öğr.Gör. Ön Değ.'!L34=\"\",\"\",'Öğr.Gör. Ön Değ.'!L34)","v":""}]
[{"$f":"IF('Öğr.Gör. Ön Değ.'!A35=\"\",\"\",'Öğr.Gör. Ön Değ.'!A35)","v":""},{"$f":"IF('Öğr.Gör. Ön Değ.'!B35=\"\",\"\",LEFT('Öğr.Gör. Ön Değ.'!B35,3)&REPT(\"*\",4)&RIGHT('Öğr.Gör. Ön Değ.'!B35,2))","v":""},{"$f":"IF('Öğr.Gör. Ön Değ.'!C35=\"\",\"\",IF(ISERR(FIND(\" \",'Öğr.Gör. Ön Değ.'!C35))=TRUE,LEFT('Öğr.Gör. Ön Değ.'!C35,2)&REPT(\"*\",3),LEFT('Öğr.Gör. Ön Değ.'!C35,2)&REPT(\"*\",3)&\" \"&MID('Öğr.Gör. Ön Değ.'!C35,FIND(\" \",'Öğr.Gör. Ön Değ.'!C35)+1,2)&REPT(\"*\",3)))","v":""},{"$f":"IF('Öğr.Gör. Ön Değ.'!D35=\"\",\"\",IF(ISERR(FIND(\" \",'Öğr.Gör. Ön Değ.'!D35))=TRUE,LEFT('Öğr.Gör. Ön Değ.'!D35,2)&REPT(\"*\",3),LEFT('Öğr.Gör. Ön Değ.'!D35,2)&REPT(\"*\",3)&\" \"&MID('Öğr.Gör. Ön Değ.'!D35,FIND(\" \",'Öğr.Gör. Ön Değ.'!D35)+1,2)&REPT(\"*\",3)))","v":""},{"$f":"IF('Öğr.Gör. Ön Değ.'!E35=\"\",\"\",'Öğr.Gör. Ön Değ.'!E35)","v":""},{"$f":"IF('Öğr.Gör. Ön Değ.'!F35=\"\",\"\",'Öğr.Gör. Ön Değ.'!F35)","v":""},{"$f":"IF('Öğr.Gör. Ön Değ.'!G35=\"\",\"\",'Öğr.Gör. Ön Değ.'!G35)","v":""},{"$f":"IF('Öğr.Gör. Ön Değ.'!H35=\"\",\"\",'Öğr.Gör. Ön Değ.'!H35)","v":""},{"$f":"IF('Öğr.Gör. Ön Değ.'!I35=\"\",\"\",'Öğr.Gör. Ön Değ.'!I35)","v":""},{"$f":"IF('Öğr.Gör. Ön Değ.'!J35=\"\",\"\",'Öğr.Gör. Ön Değ.'!J35)","v":""},{"$f":"IF('Öğr.Gör. Ön Değ.'!K35=\"\",\"\",'Öğr.Gör. Ön Değ.'!K35)","v":""},{"$f":"IF('Öğr.Gör. Ön Değ.'!L35=\"\",\"\",'Öğr.Gör. Ön Değ.'!L35)","v":""}]
[{"$f":"IF('Öğr.Gör. Ön Değ.'!A36=\"\",\"\",'Öğr.Gör. Ön Değ.'!A36)","v":""},{"$f":"IF('Öğr.Gör. Ön Değ.'!B36=\"\",\"\",LEFT('Öğr.Gör. Ön Değ.'!B36,3)&REPT(\"*\",4)&RIGHT('Öğr.Gör. Ön Değ.'!B36,2))","v":""},{"$f":"IF('Öğr.Gör. Ön Değ.'!C36=\"\",\"\",IF(ISERR(FIND(\" \",'Öğr.Gör. Ön Değ.'!C36))=TRUE,LEFT('Öğr.Gör. Ön Değ.'!C36,2)&REPT(\"*\",3),LEFT('Öğr.Gör. Ön Değ.'!C36,2)&REPT(\"*\",3)&\" \"&MID('Öğr.Gör. Ön Değ.'!C36,FIND(\" \",'Öğr.Gör. Ön Değ.'!C36)+1,2)&REPT(\"*\",3)))","v":""},{"$f":"IF('Öğr.Gör. Ön Değ.'!D36=\"\",\"\",IF(ISERR(FIND(\" \",'Öğr.Gör. Ön Değ.'!D36))=TRUE,LEFT('Öğr.Gör. Ön Değ.'!D36,2)&REPT(\"*\",3),LEFT('Öğr.Gör. Ön Değ.'!D36,2)&REPT(\"*\",3)&\" \"&MID('Öğr.Gör. Ön Değ.'!D36,FIND(\" \",'Öğr.Gör. Ön Değ.'!D36)+1,2)&REPT(\"*\",3)))","v":""},{"$f":"IF('Öğr.Gör. Ön Değ.'!E36=\"\",\"\",'Öğr.Gör. Ön Değ.'!E36)","v":""},{"$f":"IF('Öğr.Gör. Ön Değ.'!F36=\"\",\"\",'Öğr.Gör. Ön Değ.'!F36)","v":""},{"$f":"IF('Öğr.Gör. Ön Değ.'!G36=\"\",\"\",'Öğr.Gör. Ön Değ.'!G36)","v":""},{"$f":"IF('Öğr.Gör. Ön Değ.'!H36=\"\",\"\",'Öğr.Gör. Ön Değ.'!H36)","v":""},{"$f":"IF('Öğr.Gör. Ön Değ.'!I36=\"\",\"\",'Öğr.Gör. Ön Değ.'!I36)","v":""},{"$f":"IF('Öğr.Gör. Ön Değ.'!J36=\"\",\"\",'Öğr.Gör. Ön Değ.'!J36)","v":""},{"$f":"IF('Öğr.Gör. Ön Değ.'!K36=\"\",\"\",'Öğr.Gör. Ön Değ.'!K36)","v":""},{"$f":"IF('Öğr.Gör. Ön Değ.'!L36=\"\",\"\",'Öğr.Gör. Ön Değ.'!L36)","v":""}]
[{"$f":"IF('Öğr.Gör. Ön Değ.'!A37=\"\",\"\",'Öğr.Gör. Ön Değ.'!A37)","v":""},{"$f":"IF('Öğr.Gör. Ön Değ.'!B37=\"\",\"\",LEFT('Öğr.Gör. Ön Değ.'!B37,3)&REPT(\"*\",4)&RIGHT('Öğr.Gör. Ön Değ.'!B37,2))","v":""},{"$f":"IF('Öğr.Gör. Ön Değ.'!C37=\"\",\"\",IF(ISERR(FIND(\" \",'Öğr.Gör. Ön Değ.'!C37))=TRUE,LEFT('Öğr.Gör. Ön Değ.'!C37,2)&REPT(\"*\",3),LEFT('Öğr.Gör. Ön Değ.'!C37,2)&REPT(\"*\",3)&\" \"&MID('Öğr.Gör. Ön Değ.'!C37,FIND(\" \",'Öğr.Gör. Ön Değ.'!C37)+1,2)&REPT(\"*\",3)))","v":""},{"$f":"IF('Öğr.Gör. Ön Değ.'!D37=\"\",\"\",IF(ISERR(FIND(\" \",'Öğr.Gör. Ön Değ.'!D37))=TRUE,LEFT('Öğr.Gör. Ön Değ.'!D37,2)&REPT(\"*\",3),LEFT('Öğr.Gör. Ön Değ.'!D37,2)&REPT(\"*\",3)&\" \"&MID('Öğr.Gör. Ön Değ.'!D37,FIND(\" \",'Öğr.Gör. Ön Değ.'!D37)+1,2)&REPT(\"*\",3)))","v":""},{"$f":"IF('Öğr.Gör. Ön Değ.'!E37=\"\",\"\",'Öğr.Gör. Ön Değ.'!E37)","v":""},{"$f":"IF('Öğr.Gör. Ön Değ.'!F37=\"\",\"\",'Öğr.Gör. Ön Değ.'!F37)","v":""},{"$f":"IF('Öğr.Gör. Ön Değ.'!G37=\"\",\"\",'Öğr.Gör. Ön Değ.'!G37)","v":""},{"$f":"IF('Öğr.Gör. Ön Değ.'!H37=\"\",\"\",'Öğr.Gör. Ön Değ.'!H37)","v":""},{"$f":"IF('Öğr.Gör. Ön Değ.'!I37=\"\",\"\",'Öğr.Gör. Ön Değ.'!I37)","v":""},{"$f":"IF('Öğr.Gör. Ön Değ.'!J37=\"\",\"\",'Öğr.Gör. Ön Değ.'!J37)","v":""},{"$f":"IF('Öğr.Gör. Ön Değ.'!K37=\"\",\"\",'Öğr.Gör. Ön Değ.'!K37)","v":""},{"$f":"IF('Öğr.Gör. Ön Değ.'!L37=\"\",\"\",'Öğr.Gör. Ön Değ.'!L37)","v":""}]
[{"$f":"IF('Öğr.Gör. Ön Değ.'!A38=\"\",\"\",'Öğr.Gör. Ön Değ.'!A38)","v":""},{"$f":"IF('Öğr.Gör. Ön Değ.'!B38=\"\",\"\",LEFT('Öğr.Gör. Ön Değ.'!B38,3)&REPT(\"*\",4)&RIGHT('Öğr.Gör. Ön Değ.'!B38,2))","v":""},{"$f":"IF('Öğr.Gör. Ön Değ.'!C38=\"\",\"\",IF(ISERR(FIND(\" \",'Öğr.Gör. Ön Değ.'!C38))=TRUE,LEFT('Öğr.Gör. Ön Değ.'!C38,2)&REPT(\"*\",3),LEFT('Öğr.Gör. Ön Değ.'!C38,2)&REPT(\"*\",3)&\" \"&MID('Öğr.Gör. Ön Değ.'!C38,FIND(\" \",'Öğr.Gör. Ön Değ.'!C38)+1,2)&REPT(\"*\",3)))","v":""},{"$f":"IF('Öğr.Gör. Ön Değ.'!D38=\"\",\"\",IF(ISERR(FIND(\" \",'Öğr.Gör. Ön Değ.'!D38))=TRUE,LEFT('Öğr.Gör. Ön Değ.'!D38,2)&REPT(\"*\",3),LEFT('Öğr.Gör. Ön Değ.'!D38,2)&REPT(\"*\",3)&\" \"&MID('Öğr.Gör. Ön Değ.'!D38,FIND(\" \",'Öğr.Gör. Ön Değ.'!D38)+1,2)&REPT(\"*\",3)))","v":""},{"$f":"IF('Öğr.Gör. Ön Değ.'!E38=\"\",\"\",'Öğr.Gör. Ön Değ.'!E38)","v":""},{"$f":"IF('Öğr.Gör. Ön Değ.'!F38=\"\",\"\",'Öğr.Gör. Ön Değ.'!F38)","v":""},{"$f":"IF('Öğr.Gör. Ön Değ.'!G38=\"\",\"\",'Öğr.Gör. Ön Değ.'!G38)","v":""},{"$f":"IF('Öğr.Gör. Ön Değ.'!H38=\"\",\"\",'Öğr.Gör. Ön Değ.'!H38)","v":""},{"$f":"IF('Öğr.Gör. Ön Değ.'!I38=\"\",\"\",'Öğr.Gör. Ön Değ.'!I38)","v":""},{"$f":"IF('Öğr.Gör. Ön Değ.'!J38=\"\",\"\",'Öğr.Gör. Ön Değ.'!J38)","v":""},{"$f":"IF('Öğr.Gör. Ön Değ.'!K38=\"\",\"\",'Öğr.Gör. Ön Değ.'!K38)","v":""},{"$f":"IF('Öğr.Gör. Ön Değ.'!L38=\"\",\"\",'Öğr.Gör. Ön Değ.'!L38)","v":""}]
[{"$f":"IF('Öğr.Gör. Ön Değ.'!A39=\"\",\"\",'Öğr.Gör. Ön Değ.'!A39)","v":""},{"$f":"IF('Öğr.Gör. Ön Değ.'!B39=\"\",\"\",LEFT('Öğr.Gör. Ön Değ.'!B39,3)&REPT(\"*\",4)&RIGHT('Öğr.Gör. Ön Değ.'!B39,2))","v":""},{"$f":"IF('Öğr.Gör. Ön Değ.'!C39=\"\",\"\",IF(ISERR(FIND(\" \",'Öğr.Gör. Ön Değ.'!C39))=TRUE,LEFT('Öğr.Gör. Ön Değ.'!C39,2)&REPT(\"*\",3),LEFT('Öğr.Gör. Ön Değ.'!C39,2)&REPT(\"*\",3)&\" \"&MID('Öğr.Gör. Ön Değ.'!C39,FIND(\" \",'Öğr.Gör. Ön Değ.'!C39)+1,2)&REPT(\"*\",3)))","v":""},{"$f":"IF('Öğr.Gör. Ön Değ.'!D39=\"\",\"\",IF(ISERR(FIND(\" \",'Öğr.Gör. Ön Değ.'!D39))=TRUE,LEFT('Öğr.Gör. Ön Değ.'!D39,2)&REPT(\"*\",3),LEFT('Öğr.Gör. Ön Değ.'!D39,2)&REPT(\"*\",3)&\" \"&MID('Öğr.Gör. Ön Değ.'!D39,FIND(\" \",'Öğr.Gör. Ön Değ.'!D39)+1,2)&REPT(\"*\",3)))","v":""},{"$f":"IF('Öğr.Gör. Ön Değ.'!E39=\"\",\"\",'Öğr.Gör. Ön Değ.'!E39)","v":""},{"$f":"IF('Öğr.Gör. Ön Değ.'!F39=\"\",\"\",'Öğr.Gör. Ön Değ.'!F39)","v":""},{"$f":"IF('Öğr.Gör. Ön Değ.'!G39=\"\",\"\",'Öğr.Gör. Ön Değ.'!G39)","v":""},{"$f":"IF('Öğr.Gör. Ön Değ.'!H39=\"\",\"\",'Öğr.Gör. Ön Değ.'!H39)","v":""},{"$f":"IF('Öğr.Gör. Ön Değ.'!I39=\"\",\"\",'Öğr.Gör. Ön Değ.'!I39)","v":""},{"$f":"IF('Öğr.Gör. Ön Değ.'!J39=\"\",\"\",'Öğr.Gör. Ön Değ.'!J39)","v":""},{"$f":"IF('Öğr.Gör. Ön Değ.'!K39=\"\",\"\",'Öğr.Gör. Ön Değ.'!K39)","v":""},{"$f":"IF('Öğr.Gör. Ön Değ.'!L39=\"\",\"\",'Öğr.Gör. Ön Değ.'!L39)","v":""}]
[{"$f":"IF('Öğr.Gör. Ön Değ.'!A40=\"\",\"\",'Öğr.Gör. Ön Değ.'!A40)","v":""},{"$f":"IF('Öğr.Gör. Ön Değ.'!B40=\"\",\"\",LEFT('Öğr.Gör. Ön Değ.'!B40,3)&REPT(\"*\",4)&RIGHT('Öğr.Gör. Ön Değ.'!B40,2))","v":""},{"$f":"IF('Öğr.Gör. Ön Değ.'!C40=\"\",\"\",IF(ISERR(FIND(\" \",'Öğr.Gör. Ön Değ.'!C40))=TRUE,LEFT('Öğr.Gör. Ön Değ.'!C40,2)&REPT(\"*\",3),LEFT('Öğr.Gör. Ön Değ.'!C40,2)&REPT(\"*\",3)&\" \"&MID('Öğr.Gör. Ön Değ.'!C40,FIND(\" \",'Öğr.Gör. Ön Değ.'!C40)+1,2)&REPT(\"*\",3)))","v":""},{"$f":"IF('Öğr.Gör. Ön Değ.'!D40=\"\",\"\",IF(ISERR(FIND(\" \",'Öğr.Gör. Ön Değ.'!D40))=TRUE,LEFT('Öğr.Gör. Ön Değ.'!D40,2)&REPT(\"*\",3),LEFT('Öğr.Gör. Ön Değ.'!D40,2)&REPT(\"*\",3)&\" \"&MID('Öğr.Gör. Ön Değ.'!D40,FIND(\" \",'Öğr.Gör. Ön Değ.'!D40)+1,2)&REPT(\"*\",3)))","v":""},{"$f":"IF('Öğr.Gör. Ön Değ.'!E40=\"\",\"\",'Öğr.Gör. Ön Değ.'!E40)","v":""},{"$f":"IF('Öğr.Gör. Ön Değ.'!F40=\"\",\"\",'Öğr.Gör. Ön Değ.'!F40)","v":""},{"$f":"IF('Öğr.Gör. Ön Değ.'!G40=\"\",\"\",'Öğr.Gör. Ön Değ.'!G40)","v":""},{"$f":"IF('Öğr.Gör. Ön Değ.'!H40=\"\",\"\",'Öğr.Gör. Ön Değ.'!H40)","v":""},{"$f":"IF('Öğr.Gör. Ön Değ.'!I40=\"\",\"\",'Öğr.Gör. Ön Değ.'!I40)","v":""},{"$f":"IF('Öğr.Gör. Ön Değ.'!J40=\"\",\"\",'Öğr.Gör. Ön Değ.'!J40)","v":""},{"$f":"IF('Öğr.Gör. Ön Değ.'!K40=\"\",\"\",'Öğr.Gör. Ön Değ.'!K40)","v":""},{"$f":"IF('Öğr.Gör. Ön Değ.'!L40=\"\",\"\",'Öğr.Gör. Ön Değ.'!L40)","v":""}]
[{"$f":"IF('Öğr.Gör. Ön Değ.'!A41=\"\",\"\",'Öğr.Gör. Ön Değ.'!A41)","v":""},{"$f":"IF('Öğr.Gör. Ön Değ.'!B41=\"\",\"\",LEFT('Öğr.Gör. Ön Değ.'!B41,3)&REPT(\"*\",4)&RIGHT('Öğr.Gör. Ön Değ.'!B41,2))","v":""},{"$f":"IF('Öğr.Gör. Ön Değ.'!C41=\"\",\"\",IF(ISERR(FIND(\" \",'Öğr.Gör. Ön Değ.'!C41))=TRUE,LEFT('Öğr.Gör. Ön Değ.'!C41,2)&REPT(\"*\",3),LEFT('Öğr.Gör. Ön Değ.'!C41,2)&REPT(\"*\",3)&\" \"&MID('Öğr.Gör. Ön Değ.'!C41,FIND(\" \",'Öğr.Gör. Ön Değ.'!C41)+1,2)&REPT(\"*\",3)))","v":""},{"$f":"IF('Öğr.Gör. Ön Değ.'!D41=\"\",\"\",IF(ISERR(FIND(\" \",'Öğr.Gör. Ön Değ.'!D41))=TRUE,LEFT('Öğr.Gör. Ön Değ.'!D41,2)&REPT(\"*\",3),LEFT('Öğr.Gör. Ön Değ.'!D41,2)&REPT(\"*\",3)&\" \"&MID('Öğr.Gör. Ön Değ.'!D41,FIND(\" \",'Öğr.Gör. Ön Değ.'!D41)+1,2)&REPT(\"*\",3)))","v":""},{"$f":"IF('Öğr.Gör. Ön Değ.'!E41=\"\",\"\",'Öğr.Gör. Ön Değ.'!E41)","v":""},{"$f":"IF('Öğr.Gör. Ön Değ.'!F41=\"\",\"\",'Öğr.Gör. Ön Değ.'!F41)","v":""},{"$f":"IF('Öğr.Gör. Ön Değ.'!G41=\"\",\"\",'Öğr.Gör. Ön Değ.'!G41)","v":""},{"$f":"IF('Öğr.Gör. Ön Değ.'!H41=\"\",\"\",'Öğr.Gör. Ön Değ.'!H41)","v":""},{"$f":"IF('Öğr.Gör. Ön Değ.'!I41=\"\",\"\",'Öğr.Gör. Ön Değ.'!I41)","v":""},{"$f":"IF('Öğr.Gör. Ön Değ.'!J41=\"\",\"\",'Öğr.Gör. Ön Değ.'!J41)","v":""},{"$f":"IF('Öğr.Gör. Ön Değ.'!K41=\"\",\"\",'Öğr.Gör. Ön Değ.'!K41)","v":""},{"$f":"IF('Öğr.Gör. Ön Değ.'!L41=\"\",\"\",'Öğr.Gör. Ön Değ.'!L41)","v":""}]
[{"$f":"IF('Öğr.Gör. Ön Değ.'!A42=\"\",\"\",'Öğr.Gör. Ön Değ.'!A42)","v":""},{"$f":"IF('Öğr.Gör. Ön Değ.'!B42=\"\",\"\",LEFT('Öğr.Gör. Ön Değ.'!B42,3)&REPT(\"*\",4)&RIGHT('Öğr.Gör. Ön Değ.'!B42,2))","v":""},{"$f":"IF('Öğr.Gör. Ön Değ.'!C42=\"\",\"\",IF(ISERR(FIND(\" \",'Öğr.Gör. Ön Değ.'!C42))=TRUE,LEFT('Öğr.Gör. Ön Değ.'!C42,2)&REPT(\"*\",3),LEFT('Öğr.Gör. Ön Değ.'!C42,2)&REPT(\"*\",3)&\" \"&MID('Öğr.Gör. Ön Değ.'!C42,FIND(\" \",'Öğr.Gör. Ön Değ.'!C42)+1,2)&REPT(\"*\",3)))","v":""},{"$f":"IF('Öğr.Gör. Ön Değ.'!D42=\"\",\"\",IF(ISERR(FIND(\" \",'Öğr.Gör. Ön Değ.'!D42))=TRUE,LEFT('Öğr.Gör. Ön Değ.'!D42,2)&REPT(\"*\",3),LEFT('Öğr.Gör. Ön Değ.'!D42,2)&REPT(\"*\",3)&\" \"&MID('Öğr.Gör. Ön Değ.'!D42,FIND(\" \",'Öğr.Gör. Ön Değ.'!D42)+1,2)&REPT(\"*\",3)))","v":""},{"$f":"IF('Öğr.Gör. Ön Değ.'!E42=\"\",\"\",'Öğr.Gör. Ön Değ.'!E42)","v":""},{"$f":"IF('Öğr.Gör. Ön Değ.'!F42=\"\",\"\",'Öğr.Gör. Ön Değ.'!F42)","v":""},{"$f":"IF('Öğr.Gör. Ön Değ.'!G42=\"\",\"\",'Öğr.Gör. Ön Değ.'!G42)","v":""},{"$f":"IF('Öğr.Gör. Ön Değ.'!H42=\"\",\"\",'Öğr.Gör. Ön Değ.'!H42)","v":""},{"$f":"IF('Öğr.Gör. Ön Değ.'!I42=\"\",\"\",'Öğr.Gör. Ön Değ.'!I42)","v":""},{"$f":"IF('Öğr.Gör. Ön Değ.'!J42=\"\",\"\",'Öğr.Gör. Ön Değ.'!J42)","v":""},{"$f":"IF('Öğr.Gör. Ön Değ.'!K42=\"\",\"\",'Öğr.Gör. Ön Değ.'!K42)","v":""},{"$f":"IF('Öğr.Gör. Ön Değ.'!L42=\"\",\"\",'Öğr.Gör. Ön Değ.'!L42)","v":""}]
[{"$f":"IF('Öğr.Gör. Ön Değ.'!A43=\"\",\"\",'Öğr.Gör. Ön Değ.'!A43)","v":""},{"$f":"IF('Öğr.Gör. Ön Değ.'!B43=\"\",\"\",LEFT('Öğr.Gör. Ön Değ.'!B43,3)&REPT(\"*\",4)&RIGHT('Öğr.Gör. Ön Değ.'!B43,2))","v":""},{"$f":"IF('Öğr.Gör. Ön Değ.'!C43=\"\",\"\",IF(ISERR(FIND(\" \",'Öğr.Gör. Ön Değ.'!C43))=TRUE,LEFT('Öğr.Gör. Ön Değ.'!C43,2)&REPT(\"*\",3),LEFT('Öğr.Gör. Ön Değ.'!C43,2)&REPT(\"*\",3)&\" \"&MID('Öğr.Gör. Ön Değ.'!C43,FIND(\" \",'Öğr.Gör. Ön Değ.'!C43)+1,2)&REPT(\"*\",3)))","v":""},{"$f":"IF('Öğr.Gör. Ön Değ.'!D43=\"\",\"\",IF(ISERR(FIND(\" \",'Öğr.Gör. Ön Değ.'!D43))=TRUE,LEFT('Öğr.Gör. Ön Değ.'!D43,2)&REPT(\"*\",3),LEFT('Öğr.Gör. Ön Değ.'!D43,2)&REPT(\"*\",3)&\" \"&MID('Öğr.Gör. Ön Değ.'!D43,FIND(\" \",'Öğr.Gör. Ön Değ.'!D43)+1,2)&REPT(\"*\",3)))","v":""},{"$f":"IF('Öğr.Gör. Ön Değ.'!E43=\"\",\"\",'Öğr.Gör. Ön Değ.'!E43)","v":""},{"$f":"IF('Öğr.Gör. Ön Değ.'!F43=\"\",\"\",'Öğr.Gör. Ön Değ.'!F43)","v":""},{"$f":"IF('Öğr.Gör. Ön Değ.'!G43=\"\",\"\",'Öğr.Gör. Ön Değ.'!G43)","v":""},{"$f":"IF('Öğr.Gör. Ön Değ.'!H43=\"\",\"\",'Öğr.Gör. Ön Değ.'!H43)","v":""},{"$f":"IF('Öğr.Gör. Ön Değ.'!I43=\"\",\"\",'Öğr.Gör. Ön Değ.'!I43)","v":""},{"$f":"IF('Öğr.Gör. Ön Değ.'!J43=\"\",\"\",'Öğr.Gör. Ön Değ.'!J43)","v":""},{"$f":"IF('Öğr.Gör. Ön Değ.'!K43=\"\",\"\",'Öğr.Gör. Ön Değ.'!K43)","v":""},{"$f":"IF('Öğr.Gör. Ön Değ.'!L43=\"\",\"\",'Öğr.Gör. Ön Değ.'!L43)","v":""}]
[{"$f":"IF('Öğr.Gör. Ön Değ.'!A44=\"\",\"\",'Öğr.Gör. Ön Değ.'!A44)","v":""},{"$f":"IF('Öğr.Gör. Ön Değ.'!B44=\"\",\"\",LEFT('Öğr.Gör. Ön Değ.'!B44,3)&REPT(\"*\",4)&RIGHT('Öğr.Gör. Ön Değ.'!B44,2))","v":""},{"$f":"IF('Öğr.Gör. Ön Değ.'!C44=\"\",\"\",IF(ISERR(FIND(\" \",'Öğr.Gör. Ön Değ.'!C44))=TRUE,LEFT('Öğr.Gör. Ön Değ.'!C44,2)&REPT(\"*\",3),LEFT('Öğr.Gör. Ön Değ.'!C44,2)&REPT(\"*\",3)&\" \"&MID('Öğr.Gör. Ön Değ.'!C44,FIND(\" \",'Öğr.Gör. Ön Değ.'!C44)+1,2)&REPT(\"*\",3)))","v":""},{"$f":"IF('Öğr.Gör. Ön Değ.'!D44=\"\",\"\",IF(ISERR(FIND(\" \",'Öğr.Gör. Ön Değ.'!D44))=TRUE,LEFT('Öğr.Gör. Ön Değ.'!D44,2)&REPT(\"*\",3),LEFT('Öğr.Gör. Ön Değ.'!D44,2)&REPT(\"*\",3)&\" \"&MID('Öğr.Gör. Ön Değ.'!D44,FIND(\" \",'Öğr.Gör. Ön Değ.'!D44)+1,2)&REPT(\"*\",3)))","v":""},{"$f":"IF('Öğr.Gör. Ön Değ.'!E44=\"\",\"\",'Öğr.Gör. Ön Değ.'!E44)","v":""},{"$f":"IF('Öğr.Gör. Ön Değ.'!F44=\"\",\"\",'Öğr.Gör. Ön Değ.'!F44)","v":""},{"$f":"IF('Öğr.Gör. Ön Değ.'!G44=\"\",\"\",'Öğr.Gör. Ön Değ.'!G44)","v":""},{"$f":"IF('Öğr.Gör. Ön Değ.'!H44=\"\",\"\",'Öğr.Gör. Ön Değ.'!H44)","v":""},{"$f":"IF('Öğr.Gör. Ön Değ.'!I44=\"\",\"\",'Öğr.Gör. Ön Değ.'!I44)","v":""},{"$f":"IF('Öğr.Gör. Ön Değ.'!J44=\"\",\"\",'Öğr.Gör. Ön Değ.'!J44)","v":""},{"$f":"IF('Öğr.Gör. Ön Değ.'!K44=\"\",\"\",'Öğr.Gör. Ön Değ.'!K44)","v":""},{"$f":"IF('Öğr.Gör. Ön Değ.'!L44=\"\",\"\",'Öğr.Gör. Ön Değ.'!L44)","v":""}]
[{"$f":"IF('Öğr.Gör. Ön Değ.'!A45=\"\",\"\",'Öğr.Gör. Ön Değ.'!A45)","v":""},{"$f":"IF('Öğr.Gör. Ön Değ.'!B45=\"\",\"\",LEFT('Öğr.Gör. Ön Değ.'!B45,3)&REPT(\"*\",4)&RIGHT('Öğr.Gör. Ön Değ.'!B45,2))","v":""},{"$f":"IF('Öğr.Gör. Ön Değ.'!C45=\"\",\"\",IF(ISERR(FIND(\" \",'Öğr.Gör. Ön Değ.'!C45))=TRUE,LEFT('Öğr.Gör. Ön Değ.'!C45,2)&REPT(\"*\",3),LEFT('Öğr.Gör. Ön Değ.'!C45,2)&REPT(\"*\",3)&\" \"&MID('Öğr.Gör. Ön Değ.'!C45,FIND(\" \",'Öğr.Gör. Ön Değ.'!C45)+1,2)&REPT(\"*\",3)))","v":""},{"$f":"IF('Öğr.Gör. Ön Değ.'!D45=\"\",\"\",IF(ISERR(FIND(\" \",'Öğr.Gör. Ön Değ.'!D45))=TRUE,LEFT('Öğr.Gör. Ön Değ.'!D45,2)&REPT(\"*\",3),LEFT('Öğr.Gör. Ön Değ.'!D45,2)&REPT(\"*\",3)&\" \"&MID('Öğr.Gör. Ön Değ.'!D45,FIND(\" \",'Öğr.Gör. Ön Değ.'!D45)+1,2)&REPT(\"*\",3)))","v":""},{"$f":"IF('Öğr.Gör. Ön Değ.'!E45=\"\",\"\",'Öğr.Gör. Ön Değ.'!E45)","v":""},{"$f":"IF('Öğr.Gör. Ön Değ.'!F45=\"\",\"\",'Öğr.Gör. Ön Değ.'!F45)","v":""},{"$f":"IF('Öğr.Gör. Ön Değ.'!G45=\"\",\"\",'Öğr.Gör. Ön Değ.'!G45)","v":""},{"$f":"IF('Öğr.Gör. Ön Değ.'!H45=\"\",\"\",'Öğr.Gör. Ön Değ.'!H45)","v":""},{"$f":"IF('Öğr.Gör. Ön Değ.'!I45=\"\",\"\",'Öğr.Gör. Ön Değ.'!I45)","v":""},{"$f":"IF('Öğr.Gör. Ön Değ.'!J45=\"\",\"\",'Öğr.Gör. Ön Değ.'!J45)","v":""},{"$f":"IF('Öğr.Gör. Ön Değ.'!K45=\"\",\"\",'Öğr.Gör. Ön Değ.'!K45)","v":""},{"$f":"IF('Öğr.Gör. Ön Değ.'!L45=\"\",\"\",'Öğr.Gör. Ön Değ.'!L45)","v":""}]
[{"$f":"IF('Öğr.Gör. Ön Değ.'!A46=\"\",\"\",'Öğr.Gör. Ön Değ.'!A46)","v":""},{"$f":"IF('Öğr.Gör. Ön Değ.'!B46=\"\",\"\",LEFT('Öğr.Gör. Ön Değ.'!B46,3)&REPT(\"*\",4)&RIGHT('Öğr.Gör. Ön Değ.'!B46,2))","v":""},{"$f":"IF('Öğr.Gör. Ön Değ.'!C46=\"\",\"\",IF(ISERR(FIND(\" \",'Öğr.Gör. Ön Değ.'!C46))=TRUE,LEFT('Öğr.Gör. Ön Değ.'!C46,2)&REPT(\"*\",3),LEFT('Öğr.Gör. Ön Değ.'!C46,2)&REPT(\"*\",3)&\" \"&MID('Öğr.Gör. Ön Değ.'!C46,FIND(\" \",'Öğr.Gör. Ön Değ.'!C46)+1,2)&REPT(\"*\",3)))","v":""},{"$f":"IF('Öğr.Gör. Ön Değ.'!D46=\"\",\"\",IF(ISERR(FIND(\" \",'Öğr.Gör. Ön Değ.'!D46))=TRUE,LEFT('Öğr.Gör. Ön Değ.'!D46,2)&REPT(\"*\",3),LEFT('Öğr.Gör. Ön Değ.'!D46,2)&REPT(\"*\",3)&\" \"&MID('Öğr.Gör. Ön Değ.'!D46,FIND(\" \",'Öğr.Gör. Ön Değ.'!D46)+1,2)&REPT(\"*\",3)))","v":""},{"$f":"IF('Öğr.Gör. Ön Değ.'!E46=\"\",\"\",'Öğr.Gör. Ön Değ.'!E46)","v":""},{"$f":"IF('Öğr.Gör. Ön Değ.'!F46=\"\",\"\",'Öğr.Gör. Ön Değ.'!F46)","v":""},{"$f":"IF('Öğr.Gör. Ön Değ.'!G46=\"\",\"\",'Öğr.Gör. Ön Değ.'!G46)","v":""},{"$f":"IF('Öğr.Gör. Ön Değ.'!H46=\"\",\"\",'Öğr.Gör. Ön Değ.'!H46)","v":""},{"$f":"IF('Öğr.Gör. Ön Değ.'!I46=\"\",\"\",'Öğr.Gör. Ön Değ.'!I46)","v":""},{"$f":"IF('Öğr.Gör. Ön Değ.'!J46=\"\",\"\",'Öğr.Gör. Ön Değ.'!J46)","v":""},{"$f":"IF('Öğr.Gör. Ön Değ.'!K46=\"\",\"\",'Öğr.Gör. Ön Değ.'!K46)","v":""},{"$f":"IF('Öğr.Gör. Ön Değ.'!L46=\"\",\"\",'Öğr.Gör. Ön Değ.'!L46)","v":""}]
[{"$f":"IF('Öğr.Gör. Ön Değ.'!A47=\"\",\"\",'Öğr.Gör. Ön Değ.'!A47)","v":""},{"$f":"IF('Öğr.Gör. Ön Değ.'!B47=\"\",\"\",LEFT('Öğr.Gör. Ön Değ.'!B47,3)&REPT(\"*\",4)&RIGHT('Öğr.Gör. Ön Değ.'!B47,2))","v":""},{"$f":"IF('Öğr.Gör. Ön Değ.'!C47=\"\",\"\",IF(ISERR(FIND(\" \",'Öğr.Gör. Ön Değ.'!C47))=TRUE,LEFT('Öğr.Gör. Ön Değ.'!C47,2)&REPT(\"*\",3),LEFT('Öğr.Gör. Ön Değ.'!C47,2)&REPT(\"*\",3)&\" \"&MID('Öğr.Gör. Ön Değ.'!C47,FIND(\" \",'Öğr.Gör. Ön Değ.'!C47)+1,2)&REPT(\"*\",3)))","v":""},{"$f":"IF('Öğr.Gör. Ön Değ.'!D47=\"\",\"\",IF(ISERR(FIND(\" \",'Öğr.Gör. Ön Değ.'!D47))=TRUE,LEFT('Öğr.Gör. Ön Değ.'!D47,2)&REPT(\"*\",3),LEFT('Öğr.Gör. Ön Değ.'!D47,2)&REPT(\"*\",3)&\" \"&MID('Öğr.Gör. Ön Değ.'!D47,FIND(\" \",'Öğr.Gör. Ön Değ.'!D47)+1,2)&REPT(\"*\",3)))","v":""},{"$f":"IF('Öğr.Gör. Ön Değ.'!E47=\"\",\"\",'Öğr.Gör. Ön Değ.'!E47)","v":""},{"$f":"IF('Öğr.Gör. Ön Değ.'!F47=\"\",\"\",'Öğr.Gör. Ön Değ.'!F47)","v":""},{"$f":"IF('Öğr.Gör. Ön Değ.'!G47=\"\",\"\",'Öğr.Gör. Ön Değ.'!G47)","v":""},{"$f":"IF('Öğr.Gör. Ön Değ.'!H47=\"\",\"\",'Öğr.Gör. Ön Değ.'!H47)","v":""},{"$f":"IF('Öğr.Gör. Ön Değ.'!I47=\"\",\"\",'Öğr.Gör. Ön Değ.'!I47)","v":""},{"$f":"IF('Öğr.Gör. Ön Değ.'!J47=\"\",\"\",'Öğr.Gör. Ön Değ.'!J47)","v":""},{"$f":"IF('Öğr.Gör. Ön Değ.'!K47=\"\",\"\",'Öğr.Gör. Ön Değ.'!K47)","v":""},{"$f":"IF('Öğr.Gör. Ön Değ.'!L47=\"\",\"\",'Öğr.Gör. Ön Değ.'!L47)","v":""}]
[{"$f":"IF('Öğr.Gör. Ön Değ.'!A48=\"\",\"\",'Öğr.Gör. Ön Değ.'!A48)","v":""},{"$f":"IF('Öğr.Gör. Ön Değ.'!B48=\"\",\"\",LEFT('Öğr.Gör. Ön Değ.'!B48,3)&REPT(\"*\",4)&RIGHT('Öğr.Gör. Ön Değ.'!B48,2))","v":""},{"$f":"IF('Öğr.Gör. Ön Değ.'!C48=\"\",\"\",IF(ISERR(FIND(\" \",'Öğr.Gör. Ön Değ.'!C48))=TRUE,LEFT('Öğr.Gör. Ön Değ.'!C48,2)&REPT(\"*\",3),LEFT('Öğr.Gör. Ön Değ.'!C48,2)&REPT(\"*\",3)&\" \"&MID('Öğr.Gör. Ön Değ.'!C48,FIND(\" \",'Öğr.Gör. Ön Değ.'!C48)+1,2)&REPT(\"*\",3)))","v":""},{"$f":"IF('Öğr.Gör. Ön Değ.'!D48=\"\",\"\",IF(ISERR(FIND(\" \",'Öğr.Gör. Ön Değ.'!D48))=TRUE,LEFT('Öğr.Gör. Ön Değ.'!D48,2)&REPT(\"*\",3),LEFT('Öğr.Gör. Ön Değ.'!D48,2)&REPT(\"*\",3)&\" \"&MID('Öğr.Gör. Ön Değ.'!D48,FIND(\" \",'Öğr.Gör. Ön Değ.'!D48)+1,2)&REPT(\"*\",3)))","v":""},{"$f":"IF('Öğr.Gör. Ön Değ.'!E48=\"\",\"\",'Öğr.Gör. Ön Değ.'!E48)","v":""},{"$f":"IF('Öğr.Gör. Ön Değ.'!F48=\"\",\"\",'Öğr.Gör. Ön Değ.'!F48)","v":""},{"$f":"IF('Öğr.Gör. Ön Değ.'!G48=\"\",\"\",'Öğr.Gör. Ön Değ.'!G48)","v":""},{"$f":"IF('Öğr.Gör. Ön Değ.'!H48=\"\",\"\",'Öğr.Gör. Ön Değ.'!H48)","v":""},{"$f":"IF('Öğr.Gör. Ön Değ.'!I48=\"\",\"\",'Öğr.Gör. Ön Değ.'!I48)","v":""},{"$f":"IF('Öğr.Gör. Ön Değ.'!J48=\"\",\"\",'Öğr.Gör. Ön Değ.'!J48)","v":""},{"$f":"IF('Öğr.Gör. Ön Değ.'!K48=\"\",\"\",'Öğr.Gör. Ön Değ.'!K48)","v":""},{"$f":"IF('Öğr.Gör. Ön Değ.'!L48=\"\",\"\",'Öğr.Gör. Ön Değ.'!L48)","v":""}]
[{"$f":"IF('Öğr.Gör. Ön Değ.'!A49=\"\",\"\",'Öğr.Gör. Ön Değ.'!A49)","v":""},{"$f":"IF('Öğr.Gör. Ön Değ.'!B49=\"\",\"\",LEFT('Öğr.Gör. Ön Değ.'!B49,3)&REPT(\"*\",4)&RIGHT('Öğr.Gör. Ön Değ.'!B49,2))","v":""},{"$f":"IF('Öğr.Gör. Ön Değ.'!C49=\"\",\"\",IF(ISERR(FIND(\" \",'Öğr.Gör. Ön Değ.'!C49))=TRUE,LEFT('Öğr.Gör. Ön Değ.'!C49,2)&REPT(\"*\",3),LEFT('Öğr.Gör. Ön Değ.'!C49,2)&REPT(\"*\",3)&\" \"&MID('Öğr.Gör. Ön Değ.'!C49,FIND(\" \",'Öğr.Gör. Ön Değ.'!C49)+1,2)&REPT(\"*\",3)))","v":""},{"$f":"IF('Öğr.Gör. Ön Değ.'!D49=\"\",\"\",IF(ISERR(FIND(\" \",'Öğr.Gör. Ön Değ.'!D49))=TRUE,LEFT('Öğr.Gör. Ön Değ.'!D49,2)&REPT(\"*\",3),LEFT('Öğr.Gör. Ön Değ.'!D49,2)&REPT(\"*\",3)&\" \"&MID('Öğr.Gör. Ön Değ.'!D49,FIND(\" \",'Öğr.Gör. Ön Değ.'!D49)+1,2)&REPT(\"*\",3)))","v":""},{"$f":"IF('Öğr.Gör. Ön Değ.'!E49=\"\",\"\",'Öğr.Gör. Ön Değ.'!E49)","v":""},{"$f":"IF('Öğr.Gör. Ön Değ.'!F49=\"\",\"\",'Öğr.Gör. Ön Değ.'!F49)","v":""},{"$f":"IF('Öğr.Gör. Ön Değ.'!G49=\"\",\"\",'Öğr.Gör. Ön Değ.'!G49)","v":""},{"$f":"IF('Öğr.Gör. Ön Değ.'!H49=\"\",\"\",'Öğr.Gör. Ön Değ.'!H49)","v":""},{"$f":"IF('Öğr.Gör. Ön Değ.'!I49=\"\",\"\",'Öğr.Gör. Ön Değ.'!I49)","v":""},{"$f":"IF('Öğr.Gör. Ön Değ.'!J49=\"\",\"\",'Öğr.Gör. Ön Değ.'!J49)","v":""},{"$f":"IF('Öğr.Gör. Ön Değ.'!K49=\"\",\"\",'Öğr.Gör. Ön Değ.'!K49)","v":""},{"$f":"IF('Öğr.Gör. Ön Değ.'!L49=\"\",\"\",'Öğr.Gör. Ön Değ.'!L49)","v":""}]
[{"$f":"IF('Öğr.Gör. Ön Değ.'!A50=\"\",\"\",'Öğr.Gör. Ön Değ.'!A50)","v":""},{"$f":"IF('Öğr.Gör. Ön Değ.'!B50=\"\",\"\",LEFT('Öğr.Gör. Ön Değ.'!B50,3)&REPT(\"*\",4)&RIGHT('Öğr.Gör. Ön Değ.'!B50,2))","v":""},{"$f":"IF('Öğr.Gör. Ön Değ.'!C50=\"\",\"\",IF(ISERR(FIND(\" \",'Öğr.Gör. Ön Değ.'!C50))=TRUE,LEFT('Öğr.Gör. Ön Değ.'!C50,2)&REPT(\"*\",3),LEFT('Öğr.Gör. Ön Değ.'!C50,2)&REPT(\"*\",3)&\" \"&MID('Öğr.Gör. Ön Değ.'!C50,FIND(\" \",'Öğr.Gör. Ön Değ.'!C50)+1,2)&REPT(\"*\",3)))","v":""},{"$f":"IF('Öğr.Gör. Ön Değ.'!D50=\"\",\"\",IF(ISERR(FIND(\" \",'Öğr.Gör. Ön Değ.'!D50))=TRUE,LEFT('Öğr.Gör. Ön Değ.'!D50,2)&REPT(\"*\",3),LEFT('Öğr.Gör. Ön Değ.'!D50,2)&REPT(\"*\",3)&\" \"&MID('Öğr.Gör. Ön Değ.'!D50,FIND(\" \",'Öğr.Gör. Ön Değ.'!D50)+1,2)&REPT(\"*\",3)))","v":""},{"$f":"IF('Öğr.Gör. Ön Değ.'!E50=\"\",\"\",'Öğr.Gör. Ön Değ.'!E50)","v":""},{"$f":"IF('Öğr.Gör. Ön Değ.'!F50=\"\",\"\",'Öğr.Gör. Ön Değ.'!F50)","v":""},{"$f":"IF('Öğr.Gör. Ön Değ.'!G50=\"\",\"\",'Öğr.Gör. Ön Değ.'!G50)","v":""},{"$f":"IF('Öğr.Gör. Ön Değ.'!H50=\"\",\"\",'Öğr.Gör. Ön Değ.'!H50)","v":""},{"$f":"IF('Öğr.Gör. Ön Değ.'!I50=\"\",\"\",'Öğr.Gör. Ön Değ.'!I50)","v":""},{"$f":"IF('Öğr.Gör. Ön Değ.'!J50=\"\",\"\",'Öğr.Gör. Ön Değ.'!J50)","v":""},{"$f":"IF('Öğr.Gör. Ön Değ.'!K50=\"\",\"\",'Öğr.Gör. Ön Değ.'!K50)","v":""},{"$f":"IF('Öğr.Gör. Ön Değ.'!L50=\"\",\"\",'Öğr.Gör. Ön Değ.'!L50)","v":""}]
[{"$f":"IF('Öğr.Gör. Ön Değ.'!A51=\"\",\"\",'Öğr.Gör. Ön Değ.'!A51)","v":""},{"$f":"IF('Öğr.Gör. Ön Değ.'!B51=\"\",\"\",LEFT('Öğr.Gör. Ön Değ.'!B51,3)&REPT(\"*\",4)&RIGHT('Öğr.Gör. Ön Değ.'!B51,2))","v":""},{"$f":"IF('Öğr.Gör. Ön Değ.'!C51=\"\",\"\",IF(ISERR(FIND(\" \",'Öğr.Gör. Ön Değ.'!C51))=TRUE,LEFT('Öğr.Gör. Ön Değ.'!C51,2)&REPT(\"*\",3),LEFT('Öğr.Gör. Ön Değ.'!C51,2)&REPT(\"*\",3)&\" \"&MID('Öğr.Gör. Ön Değ.'!C51,FIND(\" \",'Öğr.Gör. Ön Değ.'!C51)+1,2)&REPT(\"*\",3)))","v":""},{"$f":"IF('Öğr.Gör. Ön Değ.'!D51=\"\",\"\",IF(ISERR(FIND(\" \",'Öğr.Gör. Ön Değ.'!D51))=TRUE,LEFT('Öğr.Gör. Ön Değ.'!D51,2)&REPT(\"*\",3),LEFT('Öğr.Gör. Ön Değ.'!D51,2)&REPT(\"*\",3)&\" \"&MID('Öğr.Gör. Ön Değ.'!D51,FIND(\" \",'Öğr.Gör. Ön Değ.'!D51)+1,2)&REPT(\"*\",3)))","v":""},{"$f":"IF('Öğr.Gör. Ön Değ.'!E51=\"\",\"\",'Öğr.Gör. Ön Değ.'!E51)","v":""},{"$f":"IF('Öğr.Gör. Ön Değ.'!F51=\"\",\"\",'Öğr.Gör. Ön Değ.'!F51)","v":""},{"$f":"IF('Öğr.Gör. Ön Değ.'!G51=\"\",\"\",'Öğr.Gör. Ön Değ.'!G51)","v":""},{"$f":"IF('Öğr.Gör. Ön Değ.'!H51=\"\",\"\",'Öğr.Gör. Ön Değ.'!H51)","v":""},{"$f":"IF('Öğr.Gör. Ön Değ.'!I51=\"\",\"\",'Öğr.Gör. Ön Değ.'!I51)","v":""},{"$f":"IF('Öğr.Gör. Ön Değ.'!J51=\"\",\"\",'Öğr.Gör. Ön Değ.'!J51)","v":""},{"$f":"IF('Öğr.Gör. Ön Değ.'!K51=\"\",\"\",'Öğr.Gör. Ön Değ.'!K51)","v":""},{"$f":"IF('Öğr.Gör. Ön Değ.'!L51=\"\",\"\",'Öğr.Gör. Ön Değ.'!L51)","v":""}]
[{"$f":"IF('Öğr.Gör. Ön Değ.'!A52=\"\",\"\",'Öğr.Gör. Ön Değ.'!A52)","v":""},{"$f":"IF('Öğr.Gör. Ön Değ.'!B52=\"\",\"\",LEFT('Öğr.Gör. Ön Değ.'!B52,3)&REPT(\"*\",4)&RIGHT('Öğr.Gör. Ön Değ.'!B52,2))","v":""},{"$f":"IF('Öğr.Gör. Ön Değ.'!C52=\"\",\"\",IF(ISERR(FIND(\" \",'Öğr.Gör. Ön Değ.'!C52))=TRUE,LEFT('Öğr.Gör. Ön Değ.'!C52,2)&REPT(\"*\",3),LEFT('Öğr.Gör. Ön Değ.'!C52,2)&REPT(\"*\",3)&\" \"&MID('Öğr.Gör. Ön Değ.'!C52,FIND(\" \",'Öğr.Gör. Ön Değ.'!C52)+1,2)&REPT(\"*\",3)))","v":""},{"$f":"IF('Öğr.Gör. Ön Değ.'!D52=\"\",\"\",IF(ISERR(FIND(\" \",'Öğr.Gör. Ön Değ.'!D52))=TRUE,LEFT('Öğr.Gör. Ön Değ.'!D52,2)&REPT(\"*\",3),LEFT('Öğr.Gör. Ön Değ.'!D52,2)&REPT(\"*\",3)&\" \"&MID('Öğr.Gör. Ön Değ.'!D52,FIND(\" \",'Öğr.Gör. Ön Değ.'!D52)+1,2)&REPT(\"*\",3)))","v":""},{"$f":"IF('Öğr.Gör. Ön Değ.'!E52=\"\",\"\",'Öğr.Gör. Ön Değ.'!E52)","v":""},{"$f":"IF('Öğr.Gör. Ön Değ.'!F52=\"\",\"\",'Öğr.Gör. Ön Değ.'!F52)","v":""},{"$f":"IF('Öğr.Gör. Ön Değ.'!G52=\"\",\"\",'Öğr.Gör. Ön Değ.'!G52)","v":""},{"$f":"IF('Öğr.Gör. Ön Değ.'!H52=\"\",\"\",'Öğr.Gör. Ön Değ.'!H52)","v":""},{"$f":"IF('Öğr.Gör. Ön Değ.'!I52=\"\",\"\",'Öğr.Gör. Ön Değ.'!I52)","v":""},{"$f":"IF('Öğr.Gör. Ön Değ.'!J52=\"\",\"\",'Öğr.Gör. Ön Değ.'!J52)","v":""},{"$f":"IF('Öğr.Gör. Ön Değ.'!K52=\"\",\"\",'Öğr.Gör. Ön Değ.'!K52)","v":""},{"$f":"IF('Öğr.Gör. Ön Değ.'!L52=\"\",\"\",'Öğr.Gör. Ön Değ.'!L52)","v":""}]
[{"$f":"IF('Öğr.Gör. Ön Değ.'!A53=\"\",\"\",'Öğr.Gör. Ön Değ.'!A53)","v":""},{"$f":"IF('Öğr.Gör. Ön Değ.'!B53=\"\",\"\",LEFT('Öğr.Gör. Ön Değ.'!B53,3)&REPT(\"*\",4)&RIGHT('Öğr.Gör. Ön Değ.'!B53,2))","v":""},{"$f":"IF('Öğr.Gör. Ön Değ.'!C53=\"\",\"\",IF(ISERR(FIND(\" \",'Öğr.Gör. Ön Değ.'!C53))=TRUE,LEFT('Öğr.Gör. Ön Değ.'!C53,2)&REPT(\"*\",3),LEFT('Öğr.Gör. Ön Değ.'!C53,2)&REPT(\"*\",3)&\" \"&MID('Öğr.Gör. Ön Değ.'!C53,FIND(\" \",'Öğr.Gör. Ön Değ.'!C53)+1,2)&REPT(\"*\",3)))","v":""},{"$f":"IF('Öğr.Gör. Ön Değ.'!D53=\"\",\"\",IF(ISERR(FIND(\" \",'Öğr.Gör. Ön Değ.'!D53))=TRUE,LEFT('Öğr.Gör. Ön Değ.'!D53,2)&REPT(\"*\",3),LEFT('Öğr.Gör. Ön Değ.'!D53,2)&REPT(\"*\",3)&\" \"&MID('Öğr.Gör. Ön Değ.'!D53,FIND(\" \",'Öğr.Gör. Ön Değ.'!D53)+1,2)&REPT(\"*\",3)))","v":""},{"$f":"IF('Öğr.Gör. Ön Değ.'!E53=\"\",\"\",'Öğr.Gör. Ön Değ.'!E53)","v":""},{"$f":"IF('Öğr.Gör. Ön Değ.'!F53=\"\",\"\",'Öğr.Gör. Ön Değ.'!F53)","v":""},{"$f":"IF('Öğr.Gör. Ön Değ.'!G53=\"\",\"\",'Öğr.Gör. Ön Değ.'!G53)","v":""},{"$f":"IF('Öğr.Gör. Ön Değ.'!H53=\"\",\"\",'Öğr.Gör. Ön Değ.'!H53)","v":""},{"$f":"IF('Öğr.Gör. Ön Değ.'!I53=\"\",\"\",'Öğr.Gör. Ön Değ.'!I53)","v":""},{"$f":"IF('Öğr.Gör. Ön Değ.'!J53=\"\",\"\",'Öğr.Gör. Ön Değ.'!J53)","v":""},{"$f":"IF('Öğr.Gör. Ön Değ.'!K53=\"\",\"\",'Öğr.Gör. Ön Değ.'!K53)","v":""},{"$f":"IF('Öğr.Gör. Ön Değ.'!L53=\"\",\"\",'Öğr.Gör. Ön Değ.'!L53)","v":""}]
[{"$f":"IF('Öğr.Gör. Ön Değ.'!A54=\"\",\"\",'Öğr.Gör. Ön Değ.'!A54)","v":""},{"$f":"IF('Öğr.Gör. Ön Değ.'!B54=\"\",\"\",LEFT('Öğr.Gör. Ön Değ.'!B54,3)&REPT(\"*\",4)&RIGHT('Öğr.Gör. Ön Değ.'!B54,2))","v":""},{"$f":"IF('Öğr.Gör. Ön Değ.'!C54=\"\",\"\",IF(ISERR(FIND(\" \",'Öğr.Gör. Ön Değ.'!C54))=TRUE,LEFT('Öğr.Gör. Ön Değ.'!C54,2)&REPT(\"*\",3),LEFT('Öğr.Gör. Ön Değ.'!C54,2)&REPT(\"*\",3)&\" \"&MID('Öğr.Gör. Ön Değ.'!C54,FIND(\" \",'Öğr.Gör. Ön Değ.'!C54)+1,2)&REPT(\"*\",3)))","v":""},{"$f":"IF('Öğr.Gör. Ön Değ.'!D54=\"\",\"\",IF(ISERR(FIND(\" \",'Öğr.Gör. Ön Değ.'!D54))=TRUE,LEFT('Öğr.Gör. Ön Değ.'!D54,2)&REPT(\"*\",3),LEFT('Öğr.Gör. Ön Değ.'!D54,2)&REPT(\"*\",3)&\" \"&MID('Öğr.Gör. Ön Değ.'!D54,FIND(\" \",'Öğr.Gör. Ön Değ.'!D54)+1,2)&REPT(\"*\",3)))","v":""},{"$f":"IF('Öğr.Gör. Ön Değ.'!E54=\"\",\"\",'Öğr.Gör. Ön Değ.'!E54)","v":""},{"$f":"IF('Öğr.Gör. Ön Değ.'!F54=\"\",\"\",'Öğr.Gör. Ön Değ.'!F54)","v":""},{"$f":"IF('Öğr.Gör. Ön Değ.'!G54=\"\",\"\",'Öğr.Gör. Ön Değ.'!G54)","v":""},{"$f":"IF('Öğr.Gör. Ön Değ.'!H54=\"\",\"\",'Öğr.Gör. Ön Değ.'!H54)","v":""},{"$f":"IF('Öğr.Gör. Ön Değ.'!I54=\"\",\"\",'Öğr.Gör. Ön Değ.'!I54)","v":""},{"$f":"IF('Öğr.Gör. Ön Değ.'!J54=\"\",\"\",'Öğr.Gör. Ön Değ.'!J54)","v":""},{"$f":"IF('Öğr.Gör. Ön Değ.'!K54=\"\",\"\",'Öğr.Gör. Ön Değ.'!K54)","v":""},{"$f":"IF('Öğr.Gör. Ön Değ.'!L54=\"\",\"\",'Öğr.Gör. Ön Değ.'!L54)","v":""}]
[{"$f":"IF('Öğr.Gör. Ön Değ.'!A55=\"\",\"\",'Öğr.Gör. Ön Değ.'!A55)","v":""},{"$f":"IF('Öğr.Gör. Ön Değ.'!B55=\"\",\"\",LEFT('Öğr.Gör. Ön Değ.'!B55,3)&REPT(\"*\",4)&RIGHT('Öğr.Gör. Ön Değ.'!B55,2))","v":""},{"$f":"IF('Öğr.Gör. Ön Değ.'!C55=\"\",\"\",IF(ISERR(FIND(\" \",'Öğr.Gör. Ön Değ.'!C55))=TRUE,LEFT('Öğr.Gör. Ön Değ.'!C55,2)&REPT(\"*\",3),LEFT('Öğr.Gör. Ön Değ.'!C55,2)&REPT(\"*\",3)&\" \"&MID('Öğr.Gör. Ön Değ.'!C55,FIND(\" \",'Öğr.Gör. Ön Değ.'!C55)+1,2)&REPT(\"*\",3)))","v":""},{"$f":"IF('Öğr.Gör. Ön Değ.'!D55=\"\",\"\",IF(ISERR(FIND(\" \",'Öğr.Gör. Ön Değ.'!D55))=TRUE,LEFT('Öğr.Gör. Ön Değ.'!D55,2)&REPT(\"*\",3),LEFT('Öğr.Gör. Ön Değ.'!D55,2)&REPT(\"*\",3)&\" \"&MID('Öğr.Gör. Ön Değ.'!D55,FIND(\" \",'Öğr.Gör. Ön Değ.'!D55)+1,2)&REPT(\"*\",3)))","v":""},{"$f":"IF('Öğr.Gör. Ön Değ.'!E55=\"\",\"\",'Öğr.Gör. Ön Değ.'!E55)","v":""},{"$f":"IF('Öğr.Gör. Ön Değ.'!F55=\"\",\"\",'Öğr.Gör. Ön Değ.'!F55)","v":""},{"$f":"IF('Öğr.Gör. Ön Değ.'!G55=\"\",\"\",'Öğr.Gör. Ön Değ.'!G55)","v":""},{"$f":"IF('Öğr.Gör. Ön Değ.'!H55=\"\",\"\",'Öğr.Gör. Ön Değ.'!H55)","v":""},{"$f":"IF('Öğr.Gör. Ön Değ.'!I55=\"\",\"\",'Öğr.Gör. Ön Değ.'!I55)","v":""},{"$f":"IF('Öğr.Gör. Ön Değ.'!J55=\"\",\"\",'Öğr.Gör. Ön Değ.'!J55)","v":""},{"$f":"IF('Öğr.Gör. Ön Değ.'!K55=\"\",\"\",'Öğr.Gör. Ön Değ.'!K55)","v":""},{"$f":"IF('Öğr.Gör. Ön Değ.'!L55=\"\",\"\",'Öğr.Gör. Ön Değ.'!L55)","v":""}]
[{"$f":"IF('Öğr.Gör. Ön Değ.'!A56=\"\",\"\",'Öğr.Gör. Ön Değ.'!A56)","v":""},{"$f":"IF('Öğr.Gör. Ön Değ.'!B56=\"\",\"\",LEFT('Öğr.Gör. Ön Değ.'!B56,3)&REPT(\"*\",4)&RIGHT('Öğr.Gör. Ön Değ.'!B56,2))","v":""},{"$f":"IF('Öğr.Gör. Ön Değ.'!C56=\"\",\"\",IF(ISERR(FIND(\" \",'Öğr.Gör. Ön Değ.'!C56))=TRUE,LEFT('Öğr.Gör. Ön Değ.'!C56,2)&REPT(\"*\",3),LEFT('Öğr.Gör. Ön Değ.'!C56,2)&REPT(\"*\",3)&\" \"&MID('Öğr.Gör. Ön Değ.'!C56,FIND(\" \",'Öğr.Gör. Ön Değ.'!C56)+1,2)&REPT(\"*\",3)))","v":""},{"$f":"IF('Öğr.Gör. Ön Değ.'!D56=\"\",\"\",IF(ISERR(FIND(\" \",'Öğr.Gör. Ön Değ.'!D56))=TRUE,LEFT('Öğr.Gör. Ön Değ.'!D56,2)&REPT(\"*\",3),LEFT('Öğr.Gör. Ön Değ.'!D56,2)&REPT(\"*\",3)&\" \"&MID('Öğr.Gör. Ön Değ.'!D56,FIND(\" \",'Öğr.Gör. Ön Değ.'!D56)+1,2)&REPT(\"*\",3)))","v":""},{"$f":"IF('Öğr.Gör. Ön Değ.'!E56=\"\",\"\",'Öğr.Gör. Ön Değ.'!E56)","v":""},{"$f":"IF('Öğr.Gör. Ön Değ.'!F56=\"\",\"\",'Öğr.Gör. Ön Değ.'!F56)","v":""},{"$f":"IF('Öğr.Gör. Ön Değ.'!G56=\"\",\"\",'Öğr.Gör. Ön Değ.'!G56)","v":""},{"$f":"IF('Öğr.Gör. Ön Değ.'!H56=\"\",\"\",'Öğr.Gör. Ön Değ.'!H56)","v":""},{"$f":"IF('Öğr.Gör. Ön Değ.'!I56=\"\",\"\",'Öğr.Gör. Ön Değ.'!I56)","v":""},{"$f":"IF('Öğr.Gör. Ön Değ.'!J56=\"\",\"\",'Öğr.Gör. Ön Değ.'!J56)","v":""},{"$f":"IF('Öğr.Gör. Ön Değ.'!K56=\"\",\"\",'Öğr.Gör. Ön Değ.'!K56)","v":""},{"$f":"IF('Öğr.Gör. Ön Değ.'!L56=\"\",\"\",'Öğr.Gör. Ön Değ.'!L56)","v":""}]
[{"$f":"IF('Öğr.Gör. Ön Değ.'!A57=\"\",\"\",'Öğr.Gör. Ön Değ.'!A57)","v":""},{"$f":"IF('Öğr.Gör. Ön Değ.'!B57=\"\",\"\",LEFT('Öğr.Gör. Ön Değ.'!B57,3)&REPT(\"*\",4)&RIGHT('Öğr.Gör. Ön Değ.'!B57,2))","v":""},{"$f":"IF('Öğr.Gör. Ön Değ.'!C57=\"\",\"\",IF(ISERR(FIND(\" \",'Öğr.Gör. Ön Değ.'!C57))=TRUE,LEFT('Öğr.Gör. Ön Değ.'!C57,2)&REPT(\"*\",3),LEFT('Öğr.Gör. Ön Değ.'!C57,2)&REPT(\"*\",3)&\" \"&MID('Öğr.Gör. Ön Değ.'!C57,FIND(\" \",'Öğr.Gör. Ön Değ.'!C57)+1,2)&REPT(\"*\",3)))","v":""},{"$f":"IF('Öğr.Gör. Ön Değ.'!D57=\"\",\"\",IF(ISERR(FIND(\" \",'Öğr.Gör. Ön Değ.'!D57))=TRUE,LEFT('Öğr.Gör. Ön Değ.'!D57,2)&REPT(\"*\",3),LEFT('Öğr.Gör. Ön Değ.'!D57,2)&REPT(\"*\",3)&\" \"&MID('Öğr.Gör. Ön Değ.'!D57,FIND(\" \",'Öğr.Gör. Ön Değ.'!D57)+1,2)&REPT(\"*\",3)))","v":""},{"$f":"IF('Öğr.Gör. Ön Değ.'!E57=\"\",\"\",'Öğr.Gör. Ön Değ.'!E57)","v":""},{"$f":"IF('Öğr.Gör. Ön Değ.'!F57=\"\",\"\",'Öğr.Gör. Ön Değ.'!F57)","v":""},{"$f":"IF('Öğr.Gör. Ön Değ.'!G57=\"\",\"\",'Öğr.Gör. Ön Değ.'!G57)","v":""},{"$f":"IF('Öğr.Gör. Ön Değ.'!H57=\"\",\"\",'Öğr.Gör. Ön Değ.'!H57)","v":""},{"$f":"IF('Öğr.Gör. Ön Değ.'!I57=\"\",\"\",'Öğr.Gör. Ön Değ.'!I57)","v":""},{"$f":"IF('Öğr.Gör. Ön Değ.'!J57=\"\",\"\",'Öğr.Gör. Ön Değ.'!J57)","v":""},{"$f":"IF('Öğr.Gör. Ön Değ.'!K57=\"\",\"\",'Öğr.Gör. Ön Değ.'!K57)","v":""},{"$f":"IF('Öğr.Gör. Ön Değ.'!L57=\"\",\"\",'Öğr.Gör. Ön Değ.'!L57)","v":""}]
[{"$f":"IF('Öğr.Gör. Ön Değ.'!A58=\"\",\"\",'Öğr.Gör. Ön Değ.'!A58)","v":""},{"$f":"IF('Öğr.Gör. Ön Değ.'!B58=\"\",\"\",LEFT('Öğr.Gör. Ön Değ.'!B58,3)&REPT(\"*\",4)&RIGHT('Öğr.Gör. Ön Değ.'!B58,2))","v":""},{"$f":"IF('Öğr.Gör. Ön Değ.'!C58=\"\",\"\",IF(ISERR(FIND(\" \",'Öğr.Gör. Ön Değ.'!C58))=TRUE,LEFT('Öğr.Gör. Ön Değ.'!C58,2)&REPT(\"*\",3),LEFT('Öğr.Gör. Ön Değ.'!C58,2)&REPT(\"*\",3)&\" \"&MID('Öğr.Gör. Ön Değ.'!C58,FIND(\" \",'Öğr.Gör. Ön Değ.'!C58)+1,2)&REPT(\"*\",3)))","v":""},{"$f":"IF('Öğr.Gör. Ön Değ.'!D58=\"\",\"\",IF(ISERR(FIND(\" \",'Öğr.Gör. Ön Değ.'!D58))=TRUE,LEFT('Öğr.Gör. Ön Değ.'!D58,2)&REPT(\"*\",3),LEFT('Öğr.Gör. Ön Değ.'!D58,2)&REPT(\"*\",3)&\" \"&MID('Öğr.Gör. Ön Değ.'!D58,FIND(\" \",'Öğr.Gör. Ön Değ.'!D58)+1,2)&REPT(\"*\",3)))","v":""},{"$f":"IF('Öğr.Gör. Ön Değ.'!E58=\"\",\"\",'Öğr.Gör. Ön Değ.'!E58)","v":""},{"$f":"IF('Öğr.Gör. Ön Değ.'!F58=\"\",\"\",'Öğr.Gör. Ön Değ.'!F58)","v":""},{"$f":"IF('Öğr.Gör. Ön Değ.'!G58=\"\",\"\",'Öğr.Gör. Ön Değ.'!G58)","v":""},{"$f":"IF('Öğr.Gör. Ön Değ.'!H58=\"\",\"\",'Öğr.Gör. Ön Değ.'!H58)","v":""},{"$f":"IF('Öğr.Gör. Ön Değ.'!I58=\"\",\"\",'Öğr.Gör. Ön Değ.'!I58)","v":""},{"$f":"IF('Öğr.Gör. Ön Değ.'!J58=\"\",\"\",'Öğr.Gör. Ön Değ.'!J58)","v":""},{"$f":"IF('Öğr.Gör. Ön Değ.'!K58=\"\",\"\",'Öğr.Gör. Ön Değ.'!K58)","v":""},{"$f":"IF('Öğr.Gör. Ön Değ.'!L58=\"\",\"\",'Öğr.Gör. Ön Değ.'!L58)","v":""}]
[{"$f":"IF('Öğr.Gör. Ön Değ.'!A59=\"\",\"\",'Öğr.Gör. Ön Değ.'!A59)","v":""},{"$f":"IF('Öğr.Gör. Ön Değ.'!B59=\"\",\"\",LEFT('Öğr.Gör. Ön Değ.'!B59,3)&REPT(\"*\",4)&RIGHT('Öğr.Gör. Ön Değ.'!B59,2))","v":""},{"$f":"IF('Öğr.Gör. Ön Değ.'!C59=\"\",\"\",IF(ISERR(FIND(\" \",'Öğr.Gör. Ön Değ.'!C59))=TRUE,LEFT('Öğr.Gör. Ön Değ.'!C59,2)&REPT(\"*\",3),LEFT('Öğr.Gör. Ön Değ.'!C59,2)&REPT(\"*\",3)&\" \"&MID('Öğr.Gör. Ön Değ.'!C59,FIND(\" \",'Öğr.Gör. Ön Değ.'!C59)+1,2)&REPT(\"*\",3)))","v":""},{"$f":"IF('Öğr.Gör. Ön Değ.'!D59=\"\",\"\",IF(ISERR(FIND(\" \",'Öğr.Gör. Ön Değ.'!D59))=TRUE,LEFT('Öğr.Gör. Ön Değ.'!D59,2)&REPT(\"*\",3),LEFT('Öğr.Gör. Ön Değ.'!D59,2)&REPT(\"*\",3)&\" \"&MID('Öğr.Gör. Ön Değ.'!D59,FIND(\" \",'Öğr.Gör. Ön Değ.'!D59)+1,2)&REPT(\"*\",3)))","v":""},{"$f":"IF('Öğr.Gör. Ön Değ.'!E59=\"\",\"\",'Öğr.Gör. Ön Değ.'!E59)","v":""},{"$f":"IF('Öğr.Gör. Ön Değ.'!F59=\"\",\"\",'Öğr.Gör. Ön Değ.'!F59)","v":""},{"$f":"IF('Öğr.Gör. Ön Değ.'!G59=\"\",\"\",'Öğr.Gör. Ön Değ.'!G59)","v":""},{"$f":"IF('Öğr.Gör. Ön Değ.'!H59=\"\",\"\",'Öğr.Gör. Ön Değ.'!H59)","v":""},{"$f":"IF('Öğr.Gör. Ön Değ.'!I59=\"\",\"\",'Öğr.Gör. Ön Değ.'!I59)","v":""},{"$f":"IF('Öğr.Gör. Ön Değ.'!J59=\"\",\"\",'Öğr.Gör. Ön Değ.'!J59)","v":""},{"$f":"IF('Öğr.Gör. Ön Değ.'!K59=\"\",\"\",'Öğr.Gör. Ön Değ.'!K59)","v":""},{"$f":"IF('Öğr.Gör. Ön Değ.'!L59=\"\",\"\",'Öğr.Gör. Ön Değ.'!L59)","v":""}]
[{"$f":"IF('Öğr.Gör. Ön Değ.'!A60=\"\",\"\",'Öğr.Gör. Ön Değ.'!A60)","v":""},{"$f":"IF('Öğr.Gör. Ön Değ.'!B60=\"\",\"\",LEFT('Öğr.Gör. Ön Değ.'!B60,3)&REPT(\"*\",4)&RIGHT('Öğr.Gör. Ön Değ.'!B60,2))","v":""},{"$f":"IF('Öğr.Gör. Ön Değ.'!C60=\"\",\"\",IF(ISERR(FIND(\" \",'Öğr.Gör. Ön Değ.'!C60))=TRUE,LEFT('Öğr.Gör. Ön Değ.'!C60,2)&REPT(\"*\",3),LEFT('Öğr.Gör. Ön Değ.'!C60,2)&REPT(\"*\",3)&\" \"&MID('Öğr.Gör. Ön Değ.'!C60,FIND(\" \",'Öğr.Gör. Ön Değ.'!C60)+1,2)&REPT(\"*\",3)))","v":""},{"$f":"IF('Öğr.Gör. Ön Değ.'!D60=\"\",\"\",IF(ISERR(FIND(\" \",'Öğr.Gör. Ön Değ.'!D60))=TRUE,LEFT('Öğr.Gör. Ön Değ.'!D60,2)&REPT(\"*\",3),LEFT('Öğr.Gör. Ön Değ.'!D60,2)&REPT(\"*\",3)&\" \"&MID('Öğr.Gör. Ön Değ.'!D60,FIND(\" \",'Öğr.Gör. Ön Değ.'!D60)+1,2)&REPT(\"*\",3)))","v":""},{"$f":"IF('Öğr.Gör. Ön Değ.'!E60=\"\",\"\",'Öğr.Gör. Ön Değ.'!E60)","v":""},{"$f":"IF('Öğr.Gör. Ön Değ.'!F60=\"\",\"\",'Öğr.Gör. Ön Değ.'!F60)","v":""},{"$f":"IF('Öğr.Gör. Ön Değ.'!G60=\"\",\"\",'Öğr.Gör. Ön Değ.'!G60)","v":""},{"$f":"IF('Öğr.Gör. Ön Değ.'!H60=\"\",\"\",'Öğr.Gör. Ön Değ.'!H60)","v":""},{"$f":"IF('Öğr.Gör. Ön Değ.'!I60=\"\",\"\",'Öğr.Gör. Ön Değ.'!I60)","v":""},{"$f":"IF('Öğr.Gör. Ön Değ.'!J60=\"\",\"\",'Öğr.Gör. Ön Değ.'!J60)","v":""},{"$f":"IF('Öğr.Gör. Ön Değ.'!K60=\"\",\"\",'Öğr.Gör. Ön Değ.'!K60)","v":""},{"$f":"IF('Öğr.Gör. Ön Değ.'!L60=\"\",\"\",'Öğr.Gör. Ön Değ.'!L60)","v":""}]
[{"$f":"IF('Öğr.Gör. Ön Değ.'!A61=\"\",\"\",'Öğr.Gör. Ön Değ.'!A61)","v":""},{"$f":"IF('Öğr.Gör. Ön Değ.'!B61=\"\",\"\",LEFT('Öğr.Gör. Ön Değ.'!B61,3)&REPT(\"*\",4)&RIGHT('Öğr.Gör. Ön Değ.'!B61,2))","v":""},{"$f":"IF('Öğr.Gör. Ön Değ.'!C61=\"\",\"\",IF(ISERR(FIND(\" \",'Öğr.Gör. Ön Değ.'!C61))=TRUE,LEFT('Öğr.Gör. Ön Değ.'!C61,2)&REPT(\"*\",3),LEFT('Öğr.Gör. Ön Değ.'!C61,2)&REPT(\"*\",3)&\" \"&MID('Öğr.Gör. Ön Değ.'!C61,FIND(\" \",'Öğr.Gör. Ön Değ.'!C61)+1,2)&REPT(\"*\",3)))","v":""},{"$f":"IF('Öğr.Gör. Ön Değ.'!D61=\"\",\"\",IF(ISERR(FIND(\" \",'Öğr.Gör. Ön Değ.'!D61))=TRUE,LEFT('Öğr.Gör. Ön Değ.'!D61,2)&REPT(\"*\",3),LEFT('Öğr.Gör. Ön Değ.'!D61,2)&REPT(\"*\",3)&\" \"&MID('Öğr.Gör. Ön Değ.'!D61,FIND(\" \",'Öğr.Gör. Ön Değ.'!D61)+1,2)&REPT(\"*\",3)))","v":""},{"$f":"IF('Öğr.Gör. Ön Değ.'!E61=\"\",\"\",'Öğr.Gör. Ön Değ.'!E61)","v":""},{"$f":"IF('Öğr.Gör. Ön Değ.'!F61=\"\",\"\",'Öğr.Gör. Ön Değ.'!F61)","v":""},{"$f":"IF('Öğr.Gör. Ön Değ.'!G61=\"\",\"\",'Öğr.Gör. Ön Değ.'!G61)","v":""},{"$f":"IF('Öğr.Gör. Ön Değ.'!H61=\"\",\"\",'Öğr.Gör. Ön Değ.'!H61)","v":""},{"$f":"IF('Öğr.Gör. Ön Değ.'!I61=\"\",\"\",'Öğr.Gör. Ön Değ.'!I61)","v":""},{"$f":"IF('Öğr.Gör. Ön Değ.'!J61=\"\",\"\",'Öğr.Gör. Ön Değ.'!J61)","v":""},{"$f":"IF('Öğr.Gör. Ön Değ.'!K61=\"\",\"\",'Öğr.Gör. Ön Değ.'!K61)","v":""},{"$f":"IF('Öğr.Gör. Ön Değ.'!L61=\"\",\"\",'Öğr.Gör. Ön Değ.'!L61)","v":""}]
[{"$f":"IF('Öğr.Gör. Ön Değ.'!A62=\"\",\"\",'Öğr.Gör. Ön Değ.'!A62)","v":""},{"$f":"IF('Öğr.Gör. Ön Değ.'!B62=\"\",\"\",LEFT('Öğr.Gör. Ön Değ.'!B62,3)&REPT(\"*\",4)&RIGHT('Öğr.Gör. Ön Değ.'!B62,2))","v":""},{"$f":"IF('Öğr.Gör. Ön Değ.'!C62=\"\",\"\",IF(ISERR(FIND(\" \",'Öğr.Gör. Ön Değ.'!C62))=TRUE,LEFT('Öğr.Gör. Ön Değ.'!C62,2)&REPT(\"*\",3),LEFT('Öğr.Gör. Ön Değ.'!C62,2)&REPT(\"*\",3)&\" \"&MID('Öğr.Gör. Ön Değ.'!C62,FIND(\" \",'Öğr.Gör. Ön Değ.'!C62)+1,2)&REPT(\"*\",3)))","v":""},{"$f":"IF('Öğr.Gör. Ön Değ.'!D62=\"\",\"\",IF(ISERR(FIND(\" \",'Öğr.Gör. Ön Değ.'!D62))=TRUE,LEFT('Öğr.Gör. Ön Değ.'!D62,2)&REPT(\"*\",3),LEFT('Öğr.Gör. Ön Değ.'!D62,2)&REPT(\"*\",3)&\" \"&MID('Öğr.Gör. Ön Değ.'!D62,FIND(\" \",'Öğr.Gör. Ön Değ.'!D62)+1,2)&REPT(\"*\",3)))","v":""},{"$f":"IF('Öğr.Gör. Ön Değ.'!E62=\"\",\"\",'Öğr.Gör. Ön Değ.'!E62)","v":""},{"$f":"IF('Öğr.Gör. Ön Değ.'!F62=\"\",\"\",'Öğr.Gör. Ön Değ.'!F62)","v":""},{"$f":"IF('Öğr.Gör. Ön Değ.'!G62=\"\",\"\",'Öğr.Gör. Ön Değ.'!G62)","v":""},{"$f":"IF('Öğr.Gör. Ön Değ.'!H62=\"\",\"\",'Öğr.Gör. Ön Değ.'!H62)","v":""},{"$f":"IF('Öğr.Gör. Ön Değ.'!I62=\"\",\"\",'Öğr.Gör. Ön Değ.'!I62)","v":""},{"$f":"IF('Öğr.Gör. Ön Değ.'!J62=\"\",\"\",'Öğr.Gör. Ön Değ.'!J62)","v":""},{"$f":"IF('Öğr.Gör. Ön Değ.'!K62=\"\",\"\",'Öğr.Gör. Ön Değ.'!K62)","v":""},{"$f":"IF('Öğr.Gör. Ön Değ.'!L62=\"\",\"\",'Öğr.Gör. Ön Değ.'!L62)","v":""}]
[{"$f":"IF('Öğr.Gör. Ön Değ.'!A63=\"\",\"\",'Öğr.Gör. Ön Değ.'!A63)","v":""},{"$f":"IF('Öğr.Gör. Ön Değ.'!B63=\"\",\"\",LEFT('Öğr.Gör. Ön Değ.'!B63,3)&REPT(\"*\",4)&RIGHT('Öğr.Gör. Ön Değ.'!B63,2))","v":""},{"$f":"IF('Öğr.Gör. Ön Değ.'!C63=\"\",\"\",IF(ISERR(FIND(\" \",'Öğr.Gör. Ön Değ.'!C63))=TRUE,LEFT('Öğr.Gör. Ön Değ.'!C63,2)&REPT(\"*\",3),LEFT('Öğr.Gör. Ön Değ.'!C63,2)&REPT(\"*\",3)&\" \"&MID('Öğr.Gör. Ön Değ.'!C63,FIND(\" \",'Öğr.Gör. Ön Değ.'!C63)+1,2)&REPT(\"*\",3)))","v":""},{"$f":"IF('Öğr.Gör. Ön Değ.'!D63=\"\",\"\",IF(ISERR(FIND(\" \",'Öğr.Gör. Ön Değ.'!D63))=TRUE,LEFT('Öğr.Gör. Ön Değ.'!D63,2)&REPT(\"*\",3),LEFT('Öğr.Gör. Ön Değ.'!D63,2)&REPT(\"*\",3)&\" \"&MID('Öğr.Gör. Ön Değ.'!D63,FIND(\" \",'Öğr.Gör. Ön Değ.'!D63)+1,2)&REPT(\"*\",3)))","v":""},{"$f":"IF('Öğr.Gör. Ön Değ.'!E63=\"\",\"\",'Öğr.Gör. Ön Değ.'!E63)","v":""},{"$f":"IF('Öğr.Gör. Ön Değ.'!F63=\"\",\"\",'Öğr.Gör. Ön Değ.'!F63)","v":""},{"$f":"IF('Öğr.Gör. Ön Değ.'!G63=\"\",\"\",'Öğr.Gör. Ön Değ.'!G63)","v":""},{"$f":"IF('Öğr.Gör. Ön Değ.'!H63=\"\",\"\",'Öğr.Gör. Ön Değ.'!H63)","v":""},{"$f":"IF('Öğr.Gör. Ön Değ.'!I63=\"\",\"\",'Öğr.Gör. Ön Değ.'!I63)","v":""},{"$f":"IF('Öğr.Gör. Ön Değ.'!J63=\"\",\"\",'Öğr.Gör. Ön Değ.'!J63)","v":""},{"$f":"IF('Öğr.Gör. Ön Değ.'!K63=\"\",\"\",'Öğr.Gör. Ön Değ.'!K63)","v":""},{"$f":"IF('Öğr.Gör. Ön Değ.'!L63=\"\",\"\",'Öğr.Gör. Ön Değ.'!L63)","v":""}]
[{"$f":"IF('Öğr.Gör. Ön Değ.'!A64=\"\",\"\",'Öğr.Gör. Ön Değ.'!A64)","v":""},{"$f":"IF('Öğr.Gör. Ön Değ.'!B64=\"\",\"\",LEFT('Öğr.Gör. Ön Değ.'!B64,3)&REPT(\"*\",4)&RIGHT('Öğr.Gör. Ön Değ.'!B64,2))","v":""},{"$f":"IF('Öğr.Gör. Ön Değ.'!C64=\"\",\"\",IF(ISERR(FIND(\" \",'Öğr.Gör. Ön Değ.'!C64))=TRUE,LEFT('Öğr.Gör. Ön Değ.'!C64,2)&REPT(\"*\",3),LEFT('Öğr.Gör. Ön Değ.'!C64,2)&REPT(\"*\",3)&\" \"&MID('Öğr.Gör. Ön Değ.'!C64,FIND(\" \",'Öğr.Gör. Ön Değ.'!C64)+1,2)&REPT(\"*\",3)))","v":""},{"$f":"IF('Öğr.Gör. Ön Değ.'!D64=\"\",\"\",IF(ISERR(FIND(\" \",'Öğr.Gör. Ön Değ.'!D64))=TRUE,LEFT('Öğr.Gör. Ön Değ.'!D64,2)&REPT(\"*\",3),LEFT('Öğr.Gör. Ön Değ.'!D64,2)&REPT(\"*\",3)&\" \"&MID('Öğr.Gör. Ön Değ.'!D64,FIND(\" \",'Öğr.Gör. Ön Değ.'!D64)+1,2)&REPT(\"*\",3)))","v":""},{"$f":"IF('Öğr.Gör. Ön Değ.'!E64=\"\",\"\",'Öğr.Gör. Ön Değ.'!E64)","v":""},{"$f":"IF('Öğr.Gör. Ön Değ.'!F64=\"\",\"\",'Öğr.Gör. Ön Değ.'!F64)","v":""},{"$f":"IF('Öğr.Gör. Ön Değ.'!G64=\"\",\"\",'Öğr.Gör. Ön Değ.'!G64)","v":""},{"$f":"IF('Öğr.Gör. Ön Değ.'!H64=\"\",\"\",'Öğr.Gör. Ön Değ.'!H64)","v":""},{"$f":"IF('Öğr.Gör. Ön Değ.'!I64=\"\",\"\",'Öğr.Gör. Ön Değ.'!I64)","v":""},{"$f":"IF('Öğr.Gör. Ön Değ.'!J64=\"\",\"\",'Öğr.Gör. Ön Değ.'!J64)","v":""},{"$f":"IF('Öğr.Gör. Ön Değ.'!K64=\"\",\"\",'Öğr.Gör. Ön Değ.'!K64)","v":""},{"$f":"IF('Öğr.Gör. Ön Değ.'!L64=\"\",\"\",'Öğr.Gör. Ön Değ.'!L64)","v":""}]
[{"$f":"IF('Öğr.Gör. Ön Değ.'!A65=\"\",\"\",'Öğr.Gör. Ön Değ.'!A65)","v":""},{"$f":"IF('Öğr.Gör. Ön Değ.'!B65=\"\",\"\",LEFT('Öğr.Gör. Ön Değ.'!B65,3)&REPT(\"*\",4)&RIGHT('Öğr.Gör. Ön Değ.'!B65,2))","v":""},{"$f":"IF('Öğr.Gör. Ön Değ.'!C65=\"\",\"\",IF(ISERR(FIND(\" \",'Öğr.Gör. Ön Değ.'!C65))=TRUE,LEFT('Öğr.Gör. Ön Değ.'!C65,2)&REPT(\"*\",3),LEFT('Öğr.Gör. Ön Değ.'!C65,2)&REPT(\"*\",3)&\" \"&MID('Öğr.Gör. Ön Değ.'!C65,FIND(\" \",'Öğr.Gör. Ön Değ.'!C65)+1,2)&REPT(\"*\",3)))","v":""},{"$f":"IF('Öğr.Gör. Ön Değ.'!D65=\"\",\"\",IF(ISERR(FIND(\" \",'Öğr.Gör. Ön Değ.'!D65))=TRUE,LEFT('Öğr.Gör. Ön Değ.'!D65,2)&REPT(\"*\",3),LEFT('Öğr.Gör. Ön Değ.'!D65,2)&REPT(\"*\",3)&\" \"&MID('Öğr.Gör. Ön Değ.'!D65,FIND(\" \",'Öğr.Gör. Ön Değ.'!D65)+1,2)&REPT(\"*\",3)))","v":""},{"$f":"IF('Öğr.Gör. Ön Değ.'!E65=\"\",\"\",'Öğr.Gör. Ön Değ.'!E65)","v":""},{"$f":"IF('Öğr.Gör. Ön Değ.'!F65=\"\",\"\",'Öğr.Gör. Ön Değ.'!F65)","v":""},{"$f":"IF('Öğr.Gör. Ön Değ.'!G65=\"\",\"\",'Öğr.Gör. Ön Değ.'!G65)","v":""},{"$f":"IF('Öğr.Gör. Ön Değ.'!H65=\"\",\"\",'Öğr.Gör. Ön Değ.'!H65)","v":""},{"$f":"IF('Öğr.Gör. Ön Değ.'!I65=\"\",\"\",'Öğr.Gör. Ön Değ.'!I65)","v":""},{"$f":"IF('Öğr.Gör. Ön Değ.'!J65=\"\",\"\",'Öğr.Gör. Ön Değ.'!J65)","v":""},{"$f":"IF('Öğr.Gör. Ön Değ.'!K65=\"\",\"\",'Öğr.Gör. Ön Değ.'!K65)","v":""},{"$f":"IF('Öğr.Gör. Ön Değ.'!L65=\"\",\"\",'Öğr.Gör. Ön Değ.'!L65)","v":""}]
[{"$f":"IF('Öğr.Gör. Ön Değ.'!A66=\"\",\"\",'Öğr.Gör. Ön Değ.'!A66)","v":""},{"$f":"IF('Öğr.Gör. Ön Değ.'!B66=\"\",\"\",LEFT('Öğr.Gör. Ön Değ.'!B66,3)&REPT(\"*\",4)&RIGHT('Öğr.Gör. Ön Değ.'!B66,2))","v":""},{"$f":"IF('Öğr.Gör. Ön Değ.'!C66=\"\",\"\",IF(ISERR(FIND(\" \",'Öğr.Gör. Ön Değ.'!C66))=TRUE,LEFT('Öğr.Gör. Ön Değ.'!C66,2)&REPT(\"*\",3),LEFT('Öğr.Gör. Ön Değ.'!C66,2)&REPT(\"*\",3)&\" \"&MID('Öğr.Gör. Ön Değ.'!C66,FIND(\" \",'Öğr.Gör. Ön Değ.'!C66)+1,2)&REPT(\"*\",3)))","v":""},{"$f":"IF('Öğr.Gör. Ön Değ.'!D66=\"\",\"\",IF(ISERR(FIND(\" \",'Öğr.Gör. Ön Değ.'!D66))=TRUE,LEFT('Öğr.Gör. Ön Değ.'!D66,2)&REPT(\"*\",3),LEFT('Öğr.Gör. Ön Değ.'!D66,2)&REPT(\"*\",3)&\" \"&MID('Öğr.Gör. Ön Değ.'!D66,FIND(\" \",'Öğr.Gör. Ön Değ.'!D66)+1,2)&REPT(\"*\",3)))","v":""},{"$f":"IF('Öğr.Gör. Ön Değ.'!E66=\"\",\"\",'Öğr.Gör. Ön Değ.'!E66)","v":""},{"$f":"IF('Öğr.Gör. Ön Değ.'!F66=\"\",\"\",'Öğr.Gör. Ön Değ.'!F66)","v":""},{"$f":"IF('Öğr.Gör. Ön Değ.'!G66=\"\",\"\",'Öğr.Gör. Ön Değ.'!G66)","v":""},{"$f":"IF('Öğr.Gör. Ön Değ.'!H66=\"\",\"\",'Öğr.Gör. Ön Değ.'!H66)","v":""},{"$f":"IF('Öğr.Gör. Ön Değ.'!I66=\"\",\"\",'Öğr.Gör. Ön Değ.'!I66)","v":""},{"$f":"IF('Öğr.Gör. Ön Değ.'!J66=\"\",\"\",'Öğr.Gör. Ön Değ.'!J66)","v":""},{"$f":"IF('Öğr.Gör. Ön Değ.'!K66=\"\",\"\",'Öğr.Gör. Ön Değ.'!K66)","v":""},{"$f":"IF('Öğr.Gör. Ön Değ.'!L66=\"\",\"\",'Öğr.Gör. Ön Değ.'!L66)","v":""}]
[{"$f":"IF('Öğr.Gör. Ön Değ.'!A67=\"\",\"\",'Öğr.Gör. Ön Değ.'!A67)","v":""},{"$f":"IF('Öğr.Gör. Ön Değ.'!B67=\"\",\"\",LEFT('Öğr.Gör. Ön Değ.'!B67,3)&REPT(\"*\",4)&RIGHT('Öğr.Gör. Ön Değ.'!B67,2))","v":""},{"$f":"IF('Öğr.Gör. Ön Değ.'!C67=\"\",\"\",IF(ISERR(FIND(\" \",'Öğr.Gör. Ön Değ.'!C67))=TRUE,LEFT('Öğr.Gör. Ön Değ.'!C67,2)&REPT(\"*\",3),LEFT('Öğr.Gör. Ön Değ.'!C67,2)&REPT(\"*\",3)&\" \"&MID('Öğr.Gör. Ön Değ.'!C67,FIND(\" \",'Öğr.Gör. Ön Değ.'!C67)+1,2)&REPT(\"*\",3)))","v":""},{"$f":"IF('Öğr.Gör. Ön Değ.'!D67=\"\",\"\",IF(ISERR(FIND(\" \",'Öğr.Gör. Ön Değ.'!D67))=TRUE,LEFT('Öğr.Gör. Ön Değ.'!D67,2)&REPT(\"*\",3),LEFT('Öğr.Gör. Ön Değ.'!D67,2)&REPT(\"*\",3)&\" \"&MID('Öğr.Gör. Ön Değ.'!D67,FIND(\" \",'Öğr.Gör. Ön Değ.'!D67)+1,2)&REPT(\"*\",3)))","v":""},{"$f":"IF('Öğr.Gör. Ön Değ.'!E67=\"\",\"\",'Öğr.Gör. Ön Değ.'!E67)","v":""},{"$f":"IF('Öğr.Gör. Ön Değ.'!F67=\"\",\"\",'Öğr.Gör. Ön Değ.'!F67)","v":""},{"$f":"IF('Öğr.Gör. Ön Değ.'!G67=\"\",\"\",'Öğr.Gör. Ön Değ.'!G67)","v":""},{"$f":"IF('Öğr.Gör. Ön Değ.'!H67=\"\",\"\",'Öğr.Gör. Ön Değ.'!H67)","v":""},{"$f":"IF('Öğr.Gör. Ön Değ.'!I67=\"\",\"\",'Öğr.Gör. Ön Değ.'!I67)","v":""},{"$f":"IF('Öğr.Gör. Ön Değ.'!J67=\"\",\"\",'Öğr.Gör. Ön Değ.'!J67)","v":""},{"$f":"IF('Öğr.Gör. Ön Değ.'!K67=\"\",\"\",'Öğr.Gör. Ön Değ.'!K67)","v":""},{"$f":"IF('Öğr.Gör. Ön Değ.'!L67=\"\",\"\",'Öğr.Gör. Ön Değ.'!L67)","v":""}]
[{"$f":"IF('Öğr.Gör. Ön Değ.'!A68=\"\",\"\",'Öğr.Gör. Ön Değ.'!A68)","v":""},{"$f":"IF('Öğr.Gör. Ön Değ.'!B68=\"\",\"\",LEFT('Öğr.Gör. Ön Değ.'!B68,3)&REPT(\"*\",4)&RIGHT('Öğr.Gör. Ön Değ.'!B68,2))","v":""},{"$f":"IF('Öğr.Gör. Ön Değ.'!C68=\"\",\"\",IF(ISERR(FIND(\" \",'Öğr.Gör. Ön Değ.'!C68))=TRUE,LEFT('Öğr.Gör. Ön Değ.'!C68,2)&REPT(\"*\",3),LEFT('Öğr.Gör. Ön Değ.'!C68,2)&REPT(\"*\",3)&\" \"&MID('Öğr.Gör. Ön Değ.'!C68,FIND(\" \",'Öğr.Gör. Ön Değ.'!C68)+1,2)&REPT(\"*\",3)))","v":""},{"$f":"IF('Öğr.Gör. Ön Değ.'!D68=\"\",\"\",IF(ISERR(FIND(\" \",'Öğr.Gör. Ön Değ.'!D68))=TRUE,LEFT('Öğr.Gör. Ön Değ.'!D68,2)&REPT(\"*\",3),LEFT('Öğr.Gör. Ön Değ.'!D68,2)&REPT(\"*\",3)&\" \"&MID('Öğr.Gör. Ön Değ.'!D68,FIND(\" \",'Öğr.Gör. Ön Değ.'!D68)+1,2)&REPT(\"*\",3)))","v":""},{"$f":"IF('Öğr.Gör. Ön Değ.'!E68=\"\",\"\",'Öğr.Gör. Ön Değ.'!E68)","v":""},{"$f":"IF('Öğr.Gör. Ön Değ.'!F68=\"\",\"\",'Öğr.Gör. Ön Değ.'!F68)","v":""},{"$f":"IF('Öğr.Gör. Ön Değ.'!G68=\"\",\"\",'Öğr.Gör. Ön Değ.'!G68)","v":""},{"$f":"IF('Öğr.Gör. Ön Değ.'!H68=\"\",\"\",'Öğr.Gör. Ön Değ.'!H68)","v":""},{"$f":"IF('Öğr.Gör. Ön Değ.'!I68=\"\",\"\",'Öğr.Gör. Ön Değ.'!I68)","v":""},{"$f":"IF('Öğr.Gör. Ön Değ.'!J68=\"\",\"\",'Öğr.Gör. Ön Değ.'!J68)","v":""},{"$f":"IF('Öğr.Gör. Ön Değ.'!K68=\"\",\"\",'Öğr.Gör. Ön Değ.'!K68)","v":""},{"$f":"IF('Öğr.Gör. Ön Değ.'!L68=\"\",\"\",'Öğr.Gör. Ön Değ.'!L68)","v":""}]
[{"$f":"IF('Öğr.Gör. Ön Değ.'!A69=\"\",\"\",'Öğr.Gör. Ön Değ.'!A69)","v":""},{"$f":"IF('Öğr.Gör. Ön Değ.'!B69=\"\",\"\",LEFT('Öğr.Gör. Ön Değ.'!B69,3)&REPT(\"*\",4)&RIGHT('Öğr.Gör. Ön Değ.'!B69,2))","v":""},{"$f":"IF('Öğr.Gör. Ön Değ.'!C69=\"\",\"\",IF(ISERR(FIND(\" \",'Öğr.Gör. Ön Değ.'!C69))=TRUE,LEFT('Öğr.Gör. Ön Değ.'!C69,2)&REPT(\"*\",3),LEFT('Öğr.Gör. Ön Değ.'!C69,2)&REPT(\"*\",3)&\" \"&MID('Öğr.Gör. Ön Değ.'!C69,FIND(\" \",'Öğr.Gör. Ön Değ.'!C69)+1,2)&REPT(\"*\",3)))","v":""},{"$f":"IF('Öğr.Gör. Ön Değ.'!D69=\"\",\"\",IF(ISERR(FIND(\" \",'Öğr.Gör. Ön Değ.'!D69))=TRUE,LEFT('Öğr.Gör. Ön Değ.'!D69,2)&REPT(\"*\",3),LEFT('Öğr.Gör. Ön Değ.'!D69,2)&REPT(\"*\",3)&\" \"&MID('Öğr.Gör. Ön Değ.'!D69,FIND(\" \",'Öğr.Gör. Ön Değ.'!D69)+1,2)&REPT(\"*\",3)))","v":""},{"$f":"IF('Öğr.Gör. Ön Değ.'!E69=\"\",\"\",'Öğr.Gör. Ön Değ.'!E69)","v":""},{"$f":"IF('Öğr.Gör. Ön Değ.'!F69=\"\",\"\",'Öğr.Gör. Ön Değ.'!F69)","v":""},{"$f":"IF('Öğr.Gör. Ön Değ.'!G69=\"\",\"\",'Öğr.Gör. Ön Değ.'!G69)","v":""},{"$f":"IF('Öğr.Gör. Ön Değ.'!H69=\"\",\"\",'Öğr.Gör. Ön Değ.'!H69)","v":""},{"$f":"IF('Öğr.Gör. Ön Değ.'!I69=\"\",\"\",'Öğr.Gör. Ön Değ.'!I69)","v":""},{"$f":"IF('Öğr.Gör. Ön Değ.'!J69=\"\",\"\",'Öğr.Gör. Ön Değ.'!J69)","v":""},{"$f":"IF('Öğr.Gör. Ön Değ.'!K69=\"\",\"\",'Öğr.Gör. Ön Değ.'!K69)","v":""},{"$f":"IF('Öğr.Gör. Ön Değ.'!L69=\"\",\"\",'Öğr.Gör. Ön Değ.'!L69)","v":""}]
[{"$f":"IF('Öğr.Gör. Ön Değ.'!A70=\"\",\"\",'Öğr.Gör. Ön Değ.'!A70)","v":""},{"$f":"IF('Öğr.Gör. Ön Değ.'!B70=\"\",\"\",LEFT('Öğr.Gör. Ön Değ.'!B70,3)&REPT(\"*\",4)&RIGHT('Öğr.Gör. Ön Değ.'!B70,2))","v":""},{"$f":"IF('Öğr.Gör. Ön Değ.'!C70=\"\",\"\",IF(ISERR(FIND(\" \",'Öğr.Gör. Ön Değ.'!C70))=TRUE,LEFT('Öğr.Gör. Ön Değ.'!C70,2)&REPT(\"*\",3),LEFT('Öğr.Gör. Ön Değ.'!C70,2)&REPT(\"*\",3)&\" \"&MID('Öğr.Gör. Ön Değ.'!C70,FIND(\" \",'Öğr.Gör. Ön Değ.'!C70)+1,2)&REPT(\"*\",3)))","v":""},{"$f":"IF('Öğr.Gör. Ön Değ.'!D70=\"\",\"\",IF(ISERR(FIND(\" \",'Öğr.Gör. Ön Değ.'!D70))=TRUE,LEFT('Öğr.Gör. Ön Değ.'!D70,2)&REPT(\"*\",3),LEFT('Öğr.Gör. Ön Değ.'!D70,2)&REPT(\"*\",3)&\" \"&MID('Öğr.Gör. Ön Değ.'!D70,FIND(\" \",'Öğr.Gör. Ön Değ.'!D70)+1,2)&REPT(\"*\",3)))","v":""},{"$f":"IF('Öğr.Gör. Ön Değ.'!E70=\"\",\"\",'Öğr.Gör. Ön Değ.'!E70)","v":""},{"$f":"IF('Öğr.Gör. Ön Değ.'!F70=\"\",\"\",'Öğr.Gör. Ön Değ.'!F70)","v":""},{"$f":"IF('Öğr.Gör. Ön Değ.'!G70=\"\",\"\",'Öğr.Gör. Ön Değ.'!G70)","v":""},{"$f":"IF('Öğr.Gör. Ön Değ.'!H70=\"\",\"\",'Öğr.Gör. Ön Değ.'!H70)","v":""},{"$f":"IF('Öğr.Gör. Ön Değ.'!I70=\"\",\"\",'Öğr.Gör. Ön Değ.'!I70)","v":""},{"$f":"IF('Öğr.Gör. Ön Değ.'!J70=\"\",\"\",'Öğr.Gör. Ön Değ.'!J70)","v":""},{"$f":"IF('Öğr.Gör. Ön Değ.'!K70=\"\",\"\",'Öğr.Gör. Ön Değ.'!K70)","v":""},{"$f":"IF('Öğr.Gör. Ön Değ.'!L70=\"\",\"\",'Öğr.Gör. Ön Değ.'!L70)","v":""}]
[{"$f":"IF('Öğr.Gör. Ön Değ.'!A71=\"\",\"\",'Öğr.Gör. Ön Değ.'!A71)","v":""},{"$f":"IF('Öğr.Gör. Ön Değ.'!B71=\"\",\"\",LEFT('Öğr.Gör. Ön Değ.'!B71,3)&REPT(\"*\",4)&RIGHT('Öğr.Gör. Ön Değ.'!B71,2))","v":""},{"$f":"IF('Öğr.Gör. Ön Değ.'!C71=\"\",\"\",IF(ISERR(FIND(\" \",'Öğr.Gör. Ön Değ.'!C71))=TRUE,LEFT('Öğr.Gör. Ön Değ.'!C71,2)&REPT(\"*\",3),LEFT('Öğr.Gör. Ön Değ.'!C71,2)&REPT(\"*\",3)&\" \"&MID('Öğr.Gör. Ön Değ.'!C71,FIND(\" \",'Öğr.Gör. Ön Değ.'!C71)+1,2)&REPT(\"*\",3)))","v":""},{"$f":"IF('Öğr.Gör. Ön Değ.'!D71=\"\",\"\",IF(ISERR(FIND(\" \",'Öğr.Gör. Ön Değ.'!D71))=TRUE,LEFT('Öğr.Gör. Ön Değ.'!D71,2)&REPT(\"*\",3),LEFT('Öğr.Gör. Ön Değ.'!D71,2)&REPT(\"*\",3)&\" \"&MID('Öğr.Gör. Ön Değ.'!D71,FIND(\" \",'Öğr.Gör. Ön Değ.'!D71)+1,2)&REPT(\"*\",3)))","v":""},{"$f":"IF('Öğr.Gör. Ön Değ.'!E71=\"\",\"\",'Öğr.Gör. Ön Değ.'!E71)","v":""},{"$f":"IF('Öğr.Gör. Ön Değ.'!F71=\"\",\"\",'Öğr.Gör. Ön Değ.'!F71)","v":""},{"$f":"IF('Öğr.Gör. Ön Değ.'!G71=\"\",\"\",'Öğr.Gör. Ön Değ.'!G71)","v":""},{"$f":"IF('Öğr.Gör. Ön Değ.'!H71=\"\",\"\",'Öğr.Gör. Ön Değ.'!H71)","v":""},{"$f":"IF('Öğr.Gör. Ön Değ.'!I71=\"\",\"\",'Öğr.Gör. Ön Değ.'!I71)","v":""},{"$f":"IF('Öğr.Gör. Ön Değ.'!J71=\"\",\"\",'Öğr.Gör. Ön Değ.'!J71)","v":""},{"$f":"IF('Öğr.Gör. Ön Değ.'!K71=\"\",\"\",'Öğr.Gör. Ön Değ.'!K71)","v":""},{"$f":"IF('Öğr.Gör. Ön Değ.'!L71=\"\",\"\",'Öğr.Gör. Ön Değ.'!L71)","v":""}]
[{"$f":"IF('Öğr.Gör. Ön Değ.'!A72=\"\",\"\",'Öğr.Gör. Ön Değ.'!A72)","v":""},{"$f":"IF('Öğr.Gör. Ön Değ.'!B72=\"\",\"\",LEFT('Öğr.Gör. Ön Değ.'!B72,3)&REPT(\"*\",4)&RIGHT('Öğr.Gör. Ön Değ.'!B72,2))","v":""},{"$f":"IF('Öğr.Gör. Ön Değ.'!C72=\"\",\"\",IF(ISERR(FIND(\" \",'Öğr.Gör. Ön Değ.'!C72))=TRUE,LEFT('Öğr.Gör. Ön Değ.'!C72,2)&REPT(\"*\",3),LEFT('Öğr.Gör. Ön Değ.'!C72,2)&REPT(\"*\",3)&\" \"&MID('Öğr.Gör. Ön Değ.'!C72,FIND(\" \",'Öğr.Gör. Ön Değ.'!C72)+1,2)&REPT(\"*\",3)))","v":""},{"$f":"IF('Öğr.Gör. Ön Değ.'!D72=\"\",\"\",IF(ISERR(FIND(\" \",'Öğr.Gör. Ön Değ.'!D72))=TRUE,LEFT('Öğr.Gör. Ön Değ.'!D72,2)&REPT(\"*\",3),LEFT('Öğr.Gör. Ön Değ.'!D72,2)&REPT(\"*\",3)&\" \"&MID('Öğr.Gör. Ön Değ.'!D72,FIND(\" \",'Öğr.Gör. Ön Değ.'!D72)+1,2)&REPT(\"*\",3)))","v":""},{"$f":"IF('Öğr.Gör. Ön Değ.'!E72=\"\",\"\",'Öğr.Gör. Ön Değ.'!E72)","v":""},{"$f":"IF('Öğr.Gör. Ön Değ.'!F72=\"\",\"\",'Öğr.Gör. Ön Değ.'!F72)","v":""},{"$f":"IF('Öğr.Gör. Ön Değ.'!G72=\"\",\"\",'Öğr.Gör. Ön Değ.'!G72)","v":""},{"$f":"IF('Öğr.Gör. Ön Değ.'!H72=\"\",\"\",'Öğr.Gör. Ön Değ.'!H72)","v":""},{"$f":"IF('Öğr.Gör. Ön Değ.'!I72=\"\",\"\",'Öğr.Gör. Ön Değ.'!I72)","v":""},{"$f":"IF('Öğr.Gör. Ön Değ.'!J72=\"\",\"\",'Öğr.Gör. Ön Değ.'!J72)","v":""},{"$f":"IF('Öğr.Gör. Ön Değ.'!K72=\"\",\"\",'Öğr.Gör. Ön Değ.'!K72)","v":""},{"$f":"IF('Öğr.Gör. Ön Değ.'!L72=\"\",\"\",'Öğr.Gör. Ön Değ.'!L72)","v":""}]
[{"$f":"IF('Öğr.Gör. Ön Değ.'!A73=\"\",\"\",'Öğr.Gör. Ön Değ.'!A73)","v":""},{"$f":"IF('Öğr.Gör. Ön Değ.'!B73=\"\",\"\",LEFT('Öğr.Gör. Ön Değ.'!B73,3)&REPT(\"*\",4)&RIGHT('Öğr.Gör. Ön Değ.'!B73,2))","v":""},{"$f":"IF('Öğr.Gör. Ön Değ.'!C73=\"\",\"\",IF(ISERR(FIND(\" \",'Öğr.Gör. Ön Değ.'!C73))=TRUE,LEFT('Öğr.Gör. Ön Değ.'!C73,2)&REPT(\"*\",3),LEFT('Öğr.Gör. Ön Değ.'!C73,2)&REPT(\"*\",3)&\" \"&MID('Öğr.Gör. Ön Değ.'!C73,FIND(\" \",'Öğr.Gör. Ön Değ.'!C73)+1,2)&REPT(\"*\",3)))","v":""},{"$f":"IF('Öğr.Gör. Ön Değ.'!D73=\"\",\"\",IF(ISERR(FIND(\" \",'Öğr.Gör. Ön Değ.'!D73))=TRUE,LEFT('Öğr.Gör. Ön Değ.'!D73,2)&REPT(\"*\",3),LEFT('Öğr.Gör. Ön Değ.'!D73,2)&REPT(\"*\",3)&\" \"&MID('Öğr.Gör. Ön Değ.'!D73,FIND(\" \",'Öğr.Gör. Ön Değ.'!D73)+1,2)&REPT(\"*\",3)))","v":""},{"$f":"IF('Öğr.Gör. Ön Değ.'!E73=\"\",\"\",'Öğr.Gör. Ön Değ.'!E73)","v":""},{"$f":"IF('Öğr.Gör. Ön Değ.'!F73=\"\",\"\",'Öğr.Gör. Ön Değ.'!F73)","v":""},{"$f":"IF('Öğr.Gör. Ön Değ.'!G73=\"\",\"\",'Öğr.Gör. Ön Değ.'!G73)","v":""},{"$f":"IF('Öğr.Gör. Ön Değ.'!H73=\"\",\"\",'Öğr.Gör. Ön Değ.'!H73)","v":""},{"$f":"IF('Öğr.Gör. Ön Değ.'!I73=\"\",\"\",'Öğr.Gör. Ön Değ.'!I73)","v":""},{"$f":"IF('Öğr.Gör. Ön Değ.'!J73=\"\",\"\",'Öğr.Gör. Ön Değ.'!J73)","v":""},{"$f":"IF('Öğr.Gör. Ön Değ.'!K73=\"\",\"\",'Öğr.Gör. Ön Değ.'!K73)","v":""},{"$f":"IF('Öğr.Gör. Ön Değ.'!L73=\"\",\"\",'Öğr.Gör. Ön Değ.'!L73)","v":""}]
[{"$f":"IF('Öğr.Gör. Ön Değ.'!A74=\"\",\"\",'Öğr.Gör. Ön Değ.'!A74)","v":""},{"$f":"IF('Öğr.Gör. Ön Değ.'!B74=\"\",\"\",LEFT('Öğr.Gör. Ön Değ.'!B74,3)&REPT(\"*\",4)&RIGHT('Öğr.Gör. Ön Değ.'!B74,2))","v":""},{"$f":"IF('Öğr.Gör. Ön Değ.'!C74=\"\",\"\",IF(ISERR(FIND(\" \",'Öğr.Gör. Ön Değ.'!C74))=TRUE,LEFT('Öğr.Gör. Ön Değ.'!C74,2)&REPT(\"*\",3),LEFT('Öğr.Gör. Ön Değ.'!C74,2)&REPT(\"*\",3)&\" \"&MID('Öğr.Gör. Ön Değ.'!C74,FIND(\" \",'Öğr.Gör. Ön Değ.'!C74)+1,2)&REPT(\"*\",3)))","v":""},{"$f":"IF('Öğr.Gör. Ön Değ.'!D74=\"\",\"\",IF(ISERR(FIND(\" \",'Öğr.Gör. Ön Değ.'!D74))=TRUE,LEFT('Öğr.Gör. Ön Değ.'!D74,2)&REPT(\"*\",3),LEFT('Öğr.Gör. Ön Değ.'!D74,2)&REPT(\"*\",3)&\" \"&MID('Öğr.Gör. Ön Değ.'!D74,FIND(\" \",'Öğr.Gör. Ön Değ.'!D74)+1,2)&REPT(\"*\",3)))","v":""},{"$f":"IF('Öğr.Gör. Ön Değ.'!E74=\"\",\"\",'Öğr.Gör. Ön Değ.'!E74)","v":""},{"$f":"IF('Öğr.Gör. Ön Değ.'!F74=\"\",\"\",'Öğr.Gör. Ön Değ.'!F74)","v":""},{"$f":"IF('Öğr.Gör. Ön Değ.'!G74=\"\",\"\",'Öğr.Gör. Ön Değ.'!G74)","v":""},{"$f":"IF('Öğr.Gör. Ön Değ.'!H74=\"\",\"\",'Öğr.Gör. Ön Değ.'!H74)","v":""},{"$f":"IF('Öğr.Gör. Ön Değ.'!I74=\"\",\"\",'Öğr.Gör. Ön Değ.'!I74)","v":""},{"$f":"IF('Öğr.Gör. Ön Değ.'!J74=\"\",\"\",'Öğr.Gör. Ön Değ.'!J74)","v":""},{"$f":"IF('Öğr.Gör. Ön Değ.'!K74=\"\",\"\",'Öğr.Gör. Ön Değ.'!K74)","v":""},{"$f":"IF('Öğr.Gör. Ön Değ.'!L74=\"\",\"\",'Öğr.Gör. Ön Değ.'!L74)","v":""}]
[{"$f":"IF('Öğr.Gör. Ön Değ.'!A75=\"\",\"\",'Öğr.Gör. Ön Değ.'!A75)","v":""},{"$f":"IF('Öğr.Gör. Ön Değ.'!B75=\"\",\"\",LEFT('Öğr.Gör. Ön Değ.'!B75,3)&REPT(\"*\",4)&RIGHT('Öğr.Gör. Ön Değ.'!B75,2))","v":""},{"$f":"IF('Öğr.Gör. Ön Değ.'!C75=\"\",\"\",IF(ISERR(FIND(\" \",'Öğr.Gör. Ön Değ.'!C75))=TRUE,LEFT('Öğr.Gör. Ön Değ.'!C75,2)&REPT(\"*\",3),LEFT('Öğr.Gör. Ön Değ.'!C75,2)&REPT(\"*\",3)&\" \"&MID('Öğr.Gör. Ön Değ.'!C75,FIND(\" \",'Öğr.Gör. Ön Değ.'!C75)+1,2)&REPT(\"*\",3)))","v":""},{"$f":"IF('Öğr.Gör. Ön Değ.'!D75=\"\",\"\",IF(ISERR(FIND(\" \",'Öğr.Gör. Ön Değ.'!D75))=TRUE,LEFT('Öğr.Gör. Ön Değ.'!D75,2)&REPT(\"*\",3),LEFT('Öğr.Gör. Ön Değ.'!D75,2)&REPT(\"*\",3)&\" \"&MID('Öğr.Gör. Ön Değ.'!D75,FIND(\" \",'Öğr.Gör. Ön Değ.'!D75)+1,2)&REPT(\"*\",3)))","v":""},{"$f":"IF('Öğr.Gör. Ön Değ.'!E75=\"\",\"\",'Öğr.Gör. Ön Değ.'!E75)","v":""},{"$f":"IF('Öğr.Gör. Ön Değ.'!F75=\"\",\"\",'Öğr.Gör. Ön Değ.'!F75)","v":""},{"$f":"IF('Öğr.Gör. Ön Değ.'!G75=\"\",\"\",'Öğr.Gör. Ön Değ.'!G75)","v":""},{"$f":"IF('Öğr.Gör. Ön Değ.'!H75=\"\",\"\",'Öğr.Gör. Ön Değ.'!H75)","v":""},{"$f":"IF('Öğr.Gör. Ön Değ.'!I75=\"\",\"\",'Öğr.Gör. Ön Değ.'!I75)","v":""},{"$f":"IF('Öğr.Gör. Ön Değ.'!J75=\"\",\"\",'Öğr.Gör. Ön Değ.'!J75)","v":""},{"$f":"IF('Öğr.Gör. Ön Değ.'!K75=\"\",\"\",'Öğr.Gör. Ön Değ.'!K75)","v":""},{"$f":"IF('Öğr.Gör. Ön Değ.'!L75=\"\",\"\",'Öğr.Gör. Ön Değ.'!L75)","v":""}]

{"sheet":"Lisans Öğr.Gör. Sonuç","index":2,"n_rows":16,"n_cols":14,"rows_kept":16,"cut":false,"hidden":false,"merged":[[8,0,8,1],[7,6,7,8],[7,11,7,12],[8,2,8,13],[5,0,5,1],[6,0,6,1],[7,0,7,1],[5,2,5,5],[6,2,6,5],[7,2,7,5],[0,0,0,13],[1,0,1,13],[2,0,2,13],[3,0,3,13],[4,0,4,1],[9,6,9,7],[4,6,4,8],[4,2,4,5],[4,9,4,13],[9,0,10,0],[9,4,9,5],[9,12,10,12],[9,13,10,13],[9,1,9,3],[9,10,9,11],[9,8,9,9],[5,6,5,8],[5,9,5,13],[6,6,6,8],[6,9,6,13],[7,9,7,10]]}
["T.C."]
["BAYBURT ÜNİVERSİTESİ"]
["GİRİŞ SINAVI SONUÇ TUTANAĞI"]
[" Üniversitemize bağlı birimlere, 2547 sayılı Kanunun ilgili maddeleri ve 09.11.2018 tarih ve 30590 sayılı Resmi Gazetede yayımlanan \"Öğretim Üyesi Dışındaki Öğretim Elemanı Kadrolarına Naklen veya Açıktan Yapılacak Atamalarda Uygulanacak Merkezi Sınav ile Giriş Sınavlarına İlişkin Usul ve Esaslar Hakkında Yönetmelik” 11. ve 12. maddeleri hükümleri uyarınca yapılan Giriş Sınavında başarılı olan adayların isimleri aşağıda belirtilmiştir."]
["İlan No:",null,null,null,null,null,"Birimi:",null,null,"….. Fakültesi / Yüksekokulu / Rektörlük"]
["İlan Tarihi:",null,"…/.../....",null,null,null,"Bölümü:",null,null,"….. Bölümü / … Ofisi / Başkanlığı"]
["Kadro Unvanı:",null,"Öğretim Görevlisi (Uygulamalı Birim) / (Lisans/Ders Verecek-Zorunlu Ortak Ders) ",null,null,null,"Anabili Dalı:",null,null,"…… Anabilim Dalı"]
["Kadro Adedi:",null,1,null,null,null,"Sınav Tarihi:",null,null,"…/.../....",null,"Sonuç Tarihi:",null,"…/.../...."]
["İlan Özel Şartı:"]
["Sıra No","Başvuranın",null,null,"ALES Puanı",null,"Yabancı Dil Puanı",null,"Lisans Mezuniyet Notu",null,"Giriş Sınavı",null,"(A+B+C+D) Değerlendirme Notu","Sonuç"]
[null,"T.C. Kimlik No","Adı","Soyadı","Puanı","(A) Puanın %30' u","Puanı","(B) Puanın %10' u","100' lük Sistem ","(C) Notun %30' u","Giriş Sınav Notu","(D) Notunun %30' u"]
[1,11111111111,"Örnek","Örnek",82.513919999999999,{"$f":"E12*0.3","v":24.754175999999998},62.5,{"$f":"G12*0.1","v":6.25},76.66,{"$f":"I12*0.3","v":22.997999999999998},95,{"$f":"K12*0.3","v":28.5},{"$f":"F12+H12+J12+L12","v":82.502175999999992},"BAŞARILI (ASIL)"]
[2,11111111111,"Örnek Örnek","Örnek",85.030479999999997,{"$f":"E13*0.3","v":25.509143999999999},52.5,{"$f":"G13*0.1","v":5.25},76.66,{"$f":"I13*0.3","v":22.997999999999998},63,{"$f":"K13*0.3","v":18.899999999999999},{"$f":"F13+H13+J13+L13","v":72.657143999999988},"BAŞARILI (YEDEK)"]
[3,11111111111,"Örnek","Örnek Örnek",84.431349999999995,{"$f":"E14*0.3","v":25.329404999999998},70,{"$f":"G14*0.1","v":7},83.66,{"$f":"I14*0.3","v":25.097999999999999},45,{"$f":"K14*0.3","v":13.5},{"$f":"F14+H14+J14+L14","v":70.927404999999993},"YÖNETMELİK GEREĞİ ELENDİ*"]
[4,11111111111,"Örnek Örnek","Örnek Örnek",84.431349999999995,{"$f":"E15*0.3","v":25.329404999999998},50,{"$f":"G15*0.1","v":5},76.66,{"$f":"I15*0.3","v":22.997999999999998},35,{"$f":"K15*0.3","v":10.5},{"$f":"F15+H15+J15+L15","v":63.827404999999999},"BAŞARISIZ**"]
[5,11111111111,"Örnek","Örnek",84.431349999999995,{"$f":"E16*0.3","v":25.329404999999998},70,{"$f":"G16*0.1","v":7},83.66,{"$f":"I16*0.3","v":25.097999999999999},"Sınava Girmedi","-","-","SINAVA GİRMEDİ"]

{"sheet":"Sonuç Rapor","index":3,"n_rows":75,"n_cols":14,"rows_kept":75,"cut":false,"hidden":false,"merged":[[0,0,0,13],[1,0,1,13],[2,0,2,13],[3,0,3,13],[4,0,4,1],[4,2,4,5],[4,6,4,8],[4,9,4,13],[8,0,8,1],[8,2,8,13],[5,0,5,1],[5,2,5,5],[5,6,5,8],[5,9,5,13],[6,0,6,1],[6,2,6,5],[6,6,6,8],[6,9,6,13],[7,0,7,1],[7,2,7,5],[7,6,7,8],[7,9,7,10],[7,11,7,12],[9,12,10,12],[9,13,10,13],[9,0,10,0],[9,1,9,3],[9,4,9,5],[9,6,9,7],[9,8,9,9],[9,10,9,11]]}
["T.C."]
["BAYBURT ÜNİVERSİTESİ"]
["GİRİŞ SINAVI SONUÇ TUTANAĞI"]
[" Üniversitemize bağlı birimlere, 2547 sayılı Kanunun ilgili maddeleri ve 09.11.2018 tarih ve 30590 sayılı Resmi Gazetede yayımlanan \"Öğretim Üyesi Dışındaki Öğretim Elemanı Kadrolarına Naklen veya Açıktan Yapılacak Atamalarda Uygulanacak Merkezi Sınav ile Giriş Sınavlarına İlişkin Usul ve Esaslar Hakkında Yönetmelik” 11. ve 12. maddeleri hükümleri uyarınca yapılan Giriş Sınavında başarılı olan adayların isimleri aşağıda belirtilmiştir."]
["İlan No:",null,{"$f":"IF('Lisans Öğr.Gör. Sonuç'!C5=\"\",\"\",'Lisans Öğr.Gör. Sonuç'!C5)","v":""},null,null,null,"Birimi:",null,null,{"$f":"IF('Lisans Öğr.Gör. Sonuç'!J5=\"\",\"\",'Lisans Öğr.Gör. Sonuç'!J5)","v":"….. Fakültesi / Yüksekokulu / Rektörlük"}]
["İlan Tarihi:",null,{"$f":"IF('Lisans Öğr.Gör. Sonuç'!C6=\"\",\"\",'Lisans Öğr.Gör. Sonuç'!C6)","v":"…/.../...."},null,null,null,"Bölümü:",null,null,{"$f":"IF('Lisans Öğr.Gör. Sonuç'!J6=\"\",\"\",'Lisans Öğr.Gör. Sonuç'!J6)","v":"….. Bölümü / … Ofisi / Başkanlığı"}]
["Kadro Unvanı:",null,{"$f":"IF('Lisans Öğr.Gör. Sonuç'!C7=\"\",\"\",'Lisans Öğr.Gör. Sonuç'!C7)","v":"Öğretim Görevlisi (Uygulamalı Birim) / (Lisans/Ders Verecek-Zorunlu Ortak Ders) "},null,null,null,"Anabili Dalı:",null,null,{"$f":"IF('Lisans Öğr.Gör. Sonuç'!J7=\"\",\"\",'Lisans Öğr.Gör. Sonuç'!J7)","v":"…… Anabilim Dalı"}]
["Kadro Adedi:",null,{"$f":"IF('Lisans Öğr.Gör. Sonuç'!C8=\"\",\"\",'Lisans Öğr.Gör. Sonuç'!C8)","v":1},null,null,null,"Sınav Tarihi:",null,null,{"$f":"IF('Lisans Öğr.Gör. Sonuç'!J8=\"\",\"\",'Lisans Öğr.Gör. Sonuç'!J8)","v":"…/.../...."},null,"Sonuç Tarihi:",null,{"$f":"IF('Lisans Öğr.Gör. Sonuç'!N8=\"\",\"\",'Lisans Öğr.Gör. Sonuç'!N8)","v":"…/.../...."}]
["İlan Özel Şartı:",null,{"$f":"IF('Lisans Öğr.Gör. Sonuç'!C9=\"\",\"\",'Lisans Öğr.Gör. Sonuç'!C9)","v":""}]
["Sıra No","Başvuranın",null,null,"ALES Puanı",null,"Yabancı Dil Puanı",null,"Lisans Mezuniyet Notu",null,"Giriş Sınavı",null,"(A+B+C+D) Değerlendirme Notu","Sonuç"]
[null,"T.C. Kimlik No","Adı","Soyadı","Puanı","(A) Puanın %30' u","Puanı","(B) Puanın %10' u","100' lük Sistem ","(C) Notun %30' u","Giriş Sınav Notu","(D) Notunun %30' u"]
[{"$f":"IF('Lisans Öğr.Gör. Sonuç'!A12=\"\",\"\",'Lisans Öğr.Gör. Sonuç'!A12)","v":1},{"$f":"IF('Lisans Öğr.Gör. Sonuç'!B12=\"\",\"\",LEFT('Lisans Öğr.Gör. Sonuç'!B12,3)&REPT(\"*\",4)&RIGHT('Lisans Öğr.Gör. Sonuç'!B12,2))","v":"111****11"},{"$f":"IF('Lisans Öğr.Gör. Sonuç'!C12=\"\",\"\",IF(ISERR(FIND(\" \",'Lisans Öğr.Gör. Sonuç'!C12))=TRUE,LEFT('Lisans Öğr.Gör. Sonuç'!C12,2)&REPT(\"*\",3),LEFT('Lisans Öğr.Gör. Sonuç'!C12,2)&REPT(\"*\",3)&\" \"&MID('Lisans Öğr.Gör. Sonuç'!C12,FIND(\" \",'Lisans Öğr.Gör. Sonuç'!C12)+1,2)&REPT(\"*\",3)))","v":"Ör***"},{"$f":"IF('Lisans Öğr.Gör. Sonuç'!D12=\"\",\"\",IF(ISERR(FIND(\" \",'Lisans Öğr.Gör. Sonuç'!D12))=TRUE,LEFT('Lisans Öğr.Gör. Sonuç'!D12,2)&REPT(\"*\",3),LEFT('Lisans Öğr.Gör. Sonuç'!D12,2)&REPT(\"*\",3)&\" \"&MID('Lisans Öğr.Gör. Sonuç'!D12,FIND(\" \",'Lisans Öğr.Gör. Sonuç'!D12)+1,2)&REPT(\"*\",3)))","v":"Ör***"},{"$f":"IF('Lisans Öğr.Gör. Sonuç'!E12=\"\",\"\",'Lisans Öğr.Gör. Sonuç'!E12)","v":82.513919999999999},{"$f":"IF('Lisans Öğr.Gör. Sonuç'!F12=\"\",\"\",'Lisans Öğr.Gör. Sonuç'!F12)","v":24.754175999999998},{"$f":"IF('Lisans Öğr.Gör. Sonuç'!G12=\"\",\"\",'Lisans Öğr.Gör. Sonuç'!G12)","v":62.5},{"$f":"IF('Lisans Öğr.Gör. Sonuç'!H12=\"\",\"\",'Lisans Öğr.Gör. Sonuç'!H12)","v":6.25},{"$f":"IF('Lisans Öğr.Gör. Sonuç'!I12=\"\",\"\",'Lisans Öğr.Gör. Sonuç'!I12)","v":76.66},{"$f":"IF('Lisans Öğr.Gör. Sonuç'!J12=\"\",\"\",'Lisans Öğr.Gör. Sonuç'!J12)","v":22.997999999999998},{"$f":"IF('Lisans Öğr.Gör. Sonuç'!K12=\"\",\"\",'Lisans Öğr.Gör. Sonuç'!K12)","v":95},{"$f":"IF('Lisans Öğr.Gör. Sonuç'!L12=\"\",\"\",'Lisans Öğr.Gör. Sonuç'!L12)","v":28.5},{"$f":"IF('Lisans Öğr.Gör. Sonuç'!M12=\"\",\"\",'Lisans Öğr.Gör. Sonuç'!M12)","v":82.502175999999992},{"$f":"IF('Lisans Öğr.Gör. Sonuç'!N12=\"\",\"\",'Lisans Öğr.Gör. Sonuç'!N12)","v":"BAŞARILI (ASIL)"}]
[{"$f":"IF('Lisans Öğr.Gör. Sonuç'!A13=\"\",\"\",'Lisans Öğr.Gör. Sonuç'!A13)","v":2},{"$f":"IF('Lisans Öğr.Gör. Sonuç'!B13=\"\",\"\",LEFT('Lisans Öğr.Gör. Sonuç'!B13,3)&REPT(\"*\",4)&RIGHT('Lisans Öğr.Gör. Sonuç'!B13,2))","v":"111****11"},{"$f":"IF('Lisans Öğr.Gör. Sonuç'!C13=\"\",\"\",IF(ISERR(FIND(\" \",'Lisans Öğr.Gör. Sonuç'!C13))=TRUE,LEFT('Lisans Öğr.Gör. Sonuç'!C13,2)&REPT(\"*\",3),LEFT('Lisans Öğr.Gör. Sonuç'!C13,2)&REPT(\"*\",3)&\" \"&MID('Lisans Öğr.Gör. Sonuç'!C13,FIND(\" \",'Lisans Öğr.Gör. Sonuç'!C13)+1,2)&REPT(\"*\",3)))","v":"Ör*** Ör***"},{"$f":"IF('Lisans Öğr.Gör. Sonuç'!D13=\"\",\"\",IF(ISERR(FIND(\" \",'Lisans Öğr.Gör. Sonuç'!D13))=TRUE,LEFT('Lisans Öğr.Gör. Sonuç'!D13,2)&REPT(\"*\",3),LEFT('Lisans Öğr.Gör. Sonuç'!D13,2)&REPT(\"*\",3)&\" \"&MID('Lisans Öğr.Gör. Sonuç'!D13,FIND(\" \",'Lisans Öğr.Gör. Sonuç'!D13)+1,2)&REPT(\"*\",3)))","v":"Ör***"},{"$f":"IF('Lisans Öğr.Gör. Sonuç'!E13=\"\",\"\",'Lisans Öğr.Gör. Sonuç'!E13)","v":85.030479999999997},{"$f":"IF('Lisans Öğr.Gör. Sonuç'!F13=\"\",\"\",'Lisans Öğr.Gör. Sonuç'!F13)","v":25.509143999999999},{"$f":"IF('Lisans Öğr.Gör. Sonuç'!G13=\"\",\"\",'Lisans Öğr.Gör. Sonuç'!G13)","v":52.5},{"$f":"IF('Lisans Öğr.Gör. Sonuç'!H13=\"\",\"\",'Lisans Öğr.Gör. Sonuç'!H13)","v":5.25},{"$f":"IF('Lisans Öğr.Gör. Sonuç'!I13=\"\",\"\",'Lisans Öğr.Gör. Sonuç'!I13)","v":76.66},{"$f":"IF('Lisans Öğr.Gör. Sonuç'!J13=\"\",\"\",'Lisans Öğr.Gör. Sonuç'!J13)","v":22.997999999999998},{"$f":"IF('Lisans Öğr.Gör. Sonuç'!K13=\"\",\"\",'Lisans Öğr.Gör. Sonuç'!K13)","v":63},{"$f":"IF('Lisans Öğr.Gör. Sonuç'!L13=\"\",\"\",'Lisans Öğr.Gör. Sonuç'!L13)","v":18.899999999999999},{"$f":"IF('Lisans Öğr.Gör. Sonuç'!M13=\"\",\"\",'Lisans Öğr.Gör. Sonuç'!M13)","v":72.657143999999988},{"$f":"IF('Lisans Öğr.Gör. Sonuç'!N13=\"\",\"\",'Lisans Öğr.Gör. Sonuç'!N13)","v":"BAŞARILI (YEDEK)"}]
[{"$f":"IF('Lisans Öğr.Gör. Sonuç'!A14=\"\",\"\",'Lisans Öğr.Gör. Sonuç'!A14)","v":3},{"$f":"IF('Lisans Öğr.Gör. Sonuç'!B14=\"\",\"\",LEFT('Lisans Öğr.Gör. Sonuç'!B14,3)&REPT(\"*\",4)&RIGHT('Lisans Öğr.Gör. Sonuç'!B14,2))","v":"111****11"},{"$f":"IF('Lisans Öğr.Gör. Sonuç'!C14=\"\",\"\",IF(ISERR(FIND(\" \",'Lisans Öğr.Gör. Sonuç'!C14))=TRUE,LEFT('Lisans Öğr.Gör. Sonuç'!C14,2)&REPT(\"*\",3),LEFT('Lisans Öğr.Gör. Sonuç'!C14,2)&REPT(\"*\",3)&\" \"&MID('Lisans Öğr.Gör. Sonuç'!C14,FIND(\" \",'Lisans Öğr.Gör. Sonuç'!C14)+1,2)&REPT(\"*\",3)))","v":"Ör***"},{"$f":"IF('Lisans Öğr.Gör. Sonuç'!D14=\"\",\"\",IF(ISERR(FIND(\" \",'Lisans Öğr.Gör. Sonuç'!D14))=TRUE,LEFT('Lisans Öğr.Gör. Sonuç'!D14,2)&REPT(\"*\",3),LEFT('Lisans Öğr.Gör. Sonuç'!D14,2)&REPT(\"*\",3)&\" \"&MID('Lisans Öğr.Gör. Sonuç'!D14,FIND(\" \",'Lisans Öğr.Gör. Sonuç'!D14)+1,2)&REPT(\"*\",3)))","v":"Ör*** Ör***"},{"$f":"IF('Lisans Öğr.Gör. Sonuç'!E14=\"\",\"\",'Lisans Öğr.Gör. Sonuç'!E14)","v":84.431349999999995},{"$f":"IF('Lisans Öğr.Gör. Sonuç'!F14=\"\",\"\",'Lisans Öğr.Gör. Sonuç'!F14)","v":25.329404999999998},{"$f":"IF('Lisans Öğr.Gör. Sonuç'!G14=\"\",\"\",'Lisans Öğr.Gör. Sonuç'!G14)","v":70},{"$f":"IF('Lisans Öğr.Gör. Sonuç'!H14=\"\",\"\",'Lisans Öğr.Gör. Sonuç'!H14)","v":7},{"$f":"IF('Lisans Öğr.Gör. Sonuç'!I14=\"\",\"\",'Lisans Öğr.Gör. Sonuç'!I14)","v":83.66},{"$f":"IF('Lisans Öğr.Gör. Sonuç'!J14=\"\",\"\",'Lisans Öğr.Gör. Sonuç'!J14)","v":25.097999999999999},{"$f":"IF('Lisans Öğr.Gör. Sonuç'!K14=\"\",\"\",'Lisans Öğr.Gör. Sonuç'!K14)","v":45},{"$f":"IF('Lisans Öğr.Gör. Sonuç'!L14=\"\",\"\",'Lisans Öğr.Gör. Sonuç'!L14)","v":13.5},{"$f":"IF('Lisans Öğr.Gör. Sonuç'!M14=\"\",\"\",'Lisans Öğr.Gör. Sonuç'!M14)","v":70.927404999999993},{"$f":"IF('Lisans Öğr.Gör. Sonuç'!N14=\"\",\"\",'Lisans Öğr.Gör. Sonuç'!N14)","v":"YÖNETMELİK GEREĞİ ELENDİ*"}]
[{"$f":"IF('Lisans Öğr.Gör. Sonuç'!A15=\"\",\"\",'Lisans Öğr.Gör. Sonuç'!A15)","v":4},{"$f":"IF('Lisans Öğr.Gör. Sonuç'!B15=\"\",\"\",LEFT('Lisans Öğr.Gör. Sonuç'!B15,3)&REPT(\"*\",4)&RIGHT('Lisans Öğr.Gör. Sonuç'!B15,2))","v":"111****11"},{"$f":"IF('Lisans Öğr.Gör. Sonuç'!C15=\"\",\"\",IF(ISERR(FIND(\" \",'Lisans Öğr.Gör. Sonuç'!C15))=TRUE,LEFT('Lisans Öğr.Gör. Sonuç'!C15,2)&REPT(\"*\",3),LEFT('Lisans Öğr.Gör. Sonuç'!C15,2)&REPT(\"*\",3)&\" \"&MID('Lisans Öğr.Gör. Sonuç'!C15,FIND(\" \",'Lisans Öğr.Gör. Sonuç'!C15)+1,2)&REPT(\"*\",3)))","v":"Ör*** Ör***"},{"$f":"IF('Lisans Öğr.Gör. Sonuç'!D15=\"\",\"\",IF(ISERR(FIND(\" \",'Lisans Öğr.Gör. Sonuç'!D15))=TRUE,LEFT('Lisans Öğr.Gör. Sonuç'!D15,2)&REPT(\"*\",3),LEFT('Lisans Öğr.Gör. Sonuç'!D15,2)&REPT(\"*\",3)&\" \"&MID('Lisans Öğr.Gör. Sonuç'!D15,FIND(\" \",'Lisans Öğr.Gör. Sonuç'!D15)+1,2)&REPT(\"*\",3)))","v":"Ör*** Ör***"},{"$f":"IF('Lisans Öğr.Gör. Sonuç'!E15=\"\",\"\",'Lisans Öğr.Gör. Sonuç'!E15)","v":84.431349999999995},{"$f":"IF('Lisans Öğr.Gör. Sonuç'!F15=\"\",\"\",'Lisans Öğr.Gör. Sonuç'!F15)","v":25.329404999999998},{"$f":"IF('Lisans Öğr.Gör. Sonuç'!G15=\"\",\"\",'Lisans Öğr.Gör. Sonuç'!G15)","v":50},{"$f":"IF('Lisans Öğr.Gör. Sonuç'!H15=\"\",\"\",'Lisans Öğr.Gör. Sonuç'!H15)","v":5},{"$f":"IF('Lisans Öğr.Gör. Sonuç'!I15=\"\",\"\",'Lisans Öğr.Gör. Sonuç'!I15)","v":76.66},{"$f":"IF('Lisans Öğr.Gör. Sonuç'!J15=\"\",\"\",'Lisans Öğr.Gör. Sonuç'!J15)","v":22.997999999999998},{"$f":"IF('Lisans Öğr.Gör. Sonuç'!K15=\"\",\"\",'Lisans Öğr.Gör. Sonuç'!K15)","v":35},{"$f":"IF('Lisans Öğr.Gör. Sonuç'!L15=\"\",\"\",'Lisans Öğr.Gör. Sonuç'!L15)","v":10.5},{"$f":"IF('Lisans Öğr.Gör. Sonuç'!M15=\"\",\"\",'Lisans Öğr.Gör. Sonuç'!M15)","v":63.827404999999999},{"$f":"IF('Lisans Öğr.Gör. Sonuç'!N15=\"\",\"\",'Lisans Öğr.Gör. Sonuç'!N15)","v":"BAŞARISIZ**"}]
[{"$f":"IF('Lisans Öğr.Gör. Sonuç'!A16=\"\",\"\",'Lisans Öğr.Gör. Sonuç'!A16)","v":5},{"$f":"IF('Lisans Öğr.Gör. Sonuç'!B16=\"\",\"\",LEFT('Lisans Öğr.Gör. Sonuç'!B16,3)&REPT(\"*\",4)&RIGHT('Lisans Öğr.Gör. Sonuç'!B16,2))","v":"111****11"},{"$f":"IF('Lisans Öğr.Gör. Sonuç'!C16=\"\",\"\",IF(ISERR(FIND(\" \",'Lisans Öğr.Gör. Sonuç'!C16))=TRUE,LEFT('Lisans Öğr.Gör. Sonuç'!C16,2)&REPT(\"*\",3),LEFT('Lisans Öğr.Gör. Sonuç'!C16,2)&REPT(\"*\",3)&\" \"&MID('Lisans Öğr.Gör. Sonuç'!C16,FIND(\" \",'Lisans Öğr.Gör. Sonuç'!C16)+1,2)&REPT(\"*\",3)))","v":"Ör***"},{"$f":"IF('Lisans Öğr.Gör. Sonuç'!D16=\"\",\"\",IF(ISERR(FIND(\" \",'Lisans Öğr.Gör. Sonuç'!D16))=TRUE,LEFT('Lisans Öğr.Gör. Sonuç'!D16,2)&REPT(\"*\",3),LEFT('Lisans Öğr.Gör. Sonuç'!D16,2)&REPT(\"*\",3)&\" \"&MID('Lisans Öğr.Gör. Sonuç'!D16,FIND(\" \",'Lisans Öğr.Gör. Sonuç'!D16)+1,2)&REPT(\"*\",3)))","v":"Ör***"},{"$f":"IF('Lisans Öğr.Gör. Sonuç'!E16=\"\",\"\",'Lisans Öğr.Gör. Sonuç'!E16)","v":84.431349999999995},{"$f":"IF('Lisans Öğr.Gör. Sonuç'!F16=\"\",\"\",'Lisans Öğr.Gör. Sonuç'!F16)","v":25.329404999999998},{"$f":"IF('Lisans Öğr.Gör. Sonuç'!G16=\"\",\"\",'Lisans Öğr.Gör. Sonuç'!G16)","v":70},{"$f":"IF('Lisans Öğr.Gör. Sonuç'!H16=\"\",\"\",'Lisans Öğr.Gör. Sonuç'!H16)","v":7},{"$f":"IF('Lisans Öğr.Gör. Sonuç'!I16=\"\",\"\",'Lisans Öğr.Gör. Sonuç'!I16)","v":83.66},{"$f":"IF('Lisans Öğr.Gör. Sonuç'!J16=\"\",\"\",'Lisans Öğr.Gör. Sonuç'!J16)","v":25.097999999999999},{"$f":"IF('Lisans Öğr.Gör. Sonuç'!K16=\"\",\"\",'Lisans Öğr.Gör. Sonuç'!K16)","v":"Sınava Girmedi"},{"$f":"IF('Lisans Öğr.Gör. Sonuç'!L16=\"\",\"\",'Lisans Öğr.Gör. Sonuç'!L16)","v":"-"},{"$f":"IF('Lisans Öğr.Gör. Sonuç'!M16=\"\",\"\",'Lisans Öğr.Gör. Sonuç'!M16)","v":"-"},{"$f":"IF('Lisans Öğr.Gör. Sonuç'!N16=\"\",\"\",'Lisans Öğr.Gör. Sonuç'!N16)","v":"SINAVA GİRMEDİ"}]
[{"$f":"IF('Lisans Öğr.Gör. Sonuç'!A17=\"\",\"\",'Lisans Öğr.Gör. Sonuç'!A17)","v":""},{"$f":"IF('Lisans Öğr.Gör. Sonuç'!B17=\"\",\"\",LEFT('Lisans Öğr.Gör. Sonuç'!B17,3)&REPT(\"*\",4)&RIGHT('Lisans Öğr.Gör. Sonuç'!B17,2))","v":""},{"$f":"IF('Lisans Öğr.Gör. Sonuç'!C17=\"\",\"\",IF(ISERR(FIND(\" \",'Lisans Öğr.Gör. Sonuç'!C17))=TRUE,LEFT('Lisans Öğr.Gör. Sonuç'!C17,2)&REPT(\"*\",3),LEFT('Lisans Öğr.Gör. Sonuç'!C17,2)&REPT(\"*\",3)&\" \"&MID('Lisans Öğr.Gör. Sonuç'!C17,FIND(\" \",'Lisans Öğr.Gör. Sonuç'!C17)+1,2)&REPT(\"*\",3)))","v":""},{"$f":"IF('Lisans Öğr.Gör. Sonuç'!D17=\"\",\"\",IF(ISERR(FIND(\" \",'Lisans Öğr.Gör. Sonuç'!D17))=TRUE,LEFT('Lisans Öğr.Gör. Sonuç'!D17,2)&REPT(\"*\",3),LEFT('Lisans Öğr.Gör. Sonuç'!D17,2)&REPT(\"*\",3)&\" \"&MID('Lisans Öğr.Gör. Sonuç'!D17,FIND(\" \",'Lisans Öğr.Gör. Sonuç'!D17)+1,2)&REPT(\"*\",3)))","v":""},{"$f":"IF('Lisans Öğr.Gör. Sonuç'!E17=\"\",\"\",'Lisans Öğr.Gör. Sonuç'!E17)","v":""},{"$f":"IF('Lisans Öğr.Gör. Sonuç'!F17=\"\",\"\",'Lisans Öğr.Gör. Sonuç'!F17)","v":""},{"$f":"IF('Lisans Öğr.Gör. Sonuç'!G17=\"\",\"\",'Lisans Öğr.Gör. Sonuç'!G17)","v":""},{"$f":"IF('Lisans Öğr.Gör. Sonuç'!H17=\"\",\"\",'Lisans Öğr.Gör. Sonuç'!H17)","v":""},{"$f":"IF('Lisans Öğr.Gör. Sonuç'!I17=\"\",\"\",'Lisans Öğr.Gör. Sonuç'!I17)","v":""},{"$f":"IF('Lisans Öğr.Gör. Sonuç'!J17=\"\",\"\",'Lisans Öğr.Gör. Sonuç'!J17)","v":""},{"$f":"IF('Lisans Öğr.Gör. Sonuç'!K17=\"\",\"\",'Lisans Öğr.Gör. Sonuç'!K17)","v":""},{"$f":"IF('Lisans Öğr.Gör. Sonuç'!L17=\"\",\"\",'Lisans Öğr.Gör. Sonuç'!L17)","v":""},{"$f":"IF('Lisans Öğr.Gör. Sonuç'!M17=\"\",\"\",'Lisans Öğr.Gör. Sonuç'!M17)","v":""},{"$f":"IF('Lisans Öğr.Gör. Sonuç'!N17=\"\",\"\",'Lisans Öğr.Gör. Sonuç'!N17)","v":""}]
[{"$f":"IF('Lisans Öğr.Gör. Sonuç'!A18=\"\",\"\",'Lisans Öğr.Gör. Sonuç'!A18)","v":""},{"$f":"IF('Lisans Öğr.Gör. Sonuç'!B18=\"\",\"\",LEFT('Lisans Öğr.Gör. Sonuç'!B18,3)&REPT(\"*\",4)&RIGHT('Lisans Öğr.Gör. Sonuç'!B18,2))","v":""},{"$f":"IF('Lisans Öğr.Gör. Sonuç'!C18=\"\",\"\",IF(ISERR(FIND(\" \",'Lisans Öğr.Gör. Sonuç'!C18))=TRUE,LEFT('Lisans Öğr.Gör. Sonuç'!C18,2)&REPT(\"*\",3),LEFT('Lisans Öğr.Gör. Sonuç'!C18,2)&REPT(\"*\",3)&\" \"&MID('Lisans Öğr.Gör. Sonuç'!C18,FIND(\" \",'Lisans Öğr.Gör. Sonuç'!C18)+1,2)&REPT(\"*\",3)))","v":""},{"$f":"IF('Lisans Öğr.Gör. Sonuç'!D18=\"\",\"\",IF(ISERR(FIND(\" \",'Lisans Öğr.Gör. Sonuç'!D18))=TRUE,LEFT('Lisans Öğr.Gör. Sonuç'!D18,2)&REPT(\"*\",3),LEFT('Lisans Öğr.Gör. Sonuç'!D18,2)&REPT(\"*\",3)&\" \"&MID('Lisans Öğr.Gör. Sonuç'!D18,FIND(\" \",'Lisans Öğr.Gör. Sonuç'!D18)+1,2)&REPT(\"*\",3)))","v":""},{"$f":"IF('Lisans Öğr.Gör. Sonuç'!E18=\"\",\"\",'Lisans Öğr.Gör. Sonuç'!E18)","v":""},{"$f":"IF('Lisans Öğr.Gör. Sonuç'!F18=\"\",\"\",'Lisans Öğr.Gör. Sonuç'!F18)","v":""},{"$f":"IF('Lisans Öğr.Gör. Sonuç'!G18=\"\",\"\",'Lisans Öğr.Gör. Sonuç'!G18)","v":""},{"$f":"IF('Lisans Öğr.Gör. Sonuç'!H18=\"\",\"\",'Lisans Öğr.Gör. Sonuç'!H18)","v":""},{"$f":"IF('Lisans Öğr.Gör. Sonuç'!I18=\"\",\"\",'Lisans Öğr.Gör. Sonuç'!I18)","v":""},{"$f":"IF('Lisans Öğr.Gör. Sonuç'!J18=\"\",\"\",'Lisans Öğr.Gör. Sonuç'!J18)","v":""},{"$f":"IF('Lisans Öğr.Gör. Sonuç'!K18=\"\",\"\",'Lisans Öğr.Gör. Sonuç'!K18)","v":""},{"$f":"IF('Lisans Öğr.Gör. Sonuç'!L18=\"\",\"\",'Lisans Öğr.Gör. Sonuç'!L18)","v":""},{"$f":"IF('Lisans Öğr.Gör. Sonuç'!M18=\"\",\"\",'Lisans Öğr.Gör. Sonuç'!M18)","v":""},{"$f":"IF('Lisans Öğr.Gör. Sonuç'!N18=\"\",\"\",'Lisans Öğr.Gör. Sonuç'!N18)","v":""}]
[{"$f":"IF('Lisans Öğr.Gör. Sonuç'!A19=\"\",\"\",'Lisans Öğr.Gör. Sonuç'!A19)","v":""},{"$f":"IF('Lisans Öğr.Gör. Sonuç'!B19=\"\",\"\",LEFT('Lisans Öğr.Gör. Sonuç'!B19,3)&REPT(\"*\",4)&RIGHT('Lisans Öğr.Gör. Sonuç'!B19,2))","v":""},{"$f":"IF('Lisans Öğr.Gör. Sonuç'!C19=\"\",\"\",IF(ISERR(FIND(\" \",'Lisans Öğr.Gör. Sonuç'!C19))=TRUE,LEFT('Lisans Öğr.Gör. Sonuç'!C19,2)&REPT(\"*\",3),LEFT('Lisans Öğr.Gör. Sonuç'!C19,2)&REPT(\"*\",3)&\" \"&MID('Lisans Öğr.Gör. Sonuç'!C19,FIND(\" \",'Lisans Öğr.Gör. Sonuç'!C19)+1,2)&REPT(\"*\",3)))","v":""},{"$f":"IF('Lisans Öğr.Gör. Sonuç'!D19=\"\",\"\",IF(ISERR(FIND(\" \",'Lisans Öğr.Gör. Sonuç'!D19))=TRUE,LEFT('Lisans Öğr.Gör. Sonuç'!D19,2)&REPT(\"*\",3),LEFT('Lisans Öğr.Gör. Sonuç'!D19,2)&REPT(\"*\",3)&\" \"&MID('Lisans Öğr.Gör. Sonuç'!D19,FIND(\" \",'Lisans Öğr.Gör. Sonuç'!D19)+1,2)&REPT(\"*\",3)))","v":""},{"$f":"IF('Lisans Öğr.Gör. Sonuç'!E19=\"\",\"\",'Lisans Öğr.Gör. Sonuç'!E19)","v":""},{"$f":"IF('Lisans Öğr.Gör. Sonuç'!F19=\"\",\"\",'Lisans Öğr.Gör. Sonuç'!F19)","v":""},{"$f":"IF('Lisans Öğr.Gör. Sonuç'!G19=\"\",\"\",'Lisans Öğr.Gör. Sonuç'!G19)","v":""},{"$f":"IF('Lisans Öğr.Gör. Sonuç'!H19=\"\",\"\",'Lisans Öğr.Gör. Sonuç'!H19)","v":""},{"$f":"IF('Lisans Öğr.Gör. Sonuç'!I19=\"\",\"\",'Lisans Öğr.Gör. Sonuç'!I19)","v":""},{"$f":"IF('Lisans Öğr.Gör. Sonuç'!J19=\"\",\"\",'Lisans Öğr.Gör. Sonuç'!J19)","v":""},{"$f":"IF('Lisans Öğr.Gör. Sonuç'!K19=\"\",\"\",'Lisans Öğr.Gör. Sonuç'!K19)","v":""},{"$f":"IF('Lisans Öğr.Gör. Sonuç'!L19=\"\",\"\",'Lisans Öğr.Gör. Sonuç'!L19)","v":""},{"$f":"IF('Lisans Öğr.Gör. Sonuç'!M19=\"\",\"\",'Lisans Öğr.Gör. Sonuç'!M19)","v":""},{"$f":"IF('Lisans Öğr.Gör. Sonuç'!N19=\"\",\"\",'Lisans Öğr.Gör. Sonuç'!N19)","v":""}]
[{"$f":"IF('Lisans Öğr.Gör. Sonuç'!A20=\"\",\"\",'Lisans Öğr.Gör. Sonuç'!A20)","v":""},{"$f":"IF('Lisans Öğr.Gör. Sonuç'!B20=\"\",\"\",LEFT('Lisans Öğr.Gör. Sonuç'!B20,3)&REPT(\"*\",4)&RIGHT('Lisans Öğr.Gör. Sonuç'!B20,2))","v":""},{"$f":"IF('Lisans Öğr.Gör. Sonuç'!C20=\"\",\"\",IF(ISERR(FIND(\" \",'Lisans Öğr.Gör. Sonuç'!C20))=TRUE,LEFT('Lisans Öğr.Gör. Sonuç'!C20,2)&REPT(\"*\",3),LEFT('Lisans Öğr.Gör. Sonuç'!C20,2)&REPT(\"*\",3)&\" \"&MID('Lisans Öğr.Gör. Sonuç'!C20,FIND(\" \",'Lisans Öğr.Gör. Sonuç'!C20)+1,2)&REPT(\"*\",3)))","v":""},{"$f":"IF('Lisans Öğr.Gör. Sonuç'!D20=\"\",\"\",IF(ISERR(FIND(\" \",'Lisans Öğr.Gör. Sonuç'!D20))=TRUE,LEFT('Lisans Öğr.Gör. Sonuç'!D20,2)&REPT(\"*\",3),LEFT('Lisans Öğr.Gör. Sonuç'!D20,2)&REPT(\"*\",3)&\" \"&MID('Lisans Öğr.Gör. Sonuç'!D20,FIND(\" \",'Lisans Öğr.Gör. Sonuç'!D20)+1,2)&REPT(\"*\",3)))","v":""},{"$f":"IF('Lisans Öğr.Gör. Sonuç'!E20=\"\",\"\",'Lisans Öğr.Gör. Sonuç'!E20)","v":""},{"$f":"IF('Lisans Öğr.Gör. Sonuç'!F20=\"\",\"\",'Lisans Öğr.Gör. Sonuç'!F20)","v":""},{"$f":"IF('Lisans Öğr.Gör. Sonuç'!G20=\"\",\"\",'Lisans Öğr.Gör. Sonuç'!G20)","v":""},{"$f":"IF('Lisans Öğr.Gör. Sonuç'!H20=\"\",\"\",'Lisans Öğr.Gör. Sonuç'!H20)","v":""},{"$f":"IF('Lisans Öğr.Gör. Sonuç'!I20=\"\",\"\",'Lisans Öğr.Gör. Sonuç'!I20)","v":""},{"$f":"IF('Lisans Öğr.Gör. Sonuç'!J20=\"\",\"\",'Lisans Öğr.Gör. Sonuç'!J20)","v":""},{"$f":"IF('Lisans Öğr.Gör. Sonuç'!K20=\"\",\"\",'Lisans Öğr.Gör. Sonuç'!K20)","v":""},{"$f":"IF('Lisans Öğr.Gör. Sonuç'!L20=\"\",\"\",'Lisans Öğr.Gör. Sonuç'!L20)","v":""},{"$f":"IF('Lisans Öğr.Gör. Sonuç'!M20=\"\",\"\",'Lisans Öğr.Gör. Sonuç'!M20)","v":""},{"$f":"IF('Lisans Öğr.Gör. Sonuç'!N20=\"\",\"\",'Lisans Öğr.Gör. Sonuç'!N20)","v":""}]
[{"$f":"IF('Lisans Öğr.Gör. Sonuç'!A21=\"\",\"\",'Lisans Öğr.Gör. Sonuç'!A21)","v":""},{"$f":"IF('Lisans Öğr.Gör. Sonuç'!B21=\"\",\"\",LEFT('Lisans Öğr.Gör. Sonuç'!B21,3)&REPT(\"*\",4)&RIGHT('Lisans Öğr.Gör. Sonuç'!B21,2))","v":""},{"$f":"IF('Lisans Öğr.Gör. Sonuç'!C21=\"\",\"\",IF(ISERR(FIND(\" \",'Lisans Öğr.Gör. Sonuç'!C21))=TRUE,LEFT('Lisans Öğr.Gör. Sonuç'!C21,2)&REPT(\"*\",3),LEFT('Lisans Öğr.Gör. Sonuç'!C21,2)&REPT(\"*\",3)&\" \"&MID('Lisans Öğr.Gör. Sonuç'!C21,FIND(\" \",'Lisans Öğr.Gör. Sonuç'!C21)+1,2)&REPT(\"*\",3)))","v":""},{"$f":"IF('Lisans Öğr.Gör. Sonuç'!D21=\"\",\"\",IF(ISERR(FIND(\" \",'Lisans Öğr.Gör. Sonuç'!D21))=TRUE,LEFT('Lisans Öğr.Gör. Sonuç'!D21,2)&REPT(\"*\",3),LEFT('Lisans Öğr.Gör. Sonuç'!D21,2)&REPT(\"*\",3)&\" \"&MID('Lisans Öğr.Gör. Sonuç'!D21,FIND(\" \",'Lisans Öğr.Gör. Sonuç'!D21)+1,2)&REPT(\"*\",3)))","v":""},{"$f":"IF('Lisans Öğr.Gör. Sonuç'!E21=\"\",\"\",'Lisans Öğr.Gör. Sonuç'!E21)","v":""},{"$f":"IF('Lisans Öğr.Gör. Sonuç'!F21=\"\",\"\",'Lisans Öğr.Gör. Sonuç'!F21)","v":""},{"$f":"IF('Lisans Öğr.Gör. Sonuç'!G21=\"\",\"\",'Lisans Öğr.Gör. Sonuç'!G21)","v":""},{"$f":"IF('Lisans Öğr.Gör. Sonuç'!H21=\"\",\"\",'Lisans Öğr.Gör. Sonuç'!H21)","v":""},{"$f":"IF('Lisans Öğr.Gör. Sonuç'!I21=\"\",\"\",'Lisans Öğr.Gör. Sonuç'!I21)","v":""},{"$f":"IF('Lisans Öğr.Gör. Sonuç'!J21=\"\",\"\",'Lisans Öğr.Gör. Sonuç'!J21)","v":""},{"$f":"IF('Lisans Öğr.Gör. Sonuç'!K21=\"\",\"\",'Lisans Öğr.Gör. Sonuç'!K21)","v":""},{"$f":"IF('Lisans Öğr.Gör. Sonuç'!L21=\"\",\"\",'Lisans Öğr.Gör. Sonuç'!L21)","v":""},{"$f":"IF('Lisans Öğr.Gör. Sonuç'!M21=\"\",\"\",'Lisans Öğr.Gör. Sonuç'!M21)","v":""},{"$f":"IF('Lisans Öğr.Gör. Sonuç'!N21=\"\",\"\",'Lisans Öğr.Gör. Sonuç'!N21)","v":""}]
[{"$f":"IF('Lisans Öğr.Gör. Sonuç'!A22=\"\",\"\",'Lisans Öğr.Gör. Sonuç'!A22)","v":""},{"$f":"IF('Lisans Öğr.Gör. Sonuç'!B22=\"\",\"\",LEFT('Lisans Öğr.Gör. Sonuç'!B22,3)&REPT(\"*\",4)&RIGHT('Lisans Öğr.Gör. Sonuç'!B22,2))","v":""},{"$f":"IF('Lisans Öğr.Gör. Sonuç'!C22=\"\",\"\",IF(ISERR(FIND(\" \",'Lisans Öğr.Gör. Sonuç'!C22))=TRUE,LEFT('Lisans Öğr.Gör. Sonuç'!C22,2)&REPT(\"*\",3),LEFT('Lisans Öğr.Gör. Sonuç'!C22,2)&REPT(\"*\",3)&\" \"&MID('Lisans Öğr.Gör. Sonuç'!C22,FIND(\" \",'Lisans Öğr.Gör. Sonuç'!C22)+1,2)&REPT(\"*\",3)))","v":""},{"$f":"IF('Lisans Öğr.Gör. Sonuç'!D22=\"\",\"\",IF(ISERR(FIND(\" \",'Lisans Öğr.Gör. Sonuç'!D22))=TRUE,LEFT('Lisans Öğr.Gör. Sonuç'!D22,2)&REPT(\"*\",3),LEFT('Lisans Öğr.Gör. Sonuç'!D22,2)&REPT(\"*\",3)&\" \"&MID('Lisans Öğr.Gör. Sonuç'!D22,FIND(\" \",'Lisans Öğr.Gör. Sonuç'!D22)+1,2)&REPT(\"*\",3)))","v":""},{"$f":"IF('Lisans Öğr.Gör. Sonuç'!E22=\"\",\"\",'Lisans Öğr.Gör. Sonuç'!E22)","v":""},{"$f":"IF('Lisans Öğr.Gör. Sonuç'!F22=\"\",\"\",'Lisans Öğr.Gör. Sonuç'!F22)","v":""},{"$f":"IF('Lisans Öğr.Gör. Sonuç'!G22=\"\",\"\",'Lisans Öğr.Gör. Sonuç'!G22)","v":""},{"$f":"IF('Lisans Öğr.Gör. Sonuç'!H22=\"\",\"\",'Lisans Öğr.Gör. Sonuç'!H22)","v":""},{"$f":"IF('Lisans Öğr.Gör. Sonuç'!I22=\"\",\"\",'Lisans Öğr.Gör. Sonuç'!I22)","v":""},{"$f":"IF('Lisans Öğr.Gör. Sonuç'!J22=\"\",\"\",'Lisans Öğr.Gör. Sonuç'!J22)","v":""},{"$f":"IF('Lisans Öğr.Gör. Sonuç'!K22=\"\",\"\",'Lisans Öğr.Gör. Sonuç'!K22)","v":""},{"$f":"IF('Lisans Öğr.Gör. Sonuç'!L22=\"\",\"\",'Lisans Öğr.Gör. Sonuç'!L22)","v":""},{"$f":"IF('Lisans Öğr.Gör. Sonuç'!M22=\"\",\"\",'Lisans Öğr.Gör. Sonuç'!M22)","v":""},{"$f":"IF('Lisans Öğr.Gör. Sonuç'!N22=\"\",\"\",'Lisans Öğr.Gör. Sonuç'!N22)","v":""}]
[{"$f":"IF('Lisans Öğr.Gör. Sonuç'!A23=\"\",\"\",'Lisans Öğr.Gör. Sonuç'!A23)","v":""},{"$f":"IF('Lisans Öğr.Gör. Sonuç'!B23=\"\",\"\",LEFT('Lisans Öğr.Gör. Sonuç'!B23,3)&REPT(\"*\",4)&RIGHT('Lisans Öğr.Gör. Sonuç'!B23,2))","v":""},{"$f":"IF('Lisans Öğr.Gör. Sonuç'!C23=\"\",\"\",IF(ISERR(FIND(\" \",'Lisans Öğr.Gör. Sonuç'!C23))=TRUE,LEFT('Lisans Öğr.Gör. Sonuç'!C23,2)&REPT(\"*\",3),LEFT('Lisans Öğr.Gör. Sonuç'!C23,2)&REPT(\"*\",3)&\" \"&MID('Lisans Öğr.Gör. Sonuç'!C23,FIND(\" \",'Lisans Öğr.Gör. Sonuç'!C23)+1,2)&REPT(\"*\",3)))","v":""},{"$f":"IF('Lisans Öğr.Gör. Sonuç'!D23=\"\",\"\",IF(ISERR(FIND(\" \",'Lisans Öğr.Gör. Sonuç'!D23))=TRUE,LEFT('Lisans Öğr.Gör. Sonuç'!D23,2)&REPT(\"*\",3),LEFT('Lisans Öğr.Gör. Sonuç'!D23,2)&REPT(\"*\",3)&\" \"&MID('Lisans Öğr.Gör. Sonuç'!D23,FIND(\" \",'Lisans Öğr.Gör. Sonuç'!D23)+1,2)&REPT(\"*\",3)))","v":""},{"$f":"IF('Lisans Öğr.Gör. Sonuç'!E23=\"\",\"\",'Lisans Öğr.Gör. Sonuç'!E23)","v":""},{"$f":"IF('Lisans Öğr.Gör. Sonuç'!F23=\"\",\"\",'Lisans Öğr.Gör. Sonuç'!F23)","v":""},{"$f":"IF('Lisans Öğr.Gör. Sonuç'!G23=\"\",\"\",'Lisans Öğr.Gör. Sonuç'!G23)","v":""},{"$f":"IF('Lisans Öğr.Gör. Sonuç'!H23=\"\",\"\",'Lisans Öğr.Gör. Sonuç'!H23)","v":""},{"$f":"IF('Lisans Öğr.Gör. Sonuç'!I23=\"\",\"\",'Lisans Öğr.Gör. Sonuç'!I23)","v":""},{"$f":"IF('Lisans Öğr.Gör. Sonuç'!J23=\"\",\"\",'Lisans Öğr.Gör. Sonuç'!J23)","v":""},{"$f":"IF('Lisans Öğr.Gör. Sonuç'!K23=\"\",\"\",'Lisans Öğr.Gör. Sonuç'!K23)","v":""},{"$f":"IF('Lisans Öğr.Gör. Sonuç'!L23=\"\",\"\",'Lisans Öğr.Gör. Sonuç'!L23)","v":""},{"$f":"IF('Lisans Öğr.Gör. Sonuç'!M23=\"\",\"\",'Lisans Öğr.Gör. Sonuç'!M23)","v":""},{"$f":"IF('Lisans Öğr.Gör. Sonuç'!N23=\"\",\"\",'Lisans Öğr.Gör. Sonuç'!N23)","v":""}]
[{"$f":"IF('Lisans Öğr.Gör. Sonuç'!A24=\"\",\"\",'Lisans Öğr.Gör. Sonuç'!A24)","v":""},{"$f":"IF('Lisans Öğr.Gör. Sonuç'!B24=\"\",\"\",LEFT('Lisans Öğr.Gör. Sonuç'!B24,3)&REPT(\"*\",4)&RIGHT('Lisans Öğr.Gör. Sonuç'!B24,2))","v":""},{"$f":"IF('Lisans Öğr.Gör. Sonuç'!C24=\"\",\"\",IF(ISERR(FIND(\" \",'Lisans Öğr.Gör. Sonuç'!C24))=TRUE,LEFT('Lisans Öğr.Gör. Sonuç'!C24,2)&REPT(\"*\",3),LEFT('Lisans Öğr.Gör. Sonuç'!C24,2)&REPT(\"*\",3)&\" \"&MID('Lisans Öğr.Gör. Sonuç'!C24,FIND(\" \",'Lisans Öğr.Gör. Sonuç'!C24)+1,2)&REPT(\"*\",3)))","v":""},{"$f":"IF('Lisans Öğr.Gör. Sonuç'!D24=\"\",\"\",IF(ISERR(FIND(\" \",'Lisans Öğr.Gör. Sonuç'!D24))=TRUE,LEFT('Lisans Öğr.Gör. Sonuç'!D24,2)&REPT(\"*\",3),LEFT('Lisans Öğr.Gör. Sonuç'!D24,2)&REPT(\"*\",3)&\" \"&MID('Lisans Öğr.Gör. Sonuç'!D24,FIND(\" \",'Lisans Öğr.Gör. Sonuç'!D24)+1,2)&REPT(\"*\",3)))","v":""},{"$f":"IF('Lisans Öğr.Gör. Sonuç'!E24=\"\",\"\",'Lisans Öğr.Gör. Sonuç'!E24)","v":""},{"$f":"IF('Lisans Öğr.Gör. Sonuç'!F24=\"\",\"\",'Lisans Öğr.Gör. Sonuç'!F24)","v":""},{"$f":"IF('Lisans Öğr.Gör. Sonuç'!G24=\"\",\"\",'Lisans Öğr.Gör. Sonuç'!G24)","v":""},{"$f":"IF('Lisans Öğr.Gör. Sonuç'!H24=\"\",\"\",'Lisans Öğr.Gör. Sonuç'!H24)","v":""},{"$f":"IF('Lisans Öğr.Gör. Sonuç'!I24=\"\",\"\",'Lisans Öğr.Gör. Sonuç'!I24)","v":""},{"$f":"IF('Lisans Öğr.Gör. Sonuç'!J24=\"\",\"\",'Lisans Öğr.Gör. Sonuç'!J24)","v":""},{"$f":"IF('Lisans Öğr.Gör. Sonuç'!K24=\"\",\"\",'Lisans Öğr.Gör. Sonuç'!K24)","v":""},{"$f":"IF('Lisans Öğr.Gör. Sonuç'!L24=\"\",\"\",'Lisans Öğr.Gör. Sonuç'!L24)","v":""},{"$f":"IF('Lisans Öğr.Gör. Sonuç'!M24=\"\",\"\",'Lisans Öğr.Gör. Sonuç'!M24)","v":""},{"$f":"IF('Lisans Öğr.Gör. Sonuç'!N24=\"\",\"\",'Lisans Öğr.Gör. Sonuç'!N24)","v":""}]
[{"$f":"IF('Lisans Öğr.Gör. Sonuç'!A25=\"\",\"\",'Lisans Öğr.Gör. Sonuç'!A25)","v":""},{"$f":"IF('Lisans Öğr.Gör. Sonuç'!B25=\"\",\"\",LEFT('Lisans Öğr.Gör. Sonuç'!B25,3)&REPT(\"*\",4)&RIGHT('Lisans Öğr.Gör. Sonuç'!B25,2))","v":""},{"$f":"IF('Lisans Öğr.Gör. Sonuç'!C25=\"\",\"\",IF(ISERR(FIND(\" \",'Lisans Öğr.Gör. Sonuç'!C25))=TRUE,LEFT('Lisans Öğr.Gör. Sonuç'!C25,2)&REPT(\"*\",3),LEFT('Lisans Öğr.Gör. Sonuç'!C25,2)&REPT(\"*\",3)&\" \"&MID('Lisans Öğr.Gör. Sonuç'!C25,FIND(\" \",'Lisans Öğr.Gör. Sonuç'!C25)+1,2)&REPT(\"*\",3)))","v":""},{"$f":"IF('Lisans Öğr.Gör. Sonuç'!D25=\"\",\"\",IF(ISERR(FIND(\" \",'Lisans Öğr.Gör. Sonuç'!D25))=TRUE,LEFT('Lisans Öğr.Gör. Sonuç'!D25,2)&REPT(\"*\",3),LEFT('Lisans Öğr.Gör. Sonuç'!D25,2)&REPT(\"*\",3)&\" \"&MID('Lisans Öğr.Gör. Sonuç'!D25,FIND(\" \",'Lisans Öğr.Gör. Sonuç'!D25)+1,2)&REPT(\"*\",3)))","v":""},{"$f":"IF('Lisans Öğr.Gör. Sonuç'!E25=\"\",\"\",'Lisans Öğr.Gör. Sonuç'!E25)","v":""},{"$f":"IF('Lisans Öğr.Gör. Sonuç'!F25=\"\",\"\",'Lisans Öğr.Gör. Sonuç'!F25)","v":""},{"$f":"IF('Lisans Öğr.Gör. Sonuç'!G25=\"\",\"\",'Lisans Öğr.Gör. Sonuç'!G25)","v":""},{"$f":"IF('Lisans Öğr.Gör. Sonuç'!H25=\"\",\"\",'Lisans Öğr.Gör. Sonuç'!H25)","v":""},{"$f":"IF('Lisans Öğr.Gör. Sonuç'!I25=\"\",\"\",'Lisans Öğr.Gör. Sonuç'!I25)","v":""},{"$f":"IF('Lisans Öğr.Gör. Sonuç'!J25=\"\",\"\",'Lisans Öğr.Gör. Sonuç'!J25)","v":""},{"$f":"IF('Lisans Öğr.Gör. Sonuç'!K25=\"\",\"\",'Lisans Öğr.Gör. Sonuç'!K25)","v":""},{"$f":"IF('Lisans Öğr.Gör. Sonuç'!L25=\"\",\"\",'Lisans Öğr.Gör. Sonuç'!L25)","v":""},{"$f":"IF('Lisans Öğr.Gör. Sonuç'!M25=\"\",\"\",'Lisans Öğr.Gör. Sonuç'!M25)","v":""},{"$f":"IF('Lisans Öğr.Gör. Sonuç'!N25=\"\",\"\",'Lisans Öğr.Gör. Sonuç'!N25)","v":""}]
[{"$f":"IF('Lisans Öğr.Gör. Sonuç'!A26=\"\",\"\",'Lisans Öğr.Gör. Sonuç'!A26)","v":""},{"$f":"IF('Lisans Öğr.Gör. Sonuç'!B26=\"\",\"\",LEFT('Lisans Öğr.Gör. Sonuç'!B26,3)&REPT(\"*\",4)&RIGHT('Lisans Öğr.Gör. Sonuç'!B26,2))","v":""},{"$f":"IF('Lisans Öğr.Gör. Sonuç'!C26=\"\",\"\",IF(ISERR(FIND(\" \",'Lisans Öğr.Gör. Sonuç'!C26))=TRUE,LEFT('Lisans Öğr.Gör. Sonuç'!C26,2)&REPT(\"*\",3),LEFT('Lisans Öğr.Gör. Sonuç'!C26,2)&REPT(\"*\",3)&\" \"&MID('Lisans Öğr.Gör. Sonuç'!C26,FIND(\" \",'Lisans Öğr.Gör. Sonuç'!C26)+1,2)&REPT(\"*\",3)))","v":""},{"$f":"IF('Lisans Öğr.Gör. Sonuç'!D26=\"\",\"\",IF(ISERR(FIND(\" \",'Lisans Öğr.Gör. Sonuç'!D26))=TRUE,LEFT('Lisans Öğr.Gör. Sonuç'!D26,2)&REPT(\"*\",3),LEFT('Lisans Öğr.Gör. Sonuç'!D26,2)&REPT(\"*\",3)&\" \"&MID('Lisans Öğr.Gör. Sonuç'!D26,FIND(\" \",'Lisans Öğr.Gör. Sonuç'!D26)+1,2)&REPT(\"*\",3)))","v":""},{"$f":"IF('Lisans Öğr.Gör. Sonuç'!E26=\"\",\"\",'Lisans Öğr.Gör. Sonuç'!E26)","v":""},{"$f":"IF('Lisans Öğr.Gör. Sonuç'!F26=\"\",\"\",'Lisans Öğr.Gör. Sonuç'!F26)","v":""},{"$f":"IF('Lisans Öğr.Gör. Sonuç'!G26=\"\",\"\",'Lisans Öğr.Gör. Sonuç'!G26)","v":""},{"$f":"IF('Lisans Öğr.Gör. Sonuç'!H26=\"\",\"\",'Lisans Öğr.Gör. Sonuç'!H26)","v":""},{"$f":"IF('Lisans Öğr.Gör. Sonuç'!I26=\"\",\"\",'Lisans Öğr.Gör. Sonuç'!I26)","v":""},{"$f":"IF('Lisans Öğr.Gör. Sonuç'!J26=\"\",\"\",'Lisans Öğr.Gör. Sonuç'!J26)","v":""},{"$f":"IF('Lisans Öğr.Gör. Sonuç'!K26=\"\",\"\",'Lisans Öğr.Gör. Sonuç'!K26)","v":""},{"$f":"IF('Lisans Öğr.Gör. Sonuç'!L26=\"\",\"\",'Lisans Öğr.Gör. Sonuç'!L26)","v":""},{"$f":"IF('Lisans Öğr.Gör. Sonuç'!M26=\"\",\"\",'Lisans Öğr.Gör. Sonuç'!M26)","v":""},{"$f":"IF('Lisans Öğr.Gör. Sonuç'!N26=\"\",\"\",'Lisans Öğr.Gör. Sonuç'!N26)","v":""}]
[{"$f":"IF('Lisans Öğr.Gör. Sonuç'!A27=\"\",\"\",'Lisans Öğr.Gör. Sonuç'!A27)","v":""},{"$f":"IF('Lisans Öğr.Gör. Sonuç'!B27=\"\",\"\",LEFT('Lisans Öğr.Gör. Sonuç'!B27,3)&REPT(\"*\",4)&RIGHT('Lisans Öğr.Gör. Sonuç'!B27,2))","v":""},{"$f":"IF('Lisans Öğr.Gör. Sonuç'!C27=\"\",\"\",IF(ISERR(FIND(\" \",'Lisans Öğr.Gör. Sonuç'!C27))=TRUE,LEFT('Lisans Öğr.Gör. Sonuç'!C27,2)&REPT(\"*\",3),LEFT('Lisans Öğr.Gör. Sonuç'!C27,2)&REPT(\"*\",3)&\" \"&MID('Lisans Öğr.Gör. Sonuç'!C27,FIND(\" \",'Lisans Öğr.Gör. Sonuç'!C27)+1,2)&REPT(\"*\",3)))","v":""},{"$f":"IF('Lisans Öğr.Gör. Sonuç'!D27=\"\",\"\",IF(ISERR(FIND(\" \",'Lisans Öğr.Gör. Sonuç'!D27))=TRUE,LEFT('Lisans Öğr.Gör. Sonuç'!D27,2)&REPT(\"*\",3),LEFT('Lisans Öğr.Gör. Sonuç'!D27,2)&REPT(\"*\",3)&\" \"&MID('Lisans Öğr.Gör. Sonuç'!D27,FIND(\" \",'Lisans Öğr.Gör. Sonuç'!D27)+1,2)&REPT(\"*\",3)))","v":""},{"$f":"IF('Lisans Öğr.Gör. Sonuç'!E27=\"\",\"\",'Lisans Öğr.Gör. Sonuç'!E27)","v":""},{"$f":"IF('Lisans Öğr.Gör. Sonuç'!F27=\"\",\"\",'Lisans Öğr.Gör. Sonuç'!F27)","v":""},{"$f":"IF('Lisans Öğr.Gör. Sonuç'!G27=\"\",\"\",'Lisans Öğr.Gör. Sonuç'!G27)","v":""},{"$f":"IF('Lisans Öğr.Gör. Sonuç'!H27=\"\",\"\",'Lisans Öğr.Gör. Sonuç'!H27)","v":""},{"$f":"IF('Lisans Öğr.Gör. Sonuç'!I27=\"\",\"\",'Lisans Öğr.Gör. Sonuç'!I27)","v":""},{"$f":"IF('Lisans Öğr.Gör. Sonuç'!J27=\"\",\"\",'Lisans Öğr.Gör. Sonuç'!J27)","v":""},{"$f":"IF('Lisans Öğr.Gör. Sonuç'!K27=\"\",\"\",'Lisans Öğr.Gör. Sonuç'!K27)","v":""},{"$f":"IF('Lisans Öğr.Gör. Sonuç'!L27=\"\",\"\",'Lisans Öğr.Gör. Sonuç'!L27)","v":""},{"$f":"IF('Lisans Öğr.Gör. Sonuç'!M27=\"\",\"\",'Lisans Öğr.Gör. Sonuç'!M27)","v":""},{"$f":"IF('Lisans Öğr.Gör. Sonuç'!N27=\"\",\"\",'Lisans Öğr.Gör. Sonuç'!N27)","v":""}]
[{"$f":"IF('Lisans Öğr.Gör. Sonuç'!A28=\"\",\"\",'Lisans Öğr.Gör. Sonuç'!A28)","v":""},{"$f":"IF('Lisans Öğr.Gör. Sonuç'!B28=\"\",\"\",LEFT('Lisans Öğr.Gör. Sonuç'!B28,3)&REPT(\"*\",4)&RIGHT('Lisans Öğr.Gör. Sonuç'!B28,2))","v":""},{"$f":"IF('Lisans Öğr.Gör. Sonuç'!C28=\"\",\"\",IF(ISERR(FIND(\" \",'Lisans Öğr.Gör. Sonuç'!C28))=TRUE,LEFT('Lisans Öğr.Gör. Sonuç'!C28,2)&REPT(\"*\",3),LEFT('Lisans Öğr.Gör. Sonuç'!C28,2)&REPT(\"*\",3)&\" \"&MID('Lisans Öğr.Gör. Sonuç'!C28,FIND(\" \",'Lisans Öğr.Gör. Sonuç'!C28)+1,2)&REPT(\"*\",3)))","v":""},{"$f":"IF('Lisans Öğr.Gör. Sonuç'!D28=\"\",\"\",IF(ISERR(FIND(\" \",'Lisans Öğr.Gör. Sonuç'!D28))=TRUE,LEFT('Lisans Öğr.Gör. Sonuç'!D28,2)&REPT(\"*\",3),LEFT('Lisans Öğr.Gör. Sonuç'!D28,2)&REPT(\"*\",3)&\" \"&MID('Lisans Öğr.Gör. Sonuç'!D28,FIND(\" \",'Lisans Öğr.Gör. Sonuç'!D28)+1,2)&REPT(\"*\",3)))","v":""},{"$f":"IF('Lisans Öğr.Gör. Sonuç'!E28=\"\",\"\",'Lisans Öğr.Gör. Sonuç'!E28)","v":""},{"$f":"IF('Lisans Öğr.Gör. Sonuç'!F28=\"\",\"\",'Lisans Öğr.Gör. Sonuç'!F28)","v":""},{"$f":"IF('Lisans Öğr.Gör. Sonuç'!G28=\"\",\"\",'Lisans Öğr.Gör. Sonuç'!G28)","v":""},{"$f":"IF('Lisans Öğr.Gör. Sonuç'!H28=\"\",\"\",'Lisans Öğr.Gör. Sonuç'!H28)","v":""},{"$f":"IF('Lisans Öğr.Gör. Sonuç'!I28=\"\",\"\",'Lisans Öğr.Gör. Sonuç'!I28)","v":""},{"$f":"IF('Lisans Öğr.Gör. Sonuç'!J28=\"\",\"\",'Lisans Öğr.Gör. Sonuç'!J28)","v":""},{"$f":"IF('Lisans Öğr.Gör. Sonuç'!K28=\"\",\"\",'Lisans Öğr.Gör. Sonuç'!K28)","v":""},{"$f":"IF('Lisans Öğr.Gör. Sonuç'!L28=\"\",\"\",'Lisans Öğr.Gör. Sonuç'!L28)","v":""},{"$f":"IF('Lisans Öğr.Gör. Sonuç'!M28=\"\",\"\",'Lisans Öğr.Gör. Sonuç'!M28)","v":""},{"$f":"IF('Lisans Öğr.Gör. Sonuç'!N28=\"\",\"\",'Lisans Öğr.Gör. Sonuç'!N28)","v":""}]
[{"$f":"IF('Lisans Öğr.Gör. Sonuç'!A29=\"\",\"\",'Lisans Öğr.Gör. Sonuç'!A29)","v":""},{"$f":"IF('Lisans Öğr.Gör. Sonuç'!B29=\"\",\"\",LEFT('Lisans Öğr.Gör. Sonuç'!B29,3)&REPT(\"*\",4)&RIGHT('Lisans Öğr.Gör. Sonuç'!B29,2))","v":""},{"$f":"IF('Lisans Öğr.Gör. Sonuç'!C29=\"\",\"\",IF(ISERR(FIND(\" \",'Lisans Öğr.Gör. Sonuç'!C29))=TRUE,LEFT('Lisans Öğr.Gör. Sonuç'!C29,2)&REPT(\"*\",3),LEFT('Lisans Öğr.Gör. Sonuç'!C29,2)&REPT(\"*\",3)&\" \"&MID('Lisans Öğr.Gör. Sonuç'!C29,FIND(\" \",'Lisans Öğr.Gör. Sonuç'!C29)+1,2)&REPT(\"*\",3)))","v":""},{"$f":"IF('Lisans Öğr.Gör. Sonuç'!D29=\"\",\"\",IF(ISERR(FIND(\" \",'Lisans Öğr.Gör. Sonuç'!D29))=TRUE,LEFT('Lisans Öğr.Gör. Sonuç'!D29,2)&REPT(\"*\",3),LEFT('Lisans Öğr.Gör. Sonuç'!D29,2)&REPT(\"*\",3)&\" \"&MID('Lisans Öğr.Gör. Sonuç'!D29,FIND(\" \",'Lisans Öğr.Gör. Sonuç'!D29)+1,2)&REPT(\"*\",3)))","v":""},{"$f":"IF('Lisans Öğr.Gör. Sonuç'!E29=\"\",\"\",'Lisans Öğr.Gör. Sonuç'!E29)","v":""},{"$f":"IF('Lisans Öğr.Gör. Sonuç'!F29=\"\",\"\",'Lisans Öğr.Gör. Sonuç'!F29)","v":""},{"$f":"IF('Lisans Öğr.Gör. Sonuç'!G29=\"\",\"\",'Lisans Öğr.Gör. Sonuç'!G29)","v":""},{"$f":"IF('Lisans Öğr.Gör. Sonuç'!H29=\"\",\"\",'Lisans Öğr.Gör. Sonuç'!H29)","v":""},{"$f":"IF('Lisans Öğr.Gör. Sonuç'!I29=\"\",\"\",'Lisans Öğr.Gör. Sonuç'!I29)","v":""},{"$f":"IF('Lisans Öğr.Gör. Sonuç'!J29=\"\",\"\",'Lisans Öğr.Gör. Sonuç'!J29)","v":""},{"$f":"IF('Lisans Öğr.Gör. Sonuç'!K29=\"\",\"\",'Lisans Öğr.Gör. Sonuç'!K29)","v":""},{"$f":"IF('Lisans Öğr.Gör. Sonuç'!L29=\"\",\"\",'Lisans Öğr.Gör. Sonuç'!L29)","v":""},{"$f":"IF('Lisans Öğr.Gör. Sonuç'!M29=\"\",\"\",'Lisans Öğr.Gör. Sonuç'!M29)","v":""},{"$f":"IF('Lisans Öğr.Gör. Sonuç'!N29=\"\",\"\",'Lisans Öğr.Gör. Sonuç'!N29)","v":""}]
[{"$f":"IF('Lisans Öğr.Gör. Sonuç'!A30=\"\",\"\",'Lisans Öğr.Gör. Sonuç'!A30)","v":""},{"$f":"IF('Lisans Öğr.Gör. Sonuç'!B30=\"\",\"\",LEFT('Lisans Öğr.Gör. Sonuç'!B30,3)&REPT(\"*\",4)&RIGHT('Lisans Öğr.Gör. Sonuç'!B30,2))","v":""},{"$f":"IF('Lisans Öğr.Gör. Sonuç'!C30=\"\",\"\",IF(ISERR(FIND(\" \",'Lisans Öğr.Gör. Sonuç'!C30))=TRUE,LEFT('Lisans Öğr.Gör. Sonuç'!C30,2)&REPT(\"*\",3),LEFT('Lisans Öğr.Gör. Sonuç'!C30,2)&REPT(\"*\",3)&\" \"&MID('Lisans Öğr.Gör. Sonuç'!C30,FIND(\" \",'Lisans Öğr.Gör. Sonuç'!C30)+1,2)&REPT(\"*\",3)))","v":""},{"$f":"IF('Lisans Öğr.Gör. Sonuç'!D30=\"\",\"\",IF(ISERR(FIND(\" \",'Lisans Öğr.Gör. Sonuç'!D30))=TRUE,LEFT('Lisans Öğr.Gör. Sonuç'!D30,2)&REPT(\"*\",3),LEFT('Lisans Öğr.Gör. Sonuç'!D30,2)&REPT(\"*\",3)&\" \"&MID('Lisans Öğr.Gör. Sonuç'!D30,FIND(\" \",'Lisans Öğr.Gör. Sonuç'!D30)+1,2)&REPT(\"*\",3)))","v":""},{"$f":"IF('Lisans Öğr.Gör. Sonuç'!E30=\"\",\"\",'Lisans Öğr.Gör. Sonuç'!E30)","v":""},{"$f":"IF('Lisans Öğr.Gör. Sonuç'!F30=\"\",\"\",'Lisans Öğr.Gör. Sonuç'!F30)","v":""},{"$f":"IF('Lisans Öğr.Gör. Sonuç'!G30=\"\",\"\",'Lisans Öğr.Gör. Sonuç'!G30)","v":""},{"$f":"IF('Lisans Öğr.Gör. Sonuç'!H30=\"\",\"\",'Lisans Öğr.Gör. Sonuç'!H30)","v":""},{"$f":"IF('Lisans Öğr.Gör. Sonuç'!I30=\"\",\"\",'Lisans Öğr.Gör. Sonuç'!I30)","v":""},{"$f":"IF('Lisans Öğr.Gör. Sonuç'!J30=\"\",\"\",'Lisans Öğr.Gör. Sonuç'!J30)","v":""},{"$f":"IF('Lisans Öğr.Gör. Sonuç'!K30=\"\",\"\",'Lisans Öğr.Gör. Sonuç'!K30)","v":""},{"$f":"IF('Lisans Öğr.Gör. Sonuç'!L30=\"\",\"\",'Lisans Öğr.Gör. Sonuç'!L30)","v":""},{"$f":"IF('Lisans Öğr.Gör. Sonuç'!M30=\"\",\"\",'Lisans Öğr.Gör. Sonuç'!M30)","v":""},{"$f":"IF('Lisans Öğr.Gör. Sonuç'!N30=\"\",\"\",'Lisans Öğr.Gör. Sonuç'!N30)","v":""}]
[{"$f":"IF('Lisans Öğr.Gör. Sonuç'!A31=\"\",\"\",'Lisans Öğr.Gör. Sonuç'!A31)","v":""},{"$f":"IF('Lisans Öğr.Gör. Sonuç'!B31=\"\",\"\",LEFT('Lisans Öğr.Gör. Sonuç'!B31,3)&REPT(\"*\",4)&RIGHT('Lisans Öğr.Gör. Sonuç'!B31,2))","v":""},{"$f":"IF('Lisans Öğr.Gör. Sonuç'!C31=\"\",\"\",IF(ISERR(FIND(\" \",'Lisans Öğr.Gör. Sonuç'!C31))=TRUE,LEFT('Lisans Öğr.Gör. Sonuç'!C31,2)&REPT(\"*\",3),LEFT('Lisans Öğr.Gör. Sonuç'!C31,2)&REPT(\"*\",3)&\" \"&MID('Lisans Öğr.Gör. Sonuç'!C31,FIND(\" \",'Lisans Öğr.Gör. Sonuç'!C31)+1,2)&REPT(\"*\",3)))","v":""},{"$f":"IF('Lisans Öğr.Gör. Sonuç'!D31=\"\",\"\",IF(ISERR(FIND(\" \",'Lisans Öğr.Gör. Sonuç'!D31))=TRUE,LEFT('Lisans Öğr.Gör. Sonuç'!D31,2)&REPT(\"*\",3),LEFT('Lisans Öğr.Gör. Sonuç'!D31,2)&REPT(\"*\",3)&\" \"&MID('Lisans Öğr.Gör. Sonuç'!D31,FIND(\" \",'Lisans Öğr.Gör. Sonuç'!D31)+1,2)&REPT(\"*\",3)))","v":""},{"$f":"IF('Lisans Öğr.Gör. Sonuç'!E31=\"\",\"\",'Lisans Öğr.Gör. Sonuç'!E31)","v":""},{"$f":"IF('Lisans Öğr.Gör. Sonuç'!F31=\"\",\"\",'Lisans Öğr.Gör. Sonuç'!F31)","v":""},{"$f":"IF('Lisans Öğr.Gör. Sonuç'!G31=\"\",\"\",'Lisans Öğr.Gör. Sonuç'!G31)","v":""},{"$f":"IF('Lisans Öğr.Gör. Sonuç'!H31=\"\",\"\",'Lisans Öğr.Gör. Sonuç'!H31)","v":""},{"$f":"IF('Lisans Öğr.Gör. Sonuç'!I31=\"\",\"\",'Lisans Öğr.Gör. Sonuç'!I31)","v":""},{"$f":"IF('Lisans Öğr.Gör. Sonuç'!J31=\"\",\"\",'Lisans Öğr.Gör. Sonuç'!J31)","v":""},{"$f":"IF('Lisans Öğr.Gör. Sonuç'!K31=\"\",\"\",'Lisans Öğr.Gör. Sonuç'!K31)","v":""},{"$f":"IF('Lisans Öğr.Gör. Sonuç'!L31=\"\",\"\",'Lisans Öğr.Gör. Sonuç'!L31)","v":""},{"$f":"IF('Lisans Öğr.Gör. Sonuç'!M31=\"\",\"\",'Lisans Öğr.Gör. Sonuç'!M31)","v":""},{"$f":"IF('Lisans Öğr.Gör. Sonuç'!N31=\"\",\"\",'Lisans Öğr.Gör. Sonuç'!N31)","v":""}]
[{"$f":"IF('Lisans Öğr.Gör. Sonuç'!A32=\"\",\"\",'Lisans Öğr.Gör. Sonuç'!A32)","v":""},{"$f":"IF('Lisans Öğr.Gör. Sonuç'!B32=\"\",\"\",LEFT('Lisans Öğr.Gör. Sonuç'!B32,3)&REPT(\"*\",4)&RIGHT('Lisans Öğr.Gör. Sonuç'!B32,2))","v":""},{"$f":"IF('Lisans Öğr.Gör. Sonuç'!C32=\"\",\"\",IF(ISERR(FIND(\" \",'Lisans Öğr.Gör. Sonuç'!C32))=TRUE,LEFT('Lisans Öğr.Gör. Sonuç'!C32,2)&REPT(\"*\",3),LEFT('Lisans Öğr.Gör. Sonuç'!C32,2)&REPT(\"*\",3)&\" \"&MID('Lisans Öğr.Gör. Sonuç'!C32,FIND(\" \",'Lisans Öğr.Gör. Sonuç'!C32)+1,2)&REPT(\"*\",3)))","v":""},{"$f":"IF('Lisans Öğr.Gör. Sonuç'!D32=\"\",\"\",IF(ISERR(FIND(\" \",'Lisans Öğr.Gör. Sonuç'!D32))=TRUE,LEFT('Lisans Öğr.Gör. Sonuç'!D32,2)&REPT(\"*\",3),LEFT('Lisans Öğr.Gör. Sonuç'!D32,2)&REPT(\"*\",3)&\" \"&MID('Lisans Öğr.Gör. Sonuç'!D32,FIND(\" \",'Lisans Öğr.Gör. Sonuç'!D32)+1,2)&REPT(\"*\",3)))","v":""},{"$f":"IF('Lisans Öğr.Gör. Sonuç'!E32=\"\",\"\",'Lisans Öğr.Gör. Sonuç'!E32)","v":""},{"$f":"IF('Lisans Öğr.Gör. Sonuç'!F32=\"\",\"\",'Lisans Öğr.Gör. Sonuç'!F32)","v":""},{"$f":"IF('Lisans Öğr.Gör. Sonuç'!G32=\"\",\"\",'Lisans Öğr.Gör. Sonuç'!G32)","v":""},{"$f":"IF('Lisans Öğr.Gör. Sonuç'!H32=\"\",\"\",'Lisans Öğr.Gör. Sonuç'!H32)","v":""},{"$f":"IF('Lisans Öğr.Gör. Sonuç'!I32=\"\",\"\",'Lisans Öğr.Gör. Sonuç'!I32)","v":""},{"$f":"IF('Lisans Öğr.Gör. Sonuç'!J32=\"\",\"\",'Lisans Öğr.Gör. Sonuç'!J32)","v":""},{"$f":"IF('Lisans Öğr.Gör. Sonuç'!K32=\"\",\"\",'Lisans Öğr.Gör. Sonuç'!K32)","v":""},{"$f":"IF('Lisans Öğr.Gör. Sonuç'!L32=\"\",\"\",'Lisans Öğr.Gör. Sonuç'!L32)","v":""},{"$f":"IF('Lisans Öğr.Gör. Sonuç'!M32=\"\",\"\",'Lisans Öğr.Gör. Sonuç'!M32)","v":""},{"$f":"IF('Lisans Öğr.Gör. Sonuç'!N32=\"\",\"\",'Lisans Öğr.Gör. Sonuç'!N32)","v":""}]
[{"$f":"IF('Lisans Öğr.Gör. Sonuç'!A33=\"\",\"\",'Lisans Öğr.Gör. Sonuç'!A33)","v":""},{"$f":"IF('Lisans Öğr.Gör. Sonuç'!B33=\"\",\"\",LEFT('Lisans Öğr.Gör. Sonuç'!B33,3)&REPT(\"*\",4)&RIGHT('Lisans Öğr.Gör. Sonuç'!B33,2))","v":""},{"$f":"IF('Lisans Öğr.Gör. Sonuç'!C33=\"\",\"\",IF(ISERR(FIND(\" \",'Lisans Öğr.Gör. Sonuç'!C33))=TRUE,LEFT('Lisans Öğr.Gör. Sonuç'!C33,2)&REPT(\"*\",3),LEFT('Lisans Öğr.Gör. Sonuç'!C33,2)&REPT(\"*\",3)&\" \"&MID('Lisans Öğr.Gör. Sonuç'!C33,FIND(\" \",'Lisans Öğr.Gör. Sonuç'!C33)+1,2)&REPT(\"*\",3)))","v":""},{"$f":"IF('Lisans Öğr.Gör. Sonuç'!D33=\"\",\"\",IF(ISERR(FIND(\" \",'Lisans Öğr.Gör. Sonuç'!D33))=TRUE,LEFT('Lisans Öğr.Gör. Sonuç'!D33,2)&REPT(\"*\",3),LEFT('Lisans Öğr.Gör. Sonuç'!D33,2)&REPT(\"*\",3)&\" \"&MID('Lisans Öğr.Gör. Sonuç'!D33,FIND(\" \",'Lisans Öğr.Gör. Sonuç'!D33)+1,2)&REPT(\"*\",3)))","v":""},{"$f":"IF('Lisans Öğr.Gör. Sonuç'!E33=\"\",\"\",'Lisans Öğr.Gör. Sonuç'!E33)","v":""},{"$f":"IF('Lisans Öğr.Gör. Sonuç'!F33=\"\",\"\",'Lisans Öğr.Gör. Sonuç'!F33)","v":""},{"$f":"IF('Lisans Öğr.Gör. Sonuç'!G33=\"\",\"\",'Lisans Öğr.Gör. Sonuç'!G33)","v":""},{"$f":"IF('Lisans Öğr.Gör. Sonuç'!H33=\"\",\"\",'Lisans Öğr.Gör. Sonuç'!H33)","v":""},{"$f":"IF('Lisans Öğr.Gör. Sonuç'!I33=\"\",\"\",'Lisans Öğr.Gör. Sonuç'!I33)","v":""},{"$f":"IF('Lisans Öğr.Gör. Sonuç'!J33=\"\",\"\",'Lisans Öğr.Gör. Sonuç'!J33)","v":""},{"$f":"IF('Lisans Öğr.Gör. Sonuç'!K33=\"\",\"\",'Lisans Öğr.Gör. Sonuç'!K33)","v":""},{"$f":"IF('Lisans Öğr.Gör. Sonuç'!L33=\"\",\"\",'Lisans Öğr.Gör. Sonuç'!L33)","v":""},{"$f":"IF('Lisans Öğr.Gör. Sonuç'!M33=\"\",\"\",'Lisans Öğr.Gör. Sonuç'!M33)","v":""},{"$f":"IF('Lisans Öğr.Gör. Sonuç'!N33=\"\",\"\",'Lisans Öğr.Gör. Sonuç'!N33)","v":""}]
[{"$f":"IF('Lisans Öğr.Gör. Sonuç'!A34=\"\",\"\",'Lisans Öğr.Gör. Sonuç'!A34)","v":""},{"$f":"IF('Lisans Öğr.Gör. Sonuç'!B34=\"\",\"\",LEFT('Lisans Öğr.Gör. Sonuç'!B34,3)&REPT(\"*\",4)&RIGHT('Lisans Öğr.Gör. Sonuç'!B34,2))","v":""},{"$f":"IF('Lisans Öğr.Gör. Sonuç'!C34=\"\",\"\",IF(ISERR(FIND(\" \",'Lisans Öğr.Gör. Sonuç'!C34))=TRUE,LEFT('Lisans Öğr.Gör. Sonuç'!C34,2)&REPT(\"*\",3),LEFT('Lisans Öğr.Gör. Sonuç'!C34,2)&REPT(\"*\",3)&\" \"&MID('Lisans Öğr.Gör. Sonuç'!C34,FIND(\" \",'Lisans Öğr.Gör. Sonuç'!C34)+1,2)&REPT(\"*\",3)))","v":""},{"$f":"IF('Lisans Öğr.Gör. Sonuç'!D34=\"\",\"\",IF(ISERR(FIND(\" \",'Lisans Öğr.Gör. Sonuç'!D34))=TRUE,LEFT('Lisans Öğr.Gör. Sonuç'!D34,2)&REPT(\"*\",3),LEFT('Lisans Öğr.Gör. Sonuç'!D34,2)&REPT(\"*\",3)&\" \"&MID('Lisans Öğr.Gör. Sonuç'!D34,FIND(\" \",'Lisans Öğr.Gör. Sonuç'!D34)+1,2)&REPT(\"*\",3)))","v":""},{"$f":"IF('Lisans Öğr.Gör. Sonuç'!E34=\"\",\"\",'Lisans Öğr.Gör. Sonuç'!E34)","v":""},{"$f":"IF('Lisans Öğr.Gör. Sonuç'!F34=\"\",\"\",'Lisans Öğr.Gör. Sonuç'!F34)","v":""},{"$f":"IF('Lisans Öğr.Gör. Sonuç'!G34=\"\",\"\",'Lisans Öğr.Gör. Sonuç'!G34)","v":""},{"$f":"IF('Lisans Öğr.Gör. Sonuç'!H34=\"\",\"\",'Lisans Öğr.Gör. Sonuç'!H34)","v":""},{"$f":"IF('Lisans Öğr.Gör. Sonuç'!I34=\"\",\"\",'Lisans Öğr.Gör. Sonuç'!I34)","v":""},{"$f":"IF('Lisans Öğr.Gör. Sonuç'!J34=\"\",\"\",'Lisans Öğr.Gör. Sonuç'!J34)","v":""},{"$f":"IF('Lisans Öğr.Gör. Sonuç'!K34=\"\",\"\",'Lisans Öğr.Gör. Sonuç'!K34)","v":""},{"$f":"IF('Lisans Öğr.Gör. Sonuç'!L34=\"\",\"\",'Lisans Öğr.Gör. Sonuç'!L34)","v":""},{"$f":"IF('Lisans Öğr.Gör. Sonuç'!M34=\"\",\"\",'Lisans Öğr.Gör. Sonuç'!M34)","v":""},{"$f":"IF('Lisans Öğr.Gör. Sonuç'!N34=\"\",\"\",'Lisans Öğr.Gör. Sonuç'!N34)","v":""}]
[{"$f":"IF('Lisans Öğr.Gör. Sonuç'!A35=\"\",\"\",'Lisans Öğr.Gör. Sonuç'!A35)","v":""},{"$f":"IF('Lisans Öğr.Gör. Sonuç'!B35=\"\",\"\",LEFT('Lisans Öğr.Gör. Sonuç'!B35,3)&REPT(\"*\",4)&RIGHT('Lisans Öğr.Gör. Sonuç'!B35,2))","v":""},{"$f":"IF('Lisans Öğr.Gör. Sonuç'!C35=\"\",\"\",IF(ISERR(FIND(\" \",'Lisans Öğr.Gör. Sonuç'!C35))=TRUE,LEFT('Lisans Öğr.Gör. Sonuç'!C35,2)&REPT(\"*\",3),LEFT('Lisans Öğr.Gör. Sonuç'!C35,2)&REPT(\"*\",3)&\" \"&MID('Lisans Öğr.Gör. Sonuç'!C35,FIND(\" \",'Lisans Öğr.Gör. Sonuç'!C35)+1,2)&REPT(\"*\",3)))","v":""},{"$f":"IF('Lisans Öğr.Gör. Sonuç'!D35=\"\",\"\",IF(ISERR(FIND(\" \",'Lisans Öğr.Gör. Sonuç'!D35))=TRUE,LEFT('Lisans Öğr.Gör. Sonuç'!D35,2)&REPT(\"*\",3),LEFT('Lisans Öğr.Gör. Sonuç'!D35,2)&REPT(\"*\",3)&\" \"&MID('Lisans Öğr.Gör. Sonuç'!D35,FIND(\" \",'Lisans Öğr.Gör. Sonuç'!D35)+1,2)&REPT(\"*\",3)))","v":""},{"$f":"IF('Lisans Öğr.Gör. Sonuç'!E35=\"\",\"\",'Lisans Öğr.Gör. Sonuç'!E35)","v":""},{"$f":"IF('Lisans Öğr.Gör. Sonuç'!F35=\"\",\"\",'Lisans Öğr.Gör. Sonuç'!F35)","v":""},{"$f":"IF('Lisans Öğr.Gör. Sonuç'!G35=\"\",\"\",'Lisans Öğr.Gör. Sonuç'!G35)","v":""},{"$f":"IF('Lisans Öğr.Gör. Sonuç'!H35=\"\",\"\",'Lisans Öğr.Gör. Sonuç'!H35)","v":""},{"$f":"IF('Lisans Öğr.Gör. Sonuç'!I35=\"\",\"\",'Lisans Öğr.Gör. Sonuç'!I35)","v":""},{"$f":"IF('Lisans Öğr.Gör. Sonuç'!J35=\"\",\"\",'Lisans Öğr.Gör. Sonuç'!J35)","v":""},{"$f":"IF('Lisans Öğr.Gör. Sonuç'!K35=\"\",\"\",'Lisans Öğr.Gör. Sonuç'!K35)","v":""},{"$f":"IF('Lisans Öğr.Gör. Sonuç'!L35=\"\",\"\",'Lisans Öğr.Gör. Sonuç'!L35)","v":""},{"$f":"IF('Lisans Öğr.Gör. Sonuç'!M35=\"\",\"\",'Lisans Öğr.Gör. Sonuç'!M35)","v":""},{"$f":"IF('Lisans Öğr.Gör. Sonuç'!N35=\"\",\"\",'Lisans Öğr.Gör. Sonuç'!N35)","v":""}]
[{"$f":"IF('Lisans Öğr.Gör. Sonuç'!A36=\"\",\"\",'Lisans Öğr.Gör. Sonuç'!A36)","v":""},{"$f":"IF('Lisans Öğr.Gör. Sonuç'!B36=\"\",\"\",LEFT('Lisans Öğr.Gör. Sonuç'!B36,3)&REPT(\"*\",4)&RIGHT('Lisans Öğr.Gör. Sonuç'!B36,2))","v":""},{"$f":"IF('Lisans Öğr.Gör. Sonuç'!C36=\"\",\"\",IF(ISERR(FIND(\" \",'Lisans Öğr.Gör. Sonuç'!C36))=TRUE,LEFT('Lisans Öğr.Gör. Sonuç'!C36,2)&REPT(\"*\",3),LEFT('Lisans Öğr.Gör. Sonuç'!C36,2)&REPT(\"*\",3)&\" \"&MID('Lisans Öğr.Gör. Sonuç'!C36,FIND(\" \",'Lisans Öğr.Gör. Sonuç'!C36)+1,2)&REPT(\"*\",3)))","v":""},{"$f":"IF('Lisans Öğr.Gör. Sonuç'!D36=\"\",\"\",IF(ISERR(FIND(\" \",'Lisans Öğr.Gör. Sonuç'!D36))=TRUE,LEFT('Lisans Öğr.Gör. Sonuç'!D36,2)&REPT(\"*\",3),LEFT('Lisans Öğr.Gör. Sonuç'!D36,2)&REPT(\"*\",3)&\" \"&MID('Lisans Öğr.Gör. Sonuç'!D36,FIND(\" \",'Lisans Öğr.Gör. Sonuç'!D36)+1,2)&REPT(\"*\",3)))","v":""},{"$f":"IF('Lisans Öğr.Gör. Sonuç'!E36=\"\",\"\",'Lisans Öğr.Gör. Sonuç'!E36)","v":""},{"$f":"IF('Lisans Öğr.Gör. Sonuç'!F36=\"\",\"\",'Lisans Öğr.Gör. Sonuç'!F36)","v":""},{"$f":"IF('Lisans Öğr.Gör. Sonuç'!G36=\"\",\"\",'Lisans Öğr.Gör. Sonuç'!G36)","v":""},{"$f":"IF('Lisans Öğr.Gör. Sonuç'!H36=\"\",\"\",'Lisans Öğr.Gör. Sonuç'!H36)","v":""},{"$f":"IF('Lisans Öğr.Gör. Sonuç'!I36=\"\",\"\",'Lisans Öğr.Gör. Sonuç'!I36)","v":""},{"$f":"IF('Lisans Öğr.Gör. Sonuç'!J36=\"\",\"\",'Lisans Öğr.Gör. Sonuç'!J36)","v":""},{"$f":"IF('Lisans Öğr.Gör. Sonuç'!K36=\"\",\"\",'Lisans Öğr.Gör. Sonuç'!K36)","v":""},{"$f":"IF('Lisans Öğr.Gör. Sonuç'!L36=\"\",\"\",'Lisans Öğr.Gör. Sonuç'!L36)","v":""},{"$f":"IF('Lisans Öğr.Gör. Sonuç'!M36=\"\",\"\",'Lisans Öğr.Gör. Sonuç'!M36)","v":""},{"$f":"IF('Lisans Öğr.Gör. Sonuç'!N36=\"\",\"\",'Lisans Öğr.Gör. Sonuç'!N36)","v":""}]
[{"$f":"IF('Lisans Öğr.Gör. Sonuç'!A37=\"\",\"\",'Lisans Öğr.Gör. Sonuç'!A37)","v":""},{"$f":"IF('Lisans Öğr.Gör. Sonuç'!B37=\"\",\"\",LEFT('Lisans Öğr.Gör. Sonuç'!B37,3)&REPT(\"*\",4)&RIGHT('Lisans Öğr.Gör. Sonuç'!B37,2))","v":""},{"$f":"IF('Lisans Öğr.Gör. Sonuç'!C37=\"\",\"\",IF(ISERR(FIND(\" \",'Lisans Öğr.Gör. Sonuç'!C37))=TRUE,LEFT('Lisans Öğr.Gör. Sonuç'!C37,2)&REPT(\"*\",3),LEFT('Lisans Öğr.Gör. Sonuç'!C37,2)&REPT(\"*\",3)&\" \"&MID('Lisans Öğr.Gör. Sonuç'!C37,FIND(\" \",'Lisans Öğr.Gör. Sonuç'!C37)+1,2)&REPT(\"*\",3)))","v":""},{"$f":"IF('Lisans Öğr.Gör. Sonuç'!D37=\"\",\"\",IF(ISERR(FIND(\" \",'Lisans Öğr.Gör. Sonuç'!D37))=TRUE,LEFT('Lisans Öğr.Gör. Sonuç'!D37,2)&REPT(\"*\",3),LEFT('Lisans Öğr.Gör. Sonuç'!D37,2)&REPT(\"*\",3)&\" \"&MID('Lisans Öğr.Gör. Sonuç'!D37,FIND(\" \",'Lisans Öğr.Gör. Sonuç'!D37)+1,2)&REPT(\"*\",3)))","v":""},{"$f":"IF('Lisans Öğr.Gör. Sonuç'!E37=\"\",\"\",'Lisans Öğr.Gör. Sonuç'!E37)","v":""},{"$f":"IF('Lisans Öğr.Gör. Sonuç'!F37=\"\",\"\",'Lisans Öğr.Gör. Sonuç'!F37)","v":""},{"$f":"IF('Lisans Öğr.Gör. Sonuç'!G37=\"\",\"\",'Lisans Öğr.Gör. Sonuç'!G37)","v":""},{"$f":"IF('Lisans Öğr.Gör. Sonuç'!H37=\"\",\"\",'Lisans Öğr.Gör. Sonuç'!H37)","v":""},{"$f":"IF('Lisans Öğr.Gör. Sonuç'!I37=\"\",\"\",'Lisans Öğr.Gör. Sonuç'!I37)","v":""},{"$f":"IF('Lisans Öğr.Gör. Sonuç'!J37=\"\",\"\",'Lisans Öğr.Gör. Sonuç'!J37)","v":""},{"$f":"IF('Lisans Öğr.Gör. Sonuç'!K37=\"\",\"\",'Lisans Öğr.Gör. Sonuç'!K37)","v":""},{"$f":"IF('Lisans Öğr.Gör. Sonuç'!L37=\"\",\"\",'Lisans Öğr.Gör. Sonuç'!L37)","v":""},{"$f":"IF('Lisans Öğr.Gör. Sonuç'!M37=\"\",\"\",'Lisans Öğr.Gör. Sonuç'!M37)","v":""},{"$f":"IF('Lisans Öğr.Gör. Sonuç'!N37=\"\",\"\",'Lisans Öğr.Gör. Sonuç'!N37)","v":""}]
[{"$f":"IF('Lisans Öğr.Gör. Sonuç'!A38=\"\",\"\",'Lisans Öğr.Gör. Sonuç'!A38)","v":""},{"$f":"IF('Lisans Öğr.Gör. Sonuç'!B38=\"\",\"\",LEFT('Lisans Öğr.Gör. Sonuç'!B38,3)&REPT(\"*\",4)&RIGHT('Lisans Öğr.Gör. Sonuç'!B38,2))","v":""},{"$f":"IF('Lisans Öğr.Gör. Sonuç'!C38=\"\",\"\",IF(ISERR(FIND(\" \",'Lisans Öğr.Gör. Sonuç'!C38))=TRUE,LEFT('Lisans Öğr.Gör. Sonuç'!C38,2)&REPT(\"*\",3),LEFT('Lisans Öğr.Gör. Sonuç'!C38,2)&REPT(\"*\",3)&\" \"&MID('Lisans Öğr.Gör. Sonuç'!C38,FIND(\" \",'Lisans Öğr.Gör. Sonuç'!C38)+1,2)&REPT(\"*\",3)))","v":""},{"$f":"IF('Lisans Öğr.Gör. Sonuç'!D38=\"\",\"\",IF(ISERR(FIND(\" \",'Lisans Öğr.Gör. Sonuç'!D38))=TRUE,LEFT('Lisans Öğr.Gör. Sonuç'!D38,2)&REPT(\"*\",3),LEFT('Lisans Öğr.Gör. Sonuç'!D38,2)&REPT(\"*\",3)&\" \"&MID('Lisans Öğr.Gör. Sonuç'!D38,FIND(\" \",'Lisans Öğr.Gör. Sonuç'!D38)+1,2)&REPT(\"*\",3)))","v":""},{"$f":"IF('Lisans Öğr.Gör. Sonuç'!E38=\"\",\"\",'Lisans Öğr.Gör. Sonuç'!E38)","v":""},{"$f":"IF('Lisans Öğr.Gör. Sonuç'!F38=\"\",\"\",'Lisans Öğr.Gör. Sonuç'!F38)","v":""},{"$f":"IF('Lisans Öğr.Gör. Sonuç'!G38=\"\",\"\",'Lisans Öğr.Gör. Sonuç'!G38)","v":""},{"$f":"IF('Lisans Öğr.Gör. Sonuç'!H38=\"\",\"\",'Lisans Öğr.Gör. Sonuç'!H38)","v":""},{"$f":"IF('Lisans Öğr.Gör. Sonuç'!I38=\"\",\"\",'Lisans Öğr.Gör. Sonuç'!I38)","v":""},{"$f":"IF('Lisans Öğr.Gör. Sonuç'!J38=\"\",\"\",'Lisans Öğr.Gör. Sonuç'!J38)","v":""},{"$f":"IF('Lisans Öğr.Gör. Sonuç'!K38=\"\",\"\",'Lisans Öğr.Gör. Sonuç'!K38)","v":""},{"$f":"IF('Lisans Öğr.Gör. Sonuç'!L38=\"\",\"\",'Lisans Öğr.Gör. Sonuç'!L38)","v":""},{"$f":"IF('Lisans Öğr.Gör. Sonuç'!M38=\"\",\"\",'Lisans Öğr.Gör. Sonuç'!M38)","v":""},{"$f":"IF('Lisans Öğr.Gör. Sonuç'!N38=\"\",\"\",'Lisans Öğr.Gör. Sonuç'!N38)","v":""}]
[{"$f":"IF('Lisans Öğr.Gör. Sonuç'!A39=\"\",\"\",'Lisans Öğr.Gör. Sonuç'!A39)","v":""},{"$f":"IF('Lisans Öğr.Gör. Sonuç'!B39=\"\",\"\",LEFT('Lisans Öğr.Gör. Sonuç'!B39,3)&REPT(\"*\",4)&RIGHT('Lisans Öğr.Gör. Sonuç'!B39,2))","v":""},{"$f":"IF('Lisans Öğr.Gör. Sonuç'!C39=\"\",\"\",IF(ISERR(FIND(\" \",'Lisans Öğr.Gör. Sonuç'!C39))=TRUE,LEFT('Lisans Öğr.Gör. Sonuç'!C39,2)&REPT(\"*\",3),LEFT('Lisans Öğr.Gör. Sonuç'!C39,2)&REPT(\"*\",3)&\" \"&MID('Lisans Öğr.Gör. Sonuç'!C39,FIND(\" \",'Lisans Öğr.Gör. Sonuç'!C39)+1,2)&REPT(\"*\",3)))","v":""},{"$f":"IF('Lisans Öğr.Gör. Sonuç'!D39=\"\",\"\",IF(ISERR(FIND(\" \",'Lisans Öğr.Gör. Sonuç'!D39))=TRUE,LEFT('Lisans Öğr.Gör. Sonuç'!D39,2)&REPT(\"*\",3),LEFT('Lisans Öğr.Gör. Sonuç'!D39,2)&REPT(\"*\",3)&\" \"&MID('Lisans Öğr.Gör. Sonuç'!D39,FIND(\" \",'Lisans Öğr.Gör. Sonuç'!D39)+1,2)&REPT(\"*\",3)))","v":""},{"$f":"IF('Lisans Öğr.Gör. Sonuç'!E39=\"\",\"\",'Lisans Öğr.Gör. Sonuç'!E39)","v":""},{"$f":"IF('Lisans Öğr.Gör. Sonuç'!F39=\"\",\"\",'Lisans Öğr.Gör. Sonuç'!F39)","v":""},{"$f":"IF('Lisans Öğr.Gör. Sonuç'!G39=\"\",\"\",'Lisans Öğr.Gör. Sonuç'!G39)","v":""},{"$f":"IF('Lisans Öğr.Gör. Sonuç'!H39=\"\",\"\",'Lisans Öğr.Gör. Sonuç'!H39)","v":""},{"$f":"IF('Lisans Öğr.Gör. Sonuç'!I39=\"\",\"\",'Lisans Öğr.Gör. Sonuç'!I39)","v":""},{"$f":"IF('Lisans Öğr.Gör. Sonuç'!J39=\"\",\"\",'Lisans Öğr.Gör. Sonuç'!J39)","v":""},{"$f":"IF('Lisans Öğr.Gör. Sonuç'!K39=\"\",\"\",'Lisans Öğr.Gör. Sonuç'!K39)","v":""},{"$f":"IF('Lisans Öğr.Gör. Sonuç'!L39=\"\",\"\",'Lisans Öğr.Gör. Sonuç'!L39)","v":""},{"$f":"IF('Lisans Öğr.Gör. Sonuç'!M39=\"\",\"\",'Lisans Öğr.Gör. Sonuç'!M39)","v":""},{"$f":"IF('Lisans Öğr.Gör. Sonuç'!N39=\"\",\"\",'Lisans Öğr.Gör. Sonuç'!N39)","v":""}]
[{"$f":"IF('Lisans Öğr.Gör. Sonuç'!A40=\"\",\"\",'Lisans Öğr.Gör. Sonuç'!A40)","v":""},{"$f":"IF('Lisans Öğr.Gör. Sonuç'!B40=\"\",\"\",LEFT('Lisans Öğr.Gör. Sonuç'!B40,3)&REPT(\"*\",4)&RIGHT('Lisans Öğr.Gör. Sonuç'!B40,2))","v":""},{"$f":"IF('Lisans Öğr.Gör. Sonuç'!C40=\"\",\"\",IF(ISERR(FIND(\" \",'Lisans Öğr.Gör. Sonuç'!C40))=TRUE,LEFT('Lisans Öğr.Gör. Sonuç'!C40,2)&REPT(\"*\",3),LEFT('Lisans Öğr.Gör. Sonuç'!C40,2)&REPT(\"*\",3)&\" \"&MID('Lisans Öğr.Gör. Sonuç'!C40,FIND(\" \",'Lisans Öğr.Gör. Sonuç'!C40)+1,2)&REPT(\"*\",3)))","v":""},{"$f":"IF('Lisans Öğr.Gör. Sonuç'!D40=\"\",\"\",IF(ISERR(FIND(\" \",'Lisans Öğr.Gör. Sonuç'!D40))=TRUE,LEFT('Lisans Öğr.Gör. Sonuç'!D40,2)&REPT(\"*\",3),LEFT('Lisans Öğr.Gör. Sonuç'!D40,2)&REPT(\"*\",3)&\" \"&MID('Lisans Öğr.Gör. Sonuç'!D40,FIND(\" \",'Lisans Öğr.Gör. Sonuç'!D40)+1,2)&REPT(\"*\",3)))","v":""},{"$f":"IF('Lisans Öğr.Gör. Sonuç'!E40=\"\",\"\",'Lisans Öğr.Gör. Sonuç'!E40)","v":""},{"$f":"IF('Lisans Öğr.Gör. Sonuç'!F40=\"\",\"\",'Lisans Öğr.Gör. Sonuç'!F40)","v":""},{"$f":"IF('Lisans Öğr.Gör. Sonuç'!G40=\"\",\"\",'Lisans Öğr.Gör. Sonuç'!G40)","v":""},{"$f":"IF('Lisans Öğr.Gör. Sonuç'!H40=\"\",\"\",'Lisans Öğr.Gör. Sonuç'!H40)","v":""},{"$f":"IF('Lisans Öğr.Gör. Sonuç'!I40=\"\",\"\",'Lisans Öğr.Gör. Sonuç'!I40)","v":""},{"$f":"IF('Lisans Öğr.Gör. Sonuç'!J40=\"\",\"\",'Lisans Öğr.Gör. Sonuç'!J40)","v":""},{"$f":"IF('Lisans Öğr.Gör. Sonuç'!K40=\"\",\"\",'Lisans Öğr.Gör. Sonuç'!K40)","v":""},{"$f":"IF('Lisans Öğr.Gör. Sonuç'!L40=\"\",\"\",'Lisans Öğr.Gör. Sonuç'!L40)","v":""},{"$f":"IF('Lisans Öğr.Gör. Sonuç'!M40=\"\",\"\",'Lisans Öğr.Gör. Sonuç'!M40)","v":""},{"$f":"IF('Lisans Öğr.Gör. Sonuç'!N40=\"\",\"\",'Lisans Öğr.Gör. Sonuç'!N40)","v":""}]
[{"$f":"IF('Lisans Öğr.Gör. Sonuç'!A41=\"\",\"\",'Lisans Öğr.Gör. Sonuç'!A41)","v":""},{"$f":"IF('Lisans Öğr.Gör. Sonuç'!B41=\"\",\"\",LEFT('Lisans Öğr.Gör. Sonuç'!B41,3)&REPT(\"*\",4)&RIGHT('Lisans Öğr.Gör. Sonuç'!B41,2))","v":""},{"$f":"IF('Lisans Öğr.Gör. Sonuç'!C41=\"\",\"\",IF(ISERR(FIND(\" \",'Lisans Öğr.Gör. Sonuç'!C41))=TRUE,LEFT('Lisans Öğr.Gör. Sonuç'!C41,2)&REPT(\"*\",3),LEFT('Lisans Öğr.Gör. Sonuç'!C41,2)&REPT(\"*\",3)&\" \"&MID('Lisans Öğr.Gör. Sonuç'!C41,FIND(\" \",'Lisans Öğr.Gör. Sonuç'!C41)+1,2)&REPT(\"*\",3)))","v":""},{"$f":"IF('Lisans Öğr.Gör. Sonuç'!D41=\"\",\"\",IF(ISERR(FIND(\" \",'Lisans Öğr.Gör. Sonuç'!D41))=TRUE,LEFT('Lisans Öğr.Gör. Sonuç'!D41,2)&REPT(\"*\",3),LEFT('Lisans Öğr.Gör. Sonuç'!D41,2)&REPT(\"*\",3)&\" \"&MID('Lisans Öğr.Gör. Sonuç'!D41,FIND(\" \",'Lisans Öğr.Gör. Sonuç'!D41)+1,2)&REPT(\"*\",3)))","v":""},{"$f":"IF('Lisans Öğr.Gör. Sonuç'!E41=\"\",\"\",'Lisans Öğr.Gör. Sonuç'!E41)","v":""},{"$f":"IF('Lisans Öğr.Gör. Sonuç'!F41=\"\",\"\",'Lisans Öğr.Gör. Sonuç'!F41)","v":""},{"$f":"IF('Lisans Öğr.Gör. Sonuç'!G41=\"\",\"\",'Lisans Öğr.Gör. Sonuç'!G41)","v":""},{"$f":"IF('Lisans Öğr.Gör. Sonuç'!H41=\"\",\"\",'Lisans Öğr.Gör. Sonuç'!H41)","v":""},{"$f":"IF('Lisans Öğr.Gör. Sonuç'!I41=\"\",\"\",'Lisans Öğr.Gör. Sonuç'!I41)","v":""},{"$f":"IF('Lisans Öğr.Gör. Sonuç'!J41=\"\",\"\",'Lisans Öğr.Gör. Sonuç'!J41)","v":""},{"$f":"IF('Lisans Öğr.Gör. Sonuç'!K41=\"\",\"\",'Lisans Öğr.Gör. Sonuç'!K41)","v":""},{"$f":"IF('Lisans Öğr.Gör. Sonuç'!L41=\"\",\"\",'Lisans Öğr.Gör. Sonuç'!L41)","v":""},{"$f":"IF('Lisans Öğr.Gör. Sonuç'!M41=\"\",\"\",'Lisans Öğr.Gör. Sonuç'!M41)","v":""},{"$f":"IF('Lisans Öğr.Gör. Sonuç'!N41=\"\",\"\",'Lisans Öğr.Gör. Sonuç'!N41)","v":""}]
[{"$f":"IF('Lisans Öğr.Gör. Sonuç'!A42=\"\",\"\",'Lisans Öğr.Gör. Sonuç'!A42)","v":""},{"$f":"IF('Lisans Öğr.Gör. Sonuç'!B42=\"\",\"\",LEFT('Lisans Öğr.Gör. Sonuç'!B42,3)&REPT(\"*\",4)&RIGHT('Lisans Öğr.Gör. Sonuç'!B42,2))","v":""},{"$f":"IF('Lisans Öğr.Gör. Sonuç'!C42=\"\",\"\",IF(ISERR(FIND(\" \",'Lisans Öğr.Gör. Sonuç'!C42))=TRUE,LEFT('Lisans Öğr.Gör. Sonuç'!C42,2)&REPT(\"*\",3),LEFT('Lisans Öğr.Gör. Sonuç'!C42,2)&REPT(\"*\",3)&\" \"&MID('Lisans Öğr.Gör. Sonuç'!C42,FIND(\" \",'Lisans Öğr.Gör. Sonuç'!C42)+1,2)&REPT(\"*\",3)))","v":""},{"$f":"IF('Lisans Öğr.Gör. Sonuç'!D42=\"\",\"\",IF(ISERR(FIND(\" \",'Lisans Öğr.Gör. Sonuç'!D42))=TRUE,LEFT('Lisans Öğr.Gör. Sonuç'!D42,2)&REPT(\"*\",3),LEFT('Lisans Öğr.Gör. Sonuç'!D42,2)&REPT(\"*\",3)&\" \"&MID('Lisans Öğr.Gör. Sonuç'!D42,FIND(\" \",'Lisans Öğr.Gör. Sonuç'!D42)+1,2)&REPT(\"*\",3)))","v":""},{"$f":"IF('Lisans Öğr.Gör. Sonuç'!E42=\"\",\"\",'Lisans Öğr.Gör. Sonuç'!E42)","v":""},{"$f":"IF('Lisans Öğr.Gör. Sonuç'!F42=\"\",\"\",'Lisans Öğr.Gör. Sonuç'!F42)","v":""},{"$f":"IF('Lisans Öğr.Gör. Sonuç'!G42=\"\",\"\",'Lisans Öğr.Gör. Sonuç'!G42)","v":""},{"$f":"IF('Lisans Öğr.Gör. Sonuç'!H42=\"\",\"\",'Lisans Öğr.Gör. Sonuç'!H42)","v":""},{"$f":"IF('Lisans Öğr.Gör. Sonuç'!I42=\"\",\"\",'Lisans Öğr.Gör. Sonuç'!I42)","v":""},{"$f":"IF('Lisans Öğr.Gör. Sonuç'!J42=\"\",\"\",'Lisans Öğr.Gör. Sonuç'!J42)","v":""},{"$f":"IF('Lisans Öğr.Gör. Sonuç'!K42=\"\",\"\",'Lisans Öğr.Gör. Sonuç'!K42)","v":""},{"$f":"IF('Lisans Öğr.Gör. Sonuç'!L42=\"\",\"\",'Lisans Öğr.Gör. Sonuç'!L42)","v":""},{"$f":"IF('Lisans Öğr.Gör. Sonuç'!M42=\"\",\"\",'Lisans Öğr.Gör. Sonuç'!M42)","v":""},{"$f":"IF('Lisans Öğr.Gör. Sonuç'!N42=\"\",\"\",'Lisans Öğr.Gör. Sonuç'!N42)","v":""}]
[{"$f":"IF('Lisans Öğr.Gör. Sonuç'!A43=\"\",\"\",'Lisans Öğr.Gör. Sonuç'!A43)","v":""},{"$f":"IF('Lisans Öğr.Gör. Sonuç'!B43=\"\",\"\",LEFT('Lisans Öğr.Gör. Sonuç'!B43,3)&REPT(\"*\",4)&RIGHT('Lisans Öğr.Gör. Sonuç'!B43,2))","v":""},{"$f":"IF('Lisans Öğr.Gör. Sonuç'!C43=\"\",\"\",IF(ISERR(FIND(\" \",'Lisans Öğr.Gör. Sonuç'!C43))=TRUE,LEFT('Lisans Öğr.Gör. Sonuç'!C43,2)&REPT(\"*\",3),LEFT('Lisans Öğr.Gör. Sonuç'!C43,2)&REPT(\"*\",3)&\" \"&MID('Lisans Öğr.Gör. Sonuç'!C43,FIND(\" \",'Lisans Öğr.Gör. Sonuç'!C43)+1,2)&REPT(\"*\",3)))","v":""},{"$f":"IF('Lisans Öğr.Gör. Sonuç'!D43=\"\",\"\",IF(ISERR(FIND(\" \",'Lisans Öğr.Gör. Sonuç'!D43))=TRUE,LEFT('Lisans Öğr.Gör. Sonuç'!D43,2)&REPT(\"*\",3),LEFT('Lisans Öğr.Gör. Sonuç'!D43,2)&REPT(\"*\",3)&\" \"&MID('Lisans Öğr.Gör. Sonuç'!D43,FIND(\" \",'Lisans Öğr.Gör. Sonuç'!D43)+1,2)&REPT(\"*\",3)))","v":""},{"$f":"IF('Lisans Öğr.Gör. Sonuç'!E43=\"\",\"\",'Lisans Öğr.Gör. Sonuç'!E43)","v":""},{"$f":"IF('Lisans Öğr.Gör. Sonuç'!F43=\"\",\"\",'Lisans Öğr.Gör. Sonuç'!F43)","v":""},{"$f":"IF('Lisans Öğr.Gör. Sonuç'!G43=\"\",\"\",'Lisans Öğr.Gör. Sonuç'!G43)","v":""},{"$f":"IF('Lisans Öğr.Gör. Sonuç'!H43=\"\",\"\",'Lisans Öğr.Gör. Sonuç'!H43)","v":""},{"$f":"IF('Lisans Öğr.Gör. Sonuç'!I43=\"\",\"\",'Lisans Öğr.Gör. Sonuç'!I43)","v":""},{"$f":"IF('Lisans Öğr.Gör. Sonuç'!J43=\"\",\"\",'Lisans Öğr.Gör. Sonuç'!J43)","v":""},{"$f":"IF('Lisans Öğr.Gör. Sonuç'!K43=\"\",\"\",'Lisans Öğr.Gör. Sonuç'!K43)","v":""},{"$f":"IF('Lisans Öğr.Gör. Sonuç'!L43=\"\",\"\",'Lisans Öğr.Gör. Sonuç'!L43)","v":""},{"$f":"IF('Lisans Öğr.Gör. Sonuç'!M43=\"\",\"\",'Lisans Öğr.Gör. Sonuç'!M43)","v":""},{"$f":"IF('Lisans Öğr.Gör. Sonuç'!N43=\"\",\"\",'Lisans Öğr.Gör. Sonuç'!N43)","v":""}]
[{"$f":"IF('Lisans Öğr.Gör. Sonuç'!A44=\"\",\"\",'Lisans Öğr.Gör. Sonuç'!A44)","v":""},{"$f":"IF('Lisans Öğr.Gör. Sonuç'!B44=\"\",\"\",LEFT('Lisans Öğr.Gör. Sonuç'!B44,3)&REPT(\"*\",4)&RIGHT('Lisans Öğr.Gör. Sonuç'!B44,2))","v":""},{"$f":"IF('Lisans Öğr.Gör. Sonuç'!C44=\"\",\"\",IF(ISERR(FIND(\" \",'Lisans Öğr.Gör. Sonuç'!C44))=TRUE,LEFT('Lisans Öğr.Gör. Sonuç'!C44,2)&REPT(\"*\",3),LEFT('Lisans Öğr.Gör. Sonuç'!C44,2)&REPT(\"*\",3)&\" \"&MID('Lisans Öğr.Gör. Sonuç'!C44,FIND(\" \",'Lisans Öğr.Gör. Sonuç'!C44)+1,2)&REPT(\"*\",3)))","v":""},{"$f":"IF('Lisans Öğr.Gör. Sonuç'!D44=\"\",\"\",IF(ISERR(FIND(\" \",'Lisans Öğr.Gör. Sonuç'!D44))=TRUE,LEFT('Lisans Öğr.Gör. Sonuç'!D44,2)&REPT(\"*\",3),LEFT('Lisans Öğr.Gör. Sonuç'!D44,2)&REPT(\"*\",3)&\" \"&MID('Lisans Öğr.Gör. Sonuç'!D44,FIND(\" \",'Lisans Öğr.Gör. Sonuç'!D44)+1,2)&REPT(\"*\",3)))","v":""},{"$f":"IF('Lisans Öğr.Gör. Sonuç'!E44=\"\",\"\",'Lisans Öğr.Gör. Sonuç'!E44)","v":""},{"$f":"IF('Lisans Öğr.Gör. Sonuç'!F44=\"\",\"\",'Lisans Öğr.Gör. Sonuç'!F44)","v":""},{"$f":"IF('Lisans Öğr.Gör. Sonuç'!G44=\"\",\"\",'Lisans Öğr.Gör. Sonuç'!G44)","v":""},{"$f":"IF('Lisans Öğr.Gör. Sonuç'!H44=\"\",\"\",'Lisans Öğr.Gör. Sonuç'!H44)","v":""},{"$f":"IF('Lisans Öğr.Gör. Sonuç'!I44=\"\",\"\",'Lisans Öğr.Gör. Sonuç'!I44)","v":""},{"$f":"IF('Lisans Öğr.Gör. Sonuç'!J44=\"\",\"\",'Lisans Öğr.Gör. Sonuç'!J44)","v":""},{"$f":"IF('Lisans Öğr.Gör. Sonuç'!K44=\"\",\"\",'Lisans Öğr.Gör. Sonuç'!K44)","v":""},{"$f":"IF('Lisans Öğr.Gör. Sonuç'!L44=\"\",\"\",'Lisans Öğr.Gör. Sonuç'!L44)","v":""},{"$f":"IF('Lisans Öğr.Gör. Sonuç'!M44=\"\",\"\",'Lisans Öğr.Gör. Sonuç'!M44)","v":""},{"$f":"IF('Lisans Öğr.Gör. Sonuç'!N44=\"\",\"\",'Lisans Öğr.Gör. Sonuç'!N44)","v":""}]
[{"$f":"IF('Lisans Öğr.Gör. Sonuç'!A45=\"\",\"\",'Lisans Öğr.Gör. Sonuç'!A45)","v":""},{"$f":"IF('Lisans Öğr.Gör. Sonuç'!B45=\"\",\"\",LEFT('Lisans Öğr.Gör. Sonuç'!B45,3)&REPT(\"*\",4)&RIGHT('Lisans Öğr.Gör. Sonuç'!B45,2))","v":""},{"$f":"IF('Lisans Öğr.Gör. Sonuç'!C45=\"\",\"\",IF(ISERR(FIND(\" \",'Lisans Öğr.Gör. Sonuç'!C45))=TRUE,LEFT('Lisans Öğr.Gör. Sonuç'!C45,2)&REPT(\"*\",3),LEFT('Lisans Öğr.Gör. Sonuç'!C45,2)&REPT(\"*\",3)&\" \"&MID('Lisans Öğr.Gör. Sonuç'!C45,FIND(\" \",'Lisans Öğr.Gör. Sonuç'!C45)+1,2)&REPT(\"*\",3)))","v":""},{"$f":"IF('Lisans Öğr.Gör. Sonuç'!D45=\"\",\"\",IF(ISERR(FIND(\" \",'Lisans Öğr.Gör. Sonuç'!D45))=TRUE,LEFT('Lisans Öğr.Gör. Sonuç'!D45,2)&REPT(\"*\",3),LEFT('Lisans Öğr.Gör. Sonuç'!D45,2)&REPT(\"*\",3)&\" \"&MID('Lisans Öğr.Gör. Sonuç'!D45,FIND(\" \",'Lisans Öğr.Gör. Sonuç'!D45)+1,2)&REPT(\"*\",3)))","v":""},{"$f":"IF('Lisans Öğr.Gör. Sonuç'!E45=\"\",\"\",'Lisans Öğr.Gör. Sonuç'!E45)","v":""},{"$f":"IF('Lisans Öğr.Gör. Sonuç'!F45=\"\",\"\",'Lisans Öğr.Gör. Sonuç'!F45)","v":""},{"$f":"IF('Lisans Öğr.Gör. Sonuç'!G45=\"\",\"\",'Lisans Öğr.Gör. Sonuç'!G45)","v":""},{"$f":"IF('Lisans Öğr.Gör. Sonuç'!H45=\"\",\"\",'Lisans Öğr.Gör. Sonuç'!H45)","v":""},{"$f":"IF('Lisans Öğr.Gör. Sonuç'!I45=\"\",\"\",'Lisans Öğr.Gör. Sonuç'!I45)","v":""},{"$f":"IF('Lisans Öğr.Gör. Sonuç'!J45=\"\",\"\",'Lisans Öğr.Gör. Sonuç'!J45)","v":""},{"$f":"IF('Lisans Öğr.Gör. Sonuç'!K45=\"\",\"\",'Lisans Öğr.Gör. Sonuç'!K45)","v":""},{"$f":"IF('Lisans Öğr.Gör. Sonuç'!L45=\"\",\"\",'Lisans Öğr.Gör. Sonuç'!L45)","v":""},{"$f":"IF('Lisans Öğr.Gör. Sonuç'!M45=\"\",\"\",'Lisans Öğr.Gör. Sonuç'!M45)","v":""},{"$f":"IF('Lisans Öğr.Gör. Sonuç'!N45=\"\",\"\",'Lisans Öğr.Gör. Sonuç'!N45)","v":""}]
[{"$f":"IF('Lisans Öğr.Gör. Sonuç'!A46=\"\",\"\",'Lisans Öğr.Gör. Sonuç'!A46)","v":""},{"$f":"IF('Lisans Öğr.Gör. Sonuç'!B46=\"\",\"\",LEFT('Lisans Öğr.Gör. Sonuç'!B46,3)&REPT(\"*\",4)&RIGHT('Lisans Öğr.Gör. Sonuç'!B46,2))","v":""},{"$f":"IF('Lisans Öğr.Gör. Sonuç'!C46=\"\",\"\",IF(ISERR(FIND(\" \",'Lisans Öğr.Gör. Sonuç'!C46))=TRUE,LEFT('Lisans Öğr.Gör. Sonuç'!C46,2)&REPT(\"*\",3),LEFT('Lisans Öğr.Gör. Sonuç'!C46,2)&REPT(\"*\",3)&\" \"&MID('Lisans Öğr.Gör. Sonuç'!C46,FIND(\" \",'Lisans Öğr.Gör. Sonuç'!C46)+1,2)&REPT(\"*\",3)))","v":""},{"$f":"IF('Lisans Öğr.Gör. Sonuç'!D46=\"\",\"\",IF(ISERR(FIND(\" \",'Lisans Öğr.Gör. Sonuç'!D46))=TRUE,LEFT('Lisans Öğr.Gör. Sonuç'!D46,2)&REPT(\"*\",3),LEFT('Lisans Öğr.Gör. Sonuç'!D46,2)&REPT(\"*\",3)&\" \"&MID('Lisans Öğr.Gör. Sonuç'!D46,FIND(\" \",'Lisans Öğr.Gör. Sonuç'!D46)+1,2)&REPT(\"*\",3)))","v":""},{"$f":"IF('Lisans Öğr.Gör. Sonuç'!E46=\"\",\"\",'Lisans Öğr.Gör. Sonuç'!E46)","v":""},{"$f":"IF('Lisans Öğr.Gör. Sonuç'!F46=\"\",\"\",'Lisans Öğr.Gör. Sonuç'!F46)","v":""},{"$f":"IF('Lisans Öğr.Gör. Sonuç'!G46=\"\",\"\",'Lisans Öğr.Gör. Sonuç'!G46)","v":""},{"$f":"IF('Lisans Öğr.Gör. Sonuç'!H46=\"\",\"\",'Lisans Öğr.Gör. Sonuç'!H46)","v":""},{"$f":"IF('Lisans Öğr.Gör. Sonuç'!I46=\"\",\"\",'Lisans Öğr.Gör. Sonuç'!I46)","v":""},{"$f":"IF('Lisans Öğr.Gör. Sonuç'!J46=\"\",\"\",'Lisans Öğr.Gör. Sonuç'!J46)","v":""},{"$f":"IF('Lisans Öğr.Gör. Sonuç'!K46=\"\",\"\",'Lisans Öğr.Gör. Sonuç'!K46)","v":""},{"$f":"IF('Lisans Öğr.Gör. Sonuç'!L46=\"\",\"\",'Lisans Öğr.Gör. Sonuç'!L46)","v":""},{"$f":"IF('Lisans Öğr.Gör. Sonuç'!M46=\"\",\"\",'Lisans Öğr.Gör. Sonuç'!M46)","v":""},{"$f":"IF('Lisans Öğr.Gör. Sonuç'!N46=\"\",\"\",'Lisans Öğr.Gör. Sonuç'!N46)","v":""}]
[{"$f":"IF('Lisans Öğr.Gör. Sonuç'!A47=\"\",\"\",'Lisans Öğr.Gör. Sonuç'!A47)","v":""},{"$f":"IF('Lisans Öğr.Gör. Sonuç'!B47=\"\",\"\",LEFT('Lisans Öğr.Gör. Sonuç'!B47,3)&REPT(\"*\",4)&RIGHT('Lisans Öğr.Gör. Sonuç'!B47,2))","v":""},{"$f":"IF('Lisans Öğr.Gör. Sonuç'!C47=\"\",\"\",IF(ISERR(FIND(\" \",'Lisans Öğr.Gör. Sonuç'!C47))=TRUE,LEFT('Lisans Öğr.Gör. Sonuç'!C47,2)&REPT(\"*\",3),LEFT('Lisans Öğr.Gör. Sonuç'!C47,2)&REPT(\"*\",3)&\" \"&MID('Lisans Öğr.Gör. Sonuç'!C47,FIND(\" \",'Lisans Öğr.Gör. Sonuç'!C47)+1,2)&REPT(\"*\",3)))","v":""},{"$f":"IF('Lisans Öğr.Gör. Sonuç'!D47=\"\",\"\",IF(ISERR(FIND(\" \",'Lisans Öğr.Gör. Sonuç'!D47))=TRUE,LEFT('Lisans Öğr.Gör. Sonuç'!D47,2)&REPT(\"*\",3),LEFT('Lisans Öğr.Gör. Sonuç'!D47,2)&REPT(\"*\",3)&\" \"&MID('Lisans Öğr.Gör. Sonuç'!D47,FIND(\" \",'Lisans Öğr.Gör. Sonuç'!D47)+1,2)&REPT(\"*\",3)))","v":""},{"$f":"IF('Lisans Öğr.Gör. Sonuç'!E47=\"\",\"\",'Lisans Öğr.Gör. Sonuç'!E47)","v":""},{"$f":"IF('Lisans Öğr.Gör. Sonuç'!F47=\"\",\"\",'Lisans Öğr.Gör. Sonuç'!F47)","v":""},{"$f":"IF('Lisans Öğr.Gör. Sonuç'!G47=\"\",\"\",'Lisans Öğr.Gör. Sonuç'!G47)","v":""},{"$f":"IF('Lisans Öğr.Gör. Sonuç'!H47=\"\",\"\",'Lisans Öğr.Gör. Sonuç'!H47)","v":""},{"$f":"IF('Lisans Öğr.Gör. Sonuç'!I47=\"\",\"\",'Lisans Öğr.Gör. Sonuç'!I47)","v":""},{"$f":"IF('Lisans Öğr.Gör. Sonuç'!J47=\"\",\"\",'Lisans Öğr.Gör. Sonuç'!J47)","v":""},{"$f":"IF('Lisans Öğr.Gör. Sonuç'!K47=\"\",\"\",'Lisans Öğr.Gör. Sonuç'!K47)","v":""},{"$f":"IF('Lisans Öğr.Gör. Sonuç'!L47=\"\",\"\",'Lisans Öğr.Gör. Sonuç'!L47)","v":""},{"$f":"IF('Lisans Öğr.Gör. Sonuç'!M47=\"\",\"\",'Lisans Öğr.Gör. Sonuç'!M47)","v":""},{"$f":"IF('Lisans Öğr.Gör. Sonuç'!N47=\"\",\"\",'Lisans Öğr.Gör. Sonuç'!N47)","v":""}]
[{"$f":"IF('Lisans Öğr.Gör. Sonuç'!A48=\"\",\"\",'Lisans Öğr.Gör. Sonuç'!A48)","v":""},{"$f":"IF('Lisans Öğr.Gör. Sonuç'!B48=\"\",\"\",LEFT('Lisans Öğr.Gör. Sonuç'!B48,3)&REPT(\"*\",4)&RIGHT('Lisans Öğr.Gör. Sonuç'!B48,2))","v":""},{"$f":"IF('Lisans Öğr.Gör. Sonuç'!C48=\"\",\"\",IF(ISERR(FIND(\" \",'Lisans Öğr.Gör. Sonuç'!C48))=TRUE,LEFT('Lisans Öğr.Gör. Sonuç'!C48,2)&REPT(\"*\",3),LEFT('Lisans Öğr.Gör. Sonuç'!C48,2)&REPT(\"*\",3)&\" \"&MID('Lisans Öğr.Gör. Sonuç'!C48,FIND(\" \",'Lisans Öğr.Gör. Sonuç'!C48)+1,2)&REPT(\"*\",3)))","v":""},{"$f":"IF('Lisans Öğr.Gör. Sonuç'!D48=\"\",\"\",IF(ISERR(FIND(\" \",'Lisans Öğr.Gör. Sonuç'!D48))=TRUE,LEFT('Lisans Öğr.Gör. Sonuç'!D48,2)&REPT(\"*\",3),LEFT('Lisans Öğr.Gör. Sonuç'!D48,2)&REPT(\"*\",3)&\" \"&MID('Lisans Öğr.Gör. Sonuç'!D48,FIND(\" \",'Lisans Öğr.Gör. Sonuç'!D48)+1,2)&REPT(\"*\",3)))","v":""},{"$f":"IF('Lisans Öğr.Gör. Sonuç'!E48=\"\",\"\",'Lisans Öğr.Gör. Sonuç'!E48)","v":""},{"$f":"IF('Lisans Öğr.Gör. Sonuç'!F48=\"\",\"\",'Lisans Öğr.Gör. Sonuç'!F48)","v":""},{"$f":"IF('Lisans Öğr.Gör. Sonuç'!G48=\"\",\"\",'Lisans Öğr.Gör. Sonuç'!G48)","v":""},{"$f":"IF('Lisans Öğr.Gör. Sonuç'!H48=\"\",\"\",'Lisans Öğr.Gör. Sonuç'!H48)","v":""},{"$f":"IF('Lisans Öğr.Gör. Sonuç'!I48=\"\",\"\",'Lisans Öğr.Gör. Sonuç'!I48)","v":""},{"$f":"IF('Lisans Öğr.Gör. Sonuç'!J48=\"\",\"\",'Lisans Öğr.Gör. Sonuç'!J48)","v":""},{"$f":"IF('Lisans Öğr.Gör. Sonuç'!K48=\"\",\"\",'Lisans Öğr.Gör. Sonuç'!K48)","v":""},{"$f":"IF('Lisans Öğr.Gör. Sonuç'!L48=\"\",\"\",'Lisans Öğr.Gör. Sonuç'!L48)","v":""},{"$f":"IF('Lisans Öğr.Gör. Sonuç'!M48=\"\",\"\",'Lisans Öğr.Gör. Sonuç'!M48)","v":""},{"$f":"IF('Lisans Öğr.Gör. Sonuç'!N48=\"\",\"\",'Lisans Öğr.Gör. Sonuç'!N48)","v":""}]
[{"$f":"IF('Lisans Öğr.Gör. Sonuç'!A49=\"\",\"\",'Lisans Öğr.Gör. Sonuç'!A49)","v":""},{"$f":"IF('Lisans Öğr.Gör. Sonuç'!B49=\"\",\"\",LEFT('Lisans Öğr.Gör. Sonuç'!B49,3)&REPT(\"*\",4)&RIGHT('Lisans Öğr.Gör. Sonuç'!B49,2))","v":""},{"$f":"IF('Lisans Öğr.Gör. Sonuç'!C49=\"\",\"\",IF(ISERR(FIND(\" \",'Lisans Öğr.Gör. Sonuç'!C49))=TRUE,LEFT('Lisans Öğr.Gör. Sonuç'!C49,2)&REPT(\"*\",3),LEFT('Lisans Öğr.Gör. Sonuç'!C49,2)&REPT(\"*\",3)&\" \"&MID('Lisans Öğr.Gör. Sonuç'!C49,FIND(\" \",'Lisans Öğr.Gör. Sonuç'!C49)+1,2)&REPT(\"*\",3)))","v":""},{"$f":"IF('Lisans Öğr.Gör. Sonuç'!D49=\"\",\"\",IF(ISERR(FIND(\" \",'Lisans Öğr.Gör. Sonuç'!D49))=TRUE,LEFT('Lisans Öğr.Gör. Sonuç'!D49,2)&REPT(\"*\",3),LEFT('Lisans Öğr.Gör. Sonuç'!D49,2)&REPT(\"*\",3)&\" \"&MID('Lisans Öğr.Gör. Sonuç'!D49,FIND(\" \",'Lisans Öğr.Gör. Sonuç'!D49)+1,2)&REPT(\"*\",3)))","v":""},{"$f":"IF('Lisans Öğr.Gör. Sonuç'!E49=\"\",\"\",'Lisans Öğr.Gör. Sonuç'!E49)","v":""},{"$f":"IF('Lisans Öğr.Gör. Sonuç'!F49=\"\",\"\",'Lisans Öğr.Gör. Sonuç'!F49)","v":""},{"$f":"IF('Lisans Öğr.Gör. Sonuç'!G49=\"\",\"\",'Lisans Öğr.Gör. Sonuç'!G49)","v":""},{"$f":"IF('Lisans Öğr.Gör. Sonuç'!H49=\"\",\"\",'Lisans Öğr.Gör. Sonuç'!H49)","v":""},{"$f":"IF('Lisans Öğr.Gör. Sonuç'!I49=\"\",\"\",'Lisans Öğr.Gör. Sonuç'!I49)","v":""},{"$f":"IF('Lisans Öğr.Gör. Sonuç'!J49=\"\",\"\",'Lisans Öğr.Gör. Sonuç'!J49)","v":""},{"$f":"IF('Lisans Öğr.Gör. Sonuç'!K49=\"\",\"\",'Lisans Öğr.Gör. Sonuç'!K49)","v":""},{"$f":"IF('Lisans Öğr.Gör. Sonuç'!L49=\"\",\"\",'Lisans Öğr.Gör. Sonuç'!L49)","v":""},{"$f":"IF('Lisans Öğr.Gör. Sonuç'!M49=\"\",\"\",'Lisans Öğr.Gör. Sonuç'!M49)","v":""},{"$f":"IF('Lisans Öğr.Gör. Sonuç'!N49=\"\",\"\",'Lisans Öğr.Gör. Sonuç'!N49)","v":""}]
[{"$f":"IF('Lisans Öğr.Gör. Sonuç'!A50=\"\",\"\",'Lisans Öğr.Gör. Sonuç'!A50)","v":""},{"$f":"IF('Lisans Öğr.Gör. Sonuç'!B50=\"\",\"\",LEFT('Lisans Öğr.Gör. Sonuç'!B50,3)&REPT(\"*\",4)&RIGHT('Lisans Öğr.Gör. Sonuç'!B50,2))","v":""},{"$f":"IF('Lisans Öğr.Gör. Sonuç'!C50=\"\",\"\",IF(ISERR(FIND(\" \",'Lisans Öğr.Gör. Sonuç'!C50))=TRUE,LEFT('Lisans Öğr.Gör. Sonuç'!C50,2)&REPT(\"*\",3),LEFT('Lisans Öğr.Gör. Sonuç'!C50,2)&REPT(\"*\",3)&\" \"&MID('Lisans Öğr.Gör. Sonuç'!C50,FIND(\" \",'Lisans Öğr.Gör. Sonuç'!C50)+1,2)&REPT(\"*\",3)))","v":""},{"$f":"IF('Lisans Öğr.Gör. Sonuç'!D50=\"\",\"\",IF(ISERR(FIND(\" \",'Lisans Öğr.Gör. Sonuç'!D50))=TRUE,LEFT('Lisans Öğr.Gör. Sonuç'!D50,2)&REPT(\"*\",3),LEFT('Lisans Öğr.Gör. Sonuç'!D50,2)&REPT(\"*\",3)&\" \"&MID('Lisans Öğr.Gör. Sonuç'!D50,FIND(\" \",'Lisans Öğr.Gör. Sonuç'!D50)+1,2)&REPT(\"*\",3)))","v":""},{"$f":"IF('Lisans Öğr.Gör. Sonuç'!E50=\"\",\"\",'Lisans Öğr.Gör. Sonuç'!E50)","v":""},{"$f":"IF('Lisans Öğr.Gör. Sonuç'!F50=\"\",\"\",'Lisans Öğr.Gör. Sonuç'!F50)","v":""},{"$f":"IF('Lisans Öğr.Gör. Sonuç'!G50=\"\",\"\",'Lisans Öğr.Gör. Sonuç'!G50)","v":""},{"$f":"IF('Lisans Öğr.Gör. Sonuç'!H50=\"\",\"\",'Lisans Öğr.Gör. Sonuç'!H50)","v":""},{"$f":"IF('Lisans Öğr.Gör. Sonuç'!I50=\"\",\"\",'Lisans Öğr.Gör. Sonuç'!I50)","v":""},{"$f":"IF('Lisans Öğr.Gör. Sonuç'!J50=\"\",\"\",'Lisans Öğr.Gör. Sonuç'!J50)","v":""},{"$f":"IF('Lisans Öğr.Gör. Sonuç'!K50=\"\",\"\",'Lisans Öğr.Gör. Sonuç'!K50)","v":""},{"$f":"IF('Lisans Öğr.Gör. Sonuç'!L50=\"\",\"\",'Lisans Öğr.Gör. Sonuç'!L50)","v":""},{"$f":"IF('Lisans Öğr.Gör. Sonuç'!M50=\"\",\"\",'Lisans Öğr.Gör. Sonuç'!M50)","v":""},{"$f":"IF('Lisans Öğr.Gör. Sonuç'!N50=\"\",\"\",'Lisans Öğr.Gör. Sonuç'!N50)","v":""}]
[{"$f":"IF('Lisans Öğr.Gör. Sonuç'!A51=\"\",\"\",'Lisans Öğr.Gör. Sonuç'!A51)","v":""},{"$f":"IF('Lisans Öğr.Gör. Sonuç'!B51=\"\",\"\",LEFT('Lisans Öğr.Gör. Sonuç'!B51,3)&REPT(\"*\",4)&RIGHT('Lisans Öğr.Gör. Sonuç'!B51,2))","v":""},{"$f":"IF('Lisans Öğr.Gör. Sonuç'!C51=\"\",\"\",IF(ISERR(FIND(\" \",'Lisans Öğr.Gör. Sonuç'!C51))=TRUE,LEFT('Lisans Öğr.Gör. Sonuç'!C51,2)&REPT(\"*\",3),LEFT('Lisans Öğr.Gör. Sonuç'!C51,2)&REPT(\"*\",3)&\" \"&MID('Lisans Öğr.Gör. Sonuç'!C51,FIND(\" \",'Lisans Öğr.Gör. Sonuç'!C51)+1,2)&REPT(\"*\",3)))","v":""},{"$f":"IF('Lisans Öğr.Gör. Sonuç'!D51=\"\",\"\",IF(ISERR(FIND(\" \",'Lisans Öğr.Gör. Sonuç'!D51))=TRUE,LEFT('Lisans Öğr.Gör. Sonuç'!D51,2)&REPT(\"*\",3),LEFT('Lisans Öğr.Gör. Sonuç'!D51,2)&REPT(\"*\",3)&\" \"&MID('Lisans Öğr.Gör. Sonuç'!D51,FIND(\" \",'Lisans Öğr.Gör. Sonuç'!D51)+1,2)&REPT(\"*\",3)))","v":""},{"$f":"IF('Lisans Öğr.Gör. Sonuç'!E51=\"\",\"\",'Lisans Öğr.Gör. Sonuç'!E51)","v":""},{"$f":"IF('Lisans Öğr.Gör. Sonuç'!F51=\"\",\"\",'Lisans Öğr.Gör. Sonuç'!F51)","v":""},{"$f":"IF('Lisans Öğr.Gör. Sonuç'!G51=\"\",\"\",'Lisans Öğr.Gör. Sonuç'!G51)","v":""},{"$f":"IF('Lisans Öğr.Gör. Sonuç'!H51=\"\",\"\",'Lisans Öğr.Gör. Sonuç'!H51)","v":""},{"$f":"IF('Lisans Öğr.Gör. Sonuç'!I51=\"\",\"\",'Lisans Öğr.Gör. Sonuç'!I51)","v":""},{"$f":"IF('Lisans Öğr.Gör. Sonuç'!J51=\"\",\"\",'Lisans Öğr.Gör. Sonuç'!J51)","v":""},{"$f":"IF('Lisans Öğr.Gör. Sonuç'!K51=\"\",\"\",'Lisans Öğr.Gör. Sonuç'!K51)","v":""},{"$f":"IF('Lisans Öğr.Gör. Sonuç'!L51=\"\",\"\",'Lisans Öğr.Gör. Sonuç'!L51)","v":""},{"$f":"IF('Lisans Öğr.Gör. Sonuç'!M51=\"\",\"\",'Lisans Öğr.Gör. Sonuç'!M51)","v":""},{"$f":"IF('Lisans Öğr.Gör. Sonuç'!N51=\"\",\"\",'Lisans Öğr.Gör. Sonuç'!N51)","v":""}]
[{"$f":"IF('Lisans Öğr.Gör. Sonuç'!A52=\"\",\"\",'Lisans Öğr.Gör. Sonuç'!A52)","v":""},{"$f":"IF('Lisans Öğr.Gör. Sonuç'!B52=\"\",\"\",LEFT('Lisans Öğr.Gör. Sonuç'!B52,3)&REPT(\"*\",4)&RIGHT('Lisans Öğr.Gör. Sonuç'!B52,2))","v":""},{"$f":"IF('Lisans Öğr.Gör. Sonuç'!C52=\"\",\"\",IF(ISERR(FIND(\" \",'Lisans Öğr.Gör. Sonuç'!C52))=TRUE,LEFT('Lisans Öğr.Gör. Sonuç'!C52,2)&REPT(\"*\",3),LEFT('Lisans Öğr.Gör. Sonuç'!C52,2)&REPT(\"*\",3)&\" \"&MID('Lisans Öğr.Gör. Sonuç'!C52,FIND(\" \",'Lisans Öğr.Gör. Sonuç'!C52)+1,2)&REPT(\"*\",3)))","v":""},{"$f":"IF('Lisans Öğr.Gör. Sonuç'!D52=\"\",\"\",IF(ISERR(FIND(\" \",'Lisans Öğr.Gör. Sonuç'!D52))=TRUE,LEFT('Lisans Öğr.Gör. Sonuç'!D52,2)&REPT(\"*\",3),LEFT('Lisans Öğr.Gör. Sonuç'!D52,2)&REPT(\"*\",3)&\" \"&MID('Lisans Öğr.Gör. Sonuç'!D52,FIND(\" \",'Lisans Öğr.Gör. Sonuç'!D52)+1,2)&REPT(\"*\",3)))","v":""},{"$f":"IF('Lisans Öğr.Gör. Sonuç'!E52=\"\",\"\",'Lisans Öğr.Gör. Sonuç'!E52)","v":""},{"$f":"IF('Lisans Öğr.Gör. Sonuç'!F52=\"\",\"\",'Lisans Öğr.Gör. Sonuç'!F52)","v":""},{"$f":"IF('Lisans Öğr.Gör. Sonuç'!G52=\"\",\"\",'Lisans Öğr.Gör. Sonuç'!G52)","v":""},{"$f":"IF('Lisans Öğr.Gör. Sonuç'!H52=\"\",\"\",'Lisans Öğr.Gör. Sonuç'!H52)","v":""},{"$f":"IF('Lisans Öğr.Gör. Sonuç'!I52=\"\",\"\",'Lisans Öğr.Gör. Sonuç'!I52)","v":""},{"$f":"IF('Lisans Öğr.Gör. Sonuç'!J52=\"\",\"\",'Lisans Öğr.Gör. Sonuç'!J52)","v":""},{"$f":"IF('Lisans Öğr.Gör. Sonuç'!K52=\"\",\"\",'Lisans Öğr.Gör. Sonuç'!K52)","v":""},{"$f":"IF('Lisans Öğr.Gör. Sonuç'!L52=\"\",\"\",'Lisans Öğr.Gör. Sonuç'!L52)","v":""},{"$f":"IF('Lisans Öğr.Gör. Sonuç'!M52=\"\",\"\",'Lisans Öğr.Gör. Sonuç'!M52)","v":""},{"$f":"IF('Lisans Öğr.Gör. Sonuç'!N52=\"\",\"\",'Lisans Öğr.Gör. Sonuç'!N52)","v":""}]
[{"$f":"IF('Lisans Öğr.Gör. Sonuç'!A53=\"\",\"\",'Lisans Öğr.Gör. Sonuç'!A53)","v":""},{"$f":"IF('Lisans Öğr.Gör. Sonuç'!B53=\"\",\"\",LEFT('Lisans Öğr.Gör. Sonuç'!B53,3)&REPT(\"*\",4)&RIGHT('Lisans Öğr.Gör. Sonuç'!B53,2))","v":""},{"$f":"IF('Lisans Öğr.Gör. Sonuç'!C53=\"\",\"\",IF(ISERR(FIND(\" \",'Lisans Öğr.Gör. Sonuç'!C53))=TRUE,LEFT('Lisans Öğr.Gör. Sonuç'!C53,2)&REPT(\"*\",3),LEFT('Lisans Öğr.Gör. Sonuç'!C53,2)&REPT(\"*\",3)&\" \"&MID('Lisans Öğr.Gör. Sonuç'!C53,FIND(\" \",'Lisans Öğr.Gör. Sonuç'!C53)+1,2)&REPT(\"*\",3)))","v":""},{"$f":"IF('Lisans Öğr.Gör. Sonuç'!D53=\"\",\"\",IF(ISERR(FIND(\" \",'Lisans Öğr.Gör. Sonuç'!D53))=TRUE,LEFT('Lisans Öğr.Gör. Sonuç'!D53,2)&REPT(\"*\",3),LEFT('Lisans Öğr.Gör. Sonuç'!D53,2)&REPT(\"*\",3)&\" \"&MID('Lisans Öğr.Gör. Sonuç'!D53,FIND(\" \",'Lisans Öğr.Gör. Sonuç'!D53)+1,2)&REPT(\"*\",3)))","v":""},{"$f":"IF('Lisans Öğr.Gör. Sonuç'!E53=\"\",\"\",'Lisans Öğr.Gör. Sonuç'!E53)","v":""},{"$f":"IF('Lisans Öğr.Gör. Sonuç'!F53=\"\",\"\",'Lisans Öğr.Gör. Sonuç'!F53)","v":""},{"$f":"IF('Lisans Öğr.Gör. Sonuç'!G53=\"\",\"\",'Lisans Öğr.Gör. Sonuç'!G53)","v":""},{"$f":"IF('Lisans Öğr.Gör. Sonuç'!H53=\"\",\"\",'Lisans Öğr.Gör. Sonuç'!H53)","v":""},{"$f":"IF('Lisans Öğr.Gör. Sonuç'!I53=\"\",\"\",'Lisans Öğr.Gör. Sonuç'!I53)","v":""},{"$f":"IF('Lisans Öğr.Gör. Sonuç'!J53=\"\",\"\",'Lisans Öğr.Gör. Sonuç'!J53)","v":""},{"$f":"IF('Lisans Öğr.Gör. Sonuç'!K53=\"\",\"\",'Lisans Öğr.Gör. Sonuç'!K53)","v":""},{"$f":"IF('Lisans Öğr.Gör. Sonuç'!L53=\"\",\"\",'Lisans Öğr.Gör. Sonuç'!L53)","v":""},{"$f":"IF('Lisans Öğr.Gör. Sonuç'!M53=\"\",\"\",'Lisans Öğr.Gör. Sonuç'!M53)","v":""},{"$f":"IF('Lisans Öğr.Gör. Sonuç'!N53=\"\",\"\",'Lisans Öğr.Gör. Sonuç'!N53)","v":""}]
[{"$f":"IF('Lisans Öğr.Gör. Sonuç'!A54=\"\",\"\",'Lisans Öğr.Gör. Sonuç'!A54)","v":""},{"$f":"IF('Lisans Öğr.Gör. Sonuç'!B54=\"\",\"\",LEFT('Lisans Öğr.Gör. Sonuç'!B54,3)&REPT(\"*\",4)&RIGHT('Lisans Öğr.Gör. Sonuç'!B54,2))","v":""},{"$f":"IF('Lisans Öğr.Gör. Sonuç'!C54=\"\",\"\",IF(ISERR(FIND(\" \",'Lisans Öğr.Gör. Sonuç'!C54))=TRUE,LEFT('Lisans Öğr.Gör. Sonuç'!C54,2)&REPT(\"*\",3),LEFT('Lisans Öğr.Gör. Sonuç'!C54,2)&REPT(\"*\",3)&\" \"&MID('Lisans Öğr.Gör. Sonuç'!C54,FIND(\" \",'Lisans Öğr.Gör. Sonuç'!C54)+1,2)&REPT(\"*\",3)))","v":""},{"$f":"IF('Lisans Öğr.Gör. Sonuç'!D54=\"\",\"\",IF(ISERR(FIND(\" \",'Lisans Öğr.Gör. Sonuç'!D54))=TRUE,LEFT('Lisans Öğr.Gör. Sonuç'!D54,2)&REPT(\"*\",3),LEFT('Lisans Öğr.Gör. Sonuç'!D54,2)&REPT(\"*\",3)&\" \"&MID('Lisans Öğr.Gör. Sonuç'!D54,FIND(\" \",'Lisans Öğr.Gör. Sonuç'!D54)+1,2)&REPT(\"*\",3)))","v":""},{"$f":"IF('Lisans Öğr.Gör. Sonuç'!E54=\"\",\"\",'Lisans Öğr.Gör. Sonuç'!E54)","v":""},{"$f":"IF('Lisans Öğr.Gör. Sonuç'!F54=\"\",\"\",'Lisans Öğr.Gör. Sonuç'!F54)","v":""},{"$f":"IF('Lisans Öğr.Gör. Sonuç'!G54=\"\",\"\",'Lisans Öğr.Gör. Sonuç'!G54)","v":""},{"$f":"IF('Lisans Öğr.Gör. Sonuç'!H54=\"\",\"\",'Lisans Öğr.Gör. Sonuç'!H54)","v":""},{"$f":"IF('Lisans Öğr.Gör. Sonuç'!I54=\"\",\"\",'Lisans Öğr.Gör. Sonuç'!I54)","v":""},{"$f":"IF('Lisans Öğr.Gör. Sonuç'!J54=\"\",\"\",'Lisans Öğr.Gör. Sonuç'!J54)","v":""},{"$f":"IF('Lisans Öğr.Gör. Sonuç'!K54=\"\",\"\",'Lisans Öğr.Gör. Sonuç'!K54)","v":""},{"$f":"IF('Lisans Öğr.Gör. Sonuç'!L54=\"\",\"\",'Lisans Öğr.Gör. Sonuç'!L54)","v":""},{"$f":"IF('Lisans Öğr.Gör. Sonuç'!M54=\"\",\"\",'Lisans Öğr.Gör. Sonuç'!M54)","v":""},{"$f":"IF('Lisans Öğr.Gör. Sonuç'!N54=\"\",\"\",'Lisans Öğr.Gör. Sonuç'!N54)","v":""}]
[{"$f":"IF('Lisans Öğr.Gör. Sonuç'!A55=\"\",\"\",'Lisans Öğr.Gör. Sonuç'!A55)","v":""},{"$f":"IF('Lisans Öğr.Gör. Sonuç'!B55=\"\",\"\",LEFT('Lisans Öğr.Gör. Sonuç'!B55,3)&REPT(\"*\",4)&RIGHT('Lisans Öğr.Gör. Sonuç'!B55,2))","v":""},{"$f":"IF('Lisans Öğr.Gör. Sonuç'!C55=\"\",\"\",IF(ISERR(FIND(\" \",'Lisans Öğr.Gör. Sonuç'!C55))=TRUE,LEFT('Lisans Öğr.Gör. Sonuç'!C55,2)&REPT(\"*\",3),LEFT('Lisans Öğr.Gör. Sonuç'!C55,2)&REPT(\"*\",3)&\" \"&MID('Lisans Öğr.Gör. Sonuç'!C55,FIND(\" \",'Lisans Öğr.Gör. Sonuç'!C55)+1,2)&REPT(\"*\",3)))","v":""},{"$f":"IF('Lisans Öğr.Gör. Sonuç'!D55=\"\",\"\",IF(ISERR(FIND(\" \",'Lisans Öğr.Gör. Sonuç'!D55))=TRUE,LEFT('Lisans Öğr.Gör. Sonuç'!D55,2)&REPT(\"*\",3),LEFT('Lisans Öğr.Gör. Sonuç'!D55,2)&REPT(\"*\",3)&\" \"&MID('Lisans Öğr.Gör. Sonuç'!D55,FIND(\" \",'Lisans Öğr.Gör. Sonuç'!D55)+1,2)&REPT(\"*\",3)))","v":""},{"$f":"IF('Lisans Öğr.Gör. Sonuç'!E55=\"\",\"\",'Lisans Öğr.Gör. Sonuç'!E55)","v":""},{"$f":"IF('Lisans Öğr.Gör. Sonuç'!F55=\"\",\"\",'Lisans Öğr.Gör. Sonuç'!F55)","v":""},{"$f":"IF('Lisans Öğr.Gör. Sonuç'!G55=\"\",\"\",'Lisans Öğr.Gör. Sonuç'!G55)","v":""},{"$f":"IF('Lisans Öğr.Gör. Sonuç'!H55=\"\",\"\",'Lisans Öğr.Gör. Sonuç'!H55)","v":""},{"$f":"IF('Lisans Öğr.Gör. Sonuç'!I55=\"\",\"\",'Lisans Öğr.Gör. Sonuç'!I55)","v":""},{"$f":"IF('Lisans Öğr.Gör. Sonuç'!J55=\"\",\"\",'Lisans Öğr.Gör. Sonuç'!J55)","v":""},{"$f":"IF('Lisans Öğr.Gör. Sonuç'!K55=\"\",\"\",'Lisans Öğr.Gör. Sonuç'!K55)","v":""},{"$f":"IF('Lisans Öğr.Gör. Sonuç'!L55=\"\",\"\",'Lisans Öğr.Gör. Sonuç'!L55)","v":""},{"$f":"IF('Lisans Öğr.Gör. Sonuç'!M55=\"\",\"\",'Lisans Öğr.Gör. Sonuç'!M55)","v":""},{"$f":"IF('Lisans Öğr.Gör. Sonuç'!N55=\"\",\"\",'Lisans Öğr.Gör. Sonuç'!N55)","v":""}]
[{"$f":"IF('Lisans Öğr.Gör. Sonuç'!A56=\"\",\"\",'Lisans Öğr.Gör. Sonuç'!A56)","v":""},{"$f":"IF('Lisans Öğr.Gör. Sonuç'!B56=\"\",\"\",LEFT('Lisans Öğr.Gör. Sonuç'!B56,3)&REPT(\"*\",4)&RIGHT('Lisans Öğr.Gör. Sonuç'!B56,2))","v":""},{"$f":"IF('Lisans Öğr.Gör. Sonuç'!C56=\"\",\"\",IF(ISERR(FIND(\" \",'Lisans Öğr.Gör. Sonuç'!C56))=TRUE,LEFT('Lisans Öğr.Gör. Sonuç'!C56,2)&REPT(\"*\",3),LEFT('Lisans Öğr.Gör. Sonuç'!C56,2)&REPT(\"*\",3)&\" \"&MID('Lisans Öğr.Gör. Sonuç'!C56,FIND(\" \",'Lisans Öğr.Gör. Sonuç'!C56)+1,2)&REPT(\"*\",3)))","v":""},{"$f":"IF('Lisans Öğr.Gör. Sonuç'!D56=\"\",\"\",IF(ISERR(FIND(\" \",'Lisans Öğr.Gör. Sonuç'!D56))=TRUE,LEFT('Lisans Öğr.Gör. Sonuç'!D56,2)&REPT(\"*\",3),LEFT('Lisans Öğr.Gör. Sonuç'!D56,2)&REPT(\"*\",3)&\" \"&MID('Lisans Öğr.Gör. Sonuç'!D56,FIND(\" \",'Lisans Öğr.Gör. Sonuç'!D56)+1,2)&REPT(\"*\",3)))","v":""},{"$f":"IF('Lisans Öğr.Gör. Sonuç'!E56=\"\",\"\",'Lisans Öğr.Gör. Sonuç'!E56)","v":""},{"$f":"IF('Lisans Öğr.Gör. Sonuç'!F56=\"\",\"\",'Lisans Öğr.Gör. Sonuç'!F56)","v":""},{"$f":"IF('Lisans Öğr.Gör. Sonuç'!G56=\"\",\"\",'Lisans Öğr.Gör. Sonuç'!G56)","v":""},{"$f":"IF('Lisans Öğr.Gör. Sonuç'!H56=\"\",\"\",'Lisans Öğr.Gör. Sonuç'!H56)","v":""},{"$f":"IF('Lisans Öğr.Gör. Sonuç'!I56=\"\",\"\",'Lisans Öğr.Gör. Sonuç'!I56)","v":""},{"$f":"IF('Lisans Öğr.Gör. Sonuç'!J56=\"\",\"\",'Lisans Öğr.Gör. Sonuç'!J56)","v":""},{"$f":"IF('Lisans Öğr.Gör. Sonuç'!K56=\"\",\"\",'Lisans Öğr.Gör. Sonuç'!K56)","v":""},{"$f":"IF('Lisans Öğr.Gör. Sonuç'!L56=\"\",\"\",'Lisans Öğr.Gör. Sonuç'!L56)","v":""},{"$f":"IF('Lisans Öğr.Gör. Sonuç'!M56=\"\",\"\",'Lisans Öğr.Gör. Sonuç'!M56)","v":""},{"$f":"IF('Lisans Öğr.Gör. Sonuç'!N56=\"\",\"\",'Lisans Öğr.Gör. Sonuç'!N56)","v":""}]
[{"$f":"IF('Lisans Öğr.Gör. Sonuç'!A57=\"\",\"\",'Lisans Öğr.Gör. Sonuç'!A57)","v":""},{"$f":"IF('Lisans Öğr.Gör. Sonuç'!B57=\"\",\"\",LEFT('Lisans Öğr.Gör. Sonuç'!B57,3)&REPT(\"*\",4)&RIGHT('Lisans Öğr.Gör. Sonuç'!B57,2))","v":""},{"$f":"IF('Lisans Öğr.Gör. Sonuç'!C57=\"\",\"\",IF(ISERR(FIND(\" \",'Lisans Öğr.Gör. Sonuç'!C57))=TRUE,LEFT('Lisans Öğr.Gör. Sonuç'!C57,2)&REPT(\"*\",3),LEFT('Lisans Öğr.Gör. Sonuç'!C57,2)&REPT(\"*\",3)&\" \"&MID('Lisans Öğr.Gör. Sonuç'!C57,FIND(\" \",'Lisans Öğr.Gör. Sonuç'!C57)+1,2)&REPT(\"*\",3)))","v":""},{"$f":"IF('Lisans Öğr.Gör. Sonuç'!D57=\"\",\"\",IF(ISERR(FIND(\" \",'Lisans Öğr.Gör. Sonuç'!D57))=TRUE,LEFT('Lisans Öğr.Gör. Sonuç'!D57,2)&REPT(\"*\",3),LEFT('Lisans Öğr.Gör. Sonuç'!D57,2)&REPT(\"*\",3)&\" \"&MID('Lisans Öğr.Gör. Sonuç'!D57,FIND(\" \",'Lisans Öğr.Gör. Sonuç'!D57)+1,2)&REPT(\"*\",3)))","v":""},{"$f":"IF('Lisans Öğr.Gör. Sonuç'!E57=\"\",\"\",'Lisans Öğr.Gör. Sonuç'!E57)","v":""},{"$f":"IF('Lisans Öğr.Gör. Sonuç'!F57=\"\",\"\",'Lisans Öğr.Gör. Sonuç'!F57)","v":""},{"$f":"IF('Lisans Öğr.Gör. Sonuç'!G57=\"\",\"\",'Lisans Öğr.Gör. Sonuç'!G57)","v":""},{"$f":"IF('Lisans Öğr.Gör. Sonuç'!H57=\"\",\"\",'Lisans Öğr.Gör. Sonuç'!H57)","v":""},{"$f":"IF('Lisans Öğr.Gör. Sonuç'!I57=\"\",\"\",'Lisans Öğr.Gör. Sonuç'!I57)","v":""},{"$f":"IF('Lisans Öğr.Gör. Sonuç'!J57=\"\",\"\",'Lisans Öğr.Gör. Sonuç'!J57)","v":""},{"$f":"IF('Lisans Öğr.Gör. Sonuç'!K57=\"\",\"\",'Lisans Öğr.Gör. Sonuç'!K57)","v":""},{"$f":"IF('Lisans Öğr.Gör. Sonuç'!L57=\"\",\"\",'Lisans Öğr.Gör. Sonuç'!L57)","v":""},{"$f":"IF('Lisans Öğr.Gör. Sonuç'!M57=\"\",\"\",'Lisans Öğr.Gör. Sonuç'!M57)","v":""},{"$f":"IF('Lisans Öğr.Gör. Sonuç'!N57=\"\",\"\",'Lisans Öğr.Gör. Sonuç'!N57)","v":""}]
[{"$f":"IF('Lisans Öğr.Gör. Sonuç'!A58=\"\",\"\",'Lisans Öğr.Gör. Sonuç'!A58)","v":""},{"$f":"IF('Lisans Öğr.Gör. Sonuç'!B58=\"\",\"\",LEFT('Lisans Öğr.Gör. Sonuç'!B58,3)&REPT(\"*\",4)&RIGHT('Lisans Öğr.Gör. Sonuç'!B58,2))","v":""},{"$f":"IF('Lisans Öğr.Gör. Sonuç'!C58=\"\",\"\",IF(ISERR(FIND(\" \",'Lisans Öğr.Gör. Sonuç'!C58))=TRUE,LEFT('Lisans Öğr.Gör. Sonuç'!C58,2)&REPT(\"*\",3),LEFT('Lisans Öğr.Gör. Sonuç'!C58,2)&REPT(\"*\",3)&\" \"&MID('Lisans Öğr.Gör. Sonuç'!C58,FIND(\" \",'Lisans Öğr.Gör. Sonuç'!C58)+1,2)&REPT(\"*\",3)))","v":""},{"$f":"IF('Lisans Öğr.Gör. Sonuç'!D58=\"\",\"\",IF(ISERR(FIND(\" \",'Lisans Öğr.Gör. Sonuç'!D58))=TRUE,LEFT('Lisans Öğr.Gör. Sonuç'!D58,2)&REPT(\"*\",3),LEFT('Lisans Öğr.Gör. Sonuç'!D58,2)&REPT(\"*\",3)&\" \"&MID('Lisans Öğr.Gör. Sonuç'!D58,FIND(\" \",'Lisans Öğr.Gör. Sonuç'!D58)+1,2)&REPT(\"*\",3)))","v":""},{"$f":"IF('Lisans Öğr.Gör. Sonuç'!E58=\"\",\"\",'Lisans Öğr.Gör. Sonuç'!E58)","v":""},{"$f":"IF('Lisans Öğr.Gör. Sonuç'!F58=\"\",\"\",'Lisans Öğr.Gör. Sonuç'!F58)","v":""},{"$f":"IF('Lisans Öğr.Gör. Sonuç'!G58=\"\",\"\",'Lisans Öğr.Gör. Sonuç'!G58)","v":""},{"$f":"IF('Lisans Öğr.Gör. Sonuç'!H58=\"\",\"\",'Lisans Öğr.Gör. Sonuç'!H58)","v":""},{"$f":"IF('Lisans Öğr.Gör. Sonuç'!I58=\"\",\"\",'Lisans Öğr.Gör. Sonuç'!I58)","v":""},{"$f":"IF('Lisans Öğr.Gör. Sonuç'!J58=\"\",\"\",'Lisans Öğr.Gör. Sonuç'!J58)","v":""},{"$f":"IF('Lisans Öğr.Gör. Sonuç'!K58=\"\",\"\",'Lisans Öğr.Gör. Sonuç'!K58)","v":""},{"$f":"IF('Lisans Öğr.Gör. Sonuç'!L58=\"\",\"\",'Lisans Öğr.Gör. Sonuç'!L58)","v":""},{"$f":"IF('Lisans Öğr.Gör. Sonuç'!M58=\"\",\"\",'Lisans Öğr.Gör. Sonuç'!M58)","v":""},{"$f":"IF('Lisans Öğr.Gör. Sonuç'!N58=\"\",\"\",'Lisans Öğr.Gör. Sonuç'!N58)","v":""}]
[{"$f":"IF('Lisans Öğr.Gör. Sonuç'!A59=\"\",\"\",'Lisans Öğr.Gör. Sonuç'!A59)","v":""},{"$f":"IF('Lisans Öğr.Gör. Sonuç'!B59=\"\",\"\",LEFT('Lisans Öğr.Gör. Sonuç'!B59,3)&REPT(\"*\",4)&RIGHT('Lisans Öğr.Gör. Sonuç'!B59,2))","v":""},{"$f":"IF('Lisans Öğr.Gör. Sonuç'!C59=\"\",\"\",IF(ISERR(FIND(\" \",'Lisans Öğr.Gör. Sonuç'!C59))=TRUE,LEFT('Lisans Öğr.Gör. Sonuç'!C59,2)&REPT(\"*\",3),LEFT('Lisans Öğr.Gör. Sonuç'!C59,2)&REPT(\"*\",3)&\" \"&MID('Lisans Öğr.Gör. Sonuç'!C59,FIND(\" \",'Lisans Öğr.Gör. Sonuç'!C59)+1,2)&REPT(\"*\",3)))","v":""},{"$f":"IF('Lisans Öğr.Gör. Sonuç'!D59=\"\",\"\",IF(ISERR(FIND(\" \",'Lisans Öğr.Gör. Sonuç'!D59))=TRUE,LEFT('Lisans Öğr.Gör. Sonuç'!D59,2)&REPT(\"*\",3),LEFT('Lisans Öğr.Gör. Sonuç'!D59,2)&REPT(\"*\",3)&\" \"&MID('Lisans Öğr.Gör. Sonuç'!D59,FIND(\" \",'Lisans Öğr.Gör. Sonuç'!D59)+1,2)&REPT(\"*\",3)))","v":""},{"$f":"IF('Lisans Öğr.Gör. Sonuç'!E59=\"\",\"\",'Lisans Öğr.Gör. Sonuç'!E59)","v":""},{"$f":"IF('Lisans Öğr.Gör. Sonuç'!F59=\"\",\"\",'Lisans Öğr.Gör. Sonuç'!F59)","v":""},{"$f":"IF('Lisans Öğr.Gör. Sonuç'!G59=\"\",\"\",'Lisans Öğr.Gör. Sonuç'!G59)","v":""},{"$f":"IF('Lisans Öğr.Gör. Sonuç'!H59=\"\",\"\",'Lisans Öğr.Gör. Sonuç'!H59)","v":""},{"$f":"IF('Lisans Öğr.Gör. Sonuç'!I59=\"\",\"\",'Lisans Öğr.Gör. Sonuç'!I59)","v":""},{"$f":"IF('Lisans Öğr.Gör. Sonuç'!J59=\"\",\"\",'Lisans Öğr.Gör. Sonuç'!J59)","v":""},{"$f":"IF('Lisans Öğr.Gör. Sonuç'!K59=\"\",\"\",'Lisans Öğr.Gör. Sonuç'!K59)","v":""},{"$f":"IF('Lisans Öğr.Gör. Sonuç'!L59=\"\",\"\",'Lisans Öğr.Gör. Sonuç'!L59)","v":""},{"$f":"IF('Lisans Öğr.Gör. Sonuç'!M59=\"\",\"\",'Lisans Öğr.Gör. Sonuç'!M59)","v":""},{"$f":"IF('Lisans Öğr.Gör. Sonuç'!N59=\"\",\"\",'Lisans Öğr.Gör. Sonuç'!N59)","v":""}]
[{"$f":"IF('Lisans Öğr.Gör. Sonuç'!A60=\"\",\"\",'Lisans Öğr.Gör. Sonuç'!A60)","v":""},{"$f":"IF('Lisans Öğr.Gör. Sonuç'!B60=\"\",\"\",LEFT('Lisans Öğr.Gör. Sonuç'!B60,3)&REPT(\"*\",4)&RIGHT('Lisans Öğr.Gör. Sonuç'!B60,2))","v":""},{"$f":"IF('Lisans Öğr.Gör. Sonuç'!C60=\"\",\"\",IF(ISERR(FIND(\" \",'Lisans Öğr.Gör. Sonuç'!C60))=TRUE,LEFT('Lisans Öğr.Gör. Sonuç'!C60,2)&REPT(\"*\",3),LEFT('Lisans Öğr.Gör. Sonuç'!C60,2)&REPT(\"*\",3)&\" \"&MID('Lisans Öğr.Gör. Sonuç'!C60,FIND(\" \",'Lisans Öğr.Gör. Sonuç'!C60)+1,2)&REPT(\"*\",3)))","v":""},{"$f":"IF('Lisans Öğr.Gör. Sonuç'!D60=\"\",\"\",IF(ISERR(FIND(\" \",'Lisans Öğr.Gör. Sonuç'!D60))=TRUE,LEFT('Lisans Öğr.Gör. Sonuç'!D60,2)&REPT(\"*\",3),LEFT('Lisans Öğr.Gör. Sonuç'!D60,2)&REPT(\"*\",3)&\" \"&MID('Lisans Öğr.Gör. Sonuç'!D60,FIND(\" \",'Lisans Öğr.Gör. Sonuç'!D60)+1,2)&REPT(\"*\",3)))","v":""},{"$f":"IF('Lisans Öğr.Gör. Sonuç'!E60=\"\",\"\",'Lisans Öğr.Gör. Sonuç'!E60)","v":""},{"$f":"IF('Lisans Öğr.Gör. Sonuç'!F60=\"\",\"\",'Lisans Öğr.Gör. Sonuç'!F60)","v":""},{"$f":"IF('Lisans Öğr.Gör. Sonuç'!G60=\"\",\"\",'Lisans Öğr.Gör. Sonuç'!G60)","v":""},{"$f":"IF('Lisans Öğr.Gör. Sonuç'!H60=\"\",\"\",'Lisans Öğr.Gör. Sonuç'!H60)","v":""},{"$f":"IF('Lisans Öğr.Gör. Sonuç'!I60=\"\",\"\",'Lisans Öğr.Gör. Sonuç'!I60)","v":""},{"$f":"IF('Lisans Öğr.Gör. Sonuç'!J60=\"\",\"\",'Lisans Öğr.Gör. Sonuç'!J60)","v":""},{"$f":"IF('Lisans Öğr.Gör. Sonuç'!K60=\"\",\"\",'Lisans Öğr.Gör. Sonuç'!K60)","v":""},{"$f":"IF('Lisans Öğr.Gör. Sonuç'!L60=\"\",\"\",'Lisans Öğr.Gör. Sonuç'!L60)","v":""},{"$f":"IF('Lisans Öğr.Gör. Sonuç'!M60=\"\",\"\",'Lisans Öğr.Gör. Sonuç'!M60)","v":""},{"$f":"IF('Lisans Öğr.Gör. Sonuç'!N60=\"\",\"\",'Lisans Öğr.Gör. Sonuç'!N60)","v":""}]
[{"$f":"IF('Lisans Öğr.Gör. Sonuç'!A61=\"\",\"\",'Lisans Öğr.Gör. Sonuç'!A61)","v":""},{"$f":"IF('Lisans Öğr.Gör. Sonuç'!B61=\"\",\"\",LEFT('Lisans Öğr.Gör. Sonuç'!B61,3)&REPT(\"*\",4)&RIGHT('Lisans Öğr.Gör. Sonuç'!B61,2))","v":""},{"$f":"IF('Lisans Öğr.Gör. Sonuç'!C61=\"\",\"\",IF(ISERR(FIND(\" \",'Lisans Öğr.Gör. Sonuç'!C61))=TRUE,LEFT('Lisans Öğr.Gör. Sonuç'!C61,2)&REPT(\"*\",3),LEFT('Lisans Öğr.Gör. Sonuç'!C61,2)&REPT(\"*\",3)&\" \"&MID('Lisans Öğr.Gör. Sonuç'!C61,FIND(\" \",'Lisans Öğr.Gör. Sonuç'!C61)+1,2)&REPT(\"*\",3)))","v":""},{"$f":"IF('Lisans Öğr.Gör. Sonuç'!D61=\"\",\"\",IF(ISERR(FIND(\" \",'Lisans Öğr.Gör. Sonuç'!D61))=TRUE,LEFT('Lisans Öğr.Gör. Sonuç'!D61,2)&REPT(\"*\",3),LEFT('Lisans Öğr.Gör. Sonuç'!D61,2)&REPT(\"*\",3)&\" \"&MID('Lisans Öğr.Gör. Sonuç'!D61,FIND(\" \",'Lisans Öğr.Gör. Sonuç'!D61)+1,2)&REPT(\"*\",3)))","v":""},{"$f":"IF('Lisans Öğr.Gör. Sonuç'!E61=\"\",\"\",'Lisans Öğr.Gör. Sonuç'!E61)","v":""},{"$f":"IF('Lisans Öğr.Gör. Sonuç'!F61=\"\",\"\",'Lisans Öğr.Gör. Sonuç'!F61)","v":""},{"$f":"IF('Lisans Öğr.Gör. Sonuç'!G61=\"\",\"\",'Lisans Öğr.Gör. Sonuç'!G61)","v":""},{"$f":"IF('Lisans Öğr.Gör. Sonuç'!H61=\"\",\"\",'Lisans Öğr.Gör. Sonuç'!H61)","v":""},{"$f":"IF('Lisans Öğr.Gör. Sonuç'!I61=\"\",\"\",'Lisans Öğr.Gör. Sonuç'!I61)","v":""},{"$f":"IF('Lisans Öğr.Gör. Sonuç'!J61=\"\",\"\",'Lisans Öğr.Gör. Sonuç'!J61)","v":""},{"$f":"IF('Lisans Öğr.Gör. Sonuç'!K61=\"\",\"\",'Lisans Öğr.Gör. Sonuç'!K61)","v":""},{"$f":"IF('Lisans Öğr.Gör. Sonuç'!L61=\"\",\"\",'Lisans Öğr.Gör. Sonuç'!L61)","v":""},{"$f":"IF('Lisans Öğr.Gör. Sonuç'!M61=\"\",\"\",'Lisans Öğr.Gör. Sonuç'!M61)","v":""},{"$f":"IF('Lisans Öğr.Gör. Sonuç'!N61=\"\",\"\",'Lisans Öğr.Gör. Sonuç'!N61)","v":""}]
[{"$f":"IF('Lisans Öğr.Gör. Sonuç'!A62=\"\",\"\",'Lisans Öğr.Gör. Sonuç'!A62)","v":""},{"$f":"IF('Lisans Öğr.Gör. Sonuç'!B62=\"\",\"\",LEFT('Lisans Öğr.Gör. Sonuç'!B62,3)&REPT(\"*\",4)&RIGHT('Lisans Öğr.Gör. Sonuç'!B62,2))","v":""},{"$f":"IF('Lisans Öğr.Gör. Sonuç'!C62=\"\",\"\",IF(ISERR(FIND(\" \",'Lisans Öğr.Gör. Sonuç'!C62))=TRUE,LEFT('Lisans Öğr.Gör. Sonuç'!C62,2)&REPT(\"*\",3),LEFT('Lisans Öğr.Gör. Sonuç'!C62,2)&REPT(\"*\",3)&\" \"&MID('Lisans Öğr.Gör. Sonuç'!C62,FIND(\" \",'Lisans Öğr.Gör. Sonuç'!C62)+1,2)&REPT(\"*\",3)))","v":""},{"$f":"IF('Lisans Öğr.Gör. Sonuç'!D62=\"\",\"\",IF(ISERR(FIND(\" \",'Lisans Öğr.Gör. Sonuç'!D62))=TRUE,LEFT('Lisans Öğr.Gör. Sonuç'!D62,2)&REPT(\"*\",3),LEFT('Lisans Öğr.Gör. Sonuç'!D62,2)&REPT(\"*\",3)&\" \"&MID('Lisans Öğr.Gör. Sonuç'!D62,FIND(\" \",'Lisans Öğr.Gör. Sonuç'!D62)+1,2)&REPT(\"*\",3)))","v":""},{"$f":"IF('Lisans Öğr.Gör. Sonuç'!E62=\"\",\"\",'Lisans Öğr.Gör. Sonuç'!E62)","v":""},{"$f":"IF('Lisans Öğr.Gör. Sonuç'!F62=\"\",\"\",'Lisans Öğr.Gör. Sonuç'!F62)","v":""},{"$f":"IF('Lisans Öğr.Gör. Sonuç'!G62=\"\",\"\",'Lisans Öğr.Gör. Sonuç'!G62)","v":""},{"$f":"IF('Lisans Öğr.Gör. Sonuç'!H62=\"\",\"\",'Lisans Öğr.Gör. Sonuç'!H62)","v":""},{"$f":"IF('Lisans Öğr.Gör. Sonuç'!I62=\"\",\"\",'Lisans Öğr.Gör. Sonuç'!I62)","v":""},{"$f":"IF('Lisans Öğr.Gör. Sonuç'!J62=\"\",\"\",'Lisans Öğr.Gör. Sonuç'!J62)","v":""},{"$f":"IF('Lisans Öğr.Gör. Sonuç'!K62=\"\",\"\",'Lisans Öğr.Gör. Sonuç'!K62)","v":""},{"$f":"IF('Lisans Öğr.Gör. Sonuç'!L62=\"\",\"\",'Lisans Öğr.Gör. Sonuç'!L62)","v":""},{"$f":"IF('Lisans Öğr.Gör. Sonuç'!M62=\"\",\"\",'Lisans Öğr.Gör. Sonuç'!M62)","v":""},{"$f":"IF('Lisans Öğr.Gör. Sonuç'!N62=\"\",\"\",'Lisans Öğr.Gör. Sonuç'!N62)","v":""}]
[{"$f":"IF('Lisans Öğr.Gör. Sonuç'!A63=\"\",\"\",'Lisans Öğr.Gör. Sonuç'!A63)","v":""},{"$f":"IF('Lisans Öğr.Gör. Sonuç'!B63=\"\",\"\",LEFT('Lisans Öğr.Gör. Sonuç'!B63,3)&REPT(\"*\",4)&RIGHT('Lisans Öğr.Gör. Sonuç'!B63,2))","v":""},{"$f":"IF('Lisans Öğr.Gör. Sonuç'!C63=\"\",\"\",IF(ISERR(FIND(\" \",'Lisans Öğr.Gör. Sonuç'!C63))=TRUE,LEFT('Lisans Öğr.Gör. Sonuç'!C63,2)&REPT(\"*\",3),LEFT('Lisans Öğr.Gör. Sonuç'!C63,2)&REPT(\"*\",3)&\" \"&MID('Lisans Öğr.Gör. Sonuç'!C63,FIND(\" \",'Lisans Öğr.Gör. Sonuç'!C63)+1,2)&REPT(\"*\",3)))","v":""},{"$f":"IF('Lisans Öğr.Gör. Sonuç'!D63=\"\",\"\",IF(ISERR(FIND(\" \",'Lisans Öğr.Gör. Sonuç'!D63))=TRUE,LEFT('Lisans Öğr.Gör. Sonuç'!D63,2)&REPT(\"*\",3),LEFT('Lisans Öğr.Gör. Sonuç'!D63,2)&REPT(\"*\",3)&\" \"&MID('Lisans Öğr.Gör. Sonuç'!D63,FIND(\" \",'Lisans Öğr.Gör. Sonuç'!D63)+1,2)&REPT(\"*\",3)))","v":""},{"$f":"IF('Lisans Öğr.Gör. Sonuç'!E63=\"\",\"\",'Lisans Öğr.Gör. Sonuç'!E63)","v":""},{"$f":"IF('Lisans Öğr.Gör. Sonuç'!F63=\"\",\"\",'Lisans Öğr.Gör. Sonuç'!F63)","v":""},{"$f":"IF('Lisans Öğr.Gör. Sonuç'!G63=\"\",\"\",'Lisans Öğr.Gör. Sonuç'!G63)","v":""},{"$f":"IF('Lisans Öğr.Gör. Sonuç'!H63=\"\",\"\",'Lisans Öğr.Gör. Sonuç'!H63)","v":""},{"$f":"IF('Lisans Öğr.Gör. Sonuç'!I63=\"\",\"\",'Lisans Öğr.Gör. Sonuç'!I63)","v":""},{"$f":"IF('Lisans Öğr.Gör. Sonuç'!J63=\"\",\"\",'Lisans Öğr.Gör. Sonuç'!J63)","v":""},{"$f":"IF('Lisans Öğr.Gör. Sonuç'!K63=\"\",\"\",'Lisans Öğr.Gör. Sonuç'!K63)","v":""},{"$f":"IF('Lisans Öğr.Gör. Sonuç'!L63=\"\",\"\",'Lisans Öğr.Gör. Sonuç'!L63)","v":""},{"$f":"IF('Lisans Öğr.Gör. Sonuç'!M63=\"\",\"\",'Lisans Öğr.Gör. Sonuç'!M63)","v":""},{"$f":"IF('Lisans Öğr.Gör. Sonuç'!N63=\"\",\"\",'Lisans Öğr.Gör. Sonuç'!N63)","v":""}]
[{"$f":"IF('Lisans Öğr.Gör. Sonuç'!A64=\"\",\"\",'Lisans Öğr.Gör. Sonuç'!A64)","v":""},{"$f":"IF('Lisans Öğr.Gör. Sonuç'!B64=\"\",\"\",LEFT('Lisans Öğr.Gör. Sonuç'!B64,3)&REPT(\"*\",4)&RIGHT('Lisans Öğr.Gör. Sonuç'!B64,2))","v":""},{"$f":"IF('Lisans Öğr.Gör. Sonuç'!C64=\"\",\"\",IF(ISERR(FIND(\" \",'Lisans Öğr.Gör. Sonuç'!C64))=TRUE,LEFT('Lisans Öğr.Gör. Sonuç'!C64,2)&REPT(\"*\",3),LEFT('Lisans Öğr.Gör. Sonuç'!C64,2)&REPT(\"*\",3)&\" \"&MID('Lisans Öğr.Gör. Sonuç'!C64,FIND(\" \",'Lisans Öğr.Gör. Sonuç'!C64)+1,2)&REPT(\"*\",3)))","v":""},{"$f":"IF('Lisans Öğr.Gör. Sonuç'!D64=\"\",\"\",IF(ISERR(FIND(\" \",'Lisans Öğr.Gör. Sonuç'!D64))=TRUE,LEFT('Lisans Öğr.Gör. Sonuç'!D64,2)&REPT(\"*\",3),LEFT('Lisans Öğr.Gör. Sonuç'!D64,2)&REPT(\"*\",3)&\" \"&MID('Lisans Öğr.Gör. Sonuç'!D64,FIND(\" \",'Lisans Öğr.Gör. Sonuç'!D64)+1,2)&REPT(\"*\",3)))","v":""},{"$f":"IF('Lisans Öğr.Gör. Sonuç'!E64=\"\",\"\",'Lisans Öğr.Gör. Sonuç'!E64)","v":""},{"$f":"IF('Lisans Öğr.Gör. Sonuç'!F64=\"\",\"\",'Lisans Öğr.Gör. Sonuç'!F64)","v":""},{"$f":"IF('Lisans Öğr.Gör. Sonuç'!G64=\"\",\"\",'Lisans Öğr.Gör. Sonuç'!G64)","v":""},{"$f":"IF('Lisans Öğr.Gör. Sonuç'!H64=\"\",\"\",'Lisans Öğr.Gör. Sonuç'!H64)","v":""},{"$f":"IF('Lisans Öğr.Gör. Sonuç'!I64=\"\",\"\",'Lisans Öğr.Gör. Sonuç'!I64)","v":""},{"$f":"IF('Lisans Öğr.Gör. Sonuç'!J64=\"\",\"\",'Lisans Öğr.Gör. Sonuç'!J64)","v":""},{"$f":"IF('Lisans Öğr.Gör. Sonuç'!K64=\"\",\"\",'Lisans Öğr.Gör. Sonuç'!K64)","v":""},{"$f":"IF('Lisans Öğr.Gör. Sonuç'!L64=\"\",\"\",'Lisans Öğr.Gör. Sonuç'!L64)","v":""},{"$f":"IF('Lisans Öğr.Gör. Sonuç'!M64=\"\",\"\",'Lisans Öğr.Gör. Sonuç'!M64)","v":""},{"$f":"IF('Lisans Öğr.Gör. Sonuç'!N64=\"\",\"\",'Lisans Öğr.Gör. Sonuç'!N64)","v":""}]
[{"$f":"IF('Lisans Öğr.Gör. Sonuç'!A65=\"\",\"\",'Lisans Öğr.Gör. Sonuç'!A65)","v":""},{"$f":"IF('Lisans Öğr.Gör. Sonuç'!B65=\"\",\"\",LEFT('Lisans Öğr.Gör. Sonuç'!B65,3)&REPT(\"*\",4)&RIGHT('Lisans Öğr.Gör. Sonuç'!B65,2))","v":""},{"$f":"IF('Lisans Öğr.Gör. Sonuç'!C65=\"\",\"\",IF(ISERR(FIND(\" \",'Lisans Öğr.Gör. Sonuç'!C65))=TRUE,LEFT('Lisans Öğr.Gör. Sonuç'!C65,2)&REPT(\"*\",3),LEFT('Lisans Öğr.Gör. Sonuç'!C65,2)&REPT(\"*\",3)&\" \"&MID('Lisans Öğr.Gör. Sonuç'!C65,FIND(\" \",'Lisans Öğr.Gör. Sonuç'!C65)+1,2)&REPT(\"*\",3)))","v":""},{"$f":"IF('Lisans Öğr.Gör. Sonuç'!D65=\"\",\"\",IF(ISERR(FIND(\" \",'Lisans Öğr.Gör. Sonuç'!D65))=TRUE,LEFT('Lisans Öğr.Gör. Sonuç'!D65,2)&REPT(\"*\",3),LEFT('Lisans Öğr.Gör. Sonuç'!D65,2)&REPT(\"*\",3)&\" \"&MID('Lisans Öğr.Gör. Sonuç'!D65,FIND(\" \",'Lisans Öğr.Gör. Sonuç'!D65)+1,2)&REPT(\"*\",3)))","v":""},{"$f":"IF('Lisans Öğr.Gör. Sonuç'!E65=\"\",\"\",'Lisans Öğr.Gör. Sonuç'!E65)","v":""},{"$f":"IF('Lisans Öğr.Gör. Sonuç'!F65=\"\",\"\",'Lisans Öğr.Gör. Sonuç'!F65)","v":""},{"$f":"IF('Lisans Öğr.Gör. Sonuç'!G65=\"\",\"\",'Lisans Öğr.Gör. Sonuç'!G65)","v":""},{"$f":"IF('Lisans Öğr.Gör. Sonuç'!H65=\"\",\"\",'Lisans Öğr.Gör. Sonuç'!H65)","v":""},{"$f":"IF('Lisans Öğr.Gör. Sonuç'!I65=\"\",\"\",'Lisans Öğr.Gör. Sonuç'!I65)","v":""},{"$f":"IF('Lisans Öğr.Gör. Sonuç'!J65=\"\",\"\",'Lisans Öğr.Gör. Sonuç'!J65)","v":""},{"$f":"IF('Lisans Öğr.Gör. Sonuç'!K65=\"\",\"\",'Lisans Öğr.Gör. Sonuç'!K65)","v":""},{"$f":"IF('Lisans Öğr.Gör. Sonuç'!L65=\"\",\"\",'Lisans Öğr.Gör. Sonuç'!L65)","v":""},{"$f":"IF('Lisans Öğr.Gör. Sonuç'!M65=\"\",\"\",'Lisans Öğr.Gör. Sonuç'!M65)","v":""},{"$f":"IF('Lisans Öğr.Gör. Sonuç'!N65=\"\",\"\",'Lisans Öğr.Gör. Sonuç'!N65)","v":""}]
[{"$f":"IF('Lisans Öğr.Gör. Sonuç'!A66=\"\",\"\",'Lisans Öğr.Gör. Sonuç'!A66)","v":""},{"$f":"IF('Lisans Öğr.Gör. Sonuç'!B66=\"\",\"\",LEFT('Lisans Öğr.Gör. Sonuç'!B66,3)&REPT(\"*\",4)&RIGHT('Lisans Öğr.Gör. Sonuç'!B66,2))","v":""},{"$f":"IF('Lisans Öğr.Gör. Sonuç'!C66=\"\",\"\",IF(ISERR(FIND(\" \",'Lisans Öğr.Gör. Sonuç'!C66))=TRUE,LEFT('Lisans Öğr.Gör. Sonuç'!C66,2)&REPT(\"*\",3),LEFT('Lisans Öğr.Gör. Sonuç'!C66,2)&REPT(\"*\",3)&\" \"&MID('Lisans Öğr.Gör. Sonuç'!C66,FIND(\" \",'Lisans Öğr.Gör. Sonuç'!C66)+1,2)&REPT(\"*\",3)))","v":""},{"$f":"IF('Lisans Öğr.Gör. Sonuç'!D66=\"\",\"\",IF(ISERR(FIND(\" \",'Lisans Öğr.Gör. Sonuç'!D66))=TRUE,LEFT('Lisans Öğr.Gör. Sonuç'!D66,2)&REPT(\"*\",3),LEFT('Lisans Öğr.Gör. Sonuç'!D66,2)&REPT(\"*\",3)&\" \"&MID('Lisans Öğr.Gör. Sonuç'!D66,FIND(\" \",'Lisans Öğr.Gör. Sonuç'!D66)+1,2)&REPT(\"*\",3)))","v":""},{"$f":"IF('Lisans Öğr.Gör. Sonuç'!E66=\"\",\"\",'Lisans Öğr.Gör. Sonuç'!E66)","v":""},{"$f":"IF('Lisans Öğr.Gör. Sonuç'!F66=\"\",\"\",'Lisans Öğr.Gör. Sonuç'!F66)","v":""},{"$f":"IF('Lisans Öğr.Gör. Sonuç'!G66=\"\",\"\",'Lisans Öğr.Gör. Sonuç'!G66)","v":""},{"$f":"IF('Lisans Öğr.Gör. Sonuç'!H66=\"\",\"\",'Lisans Öğr.Gör. Sonuç'!H66)","v":""},{"$f":"IF('Lisans Öğr.Gör. Sonuç'!I66=\"\",\"\",'Lisans Öğr.Gör. Sonuç'!I66)","v":""},{"$f":"IF('Lisans Öğr.Gör. Sonuç'!J66=\"\",\"\",'Lisans Öğr.Gör. Sonuç'!J66)","v":""},{"$f":"IF('Lisans Öğr.Gör. Sonuç'!K66=\"\",\"\",'Lisans Öğr.Gör. Sonuç'!K66)","v":""},{"$f":"IF('Lisans Öğr.Gör. Sonuç'!L66=\"\",\"\",'Lisans Öğr.Gör. Sonuç'!L66)","v":""},{"$f":"IF('Lisans Öğr.Gör. Sonuç'!M66=\"\",\"\",'Lisans Öğr.Gör. Sonuç'!M66)","v":""},{"$f":"IF('Lisans Öğr.Gör. Sonuç'!N66=\"\",\"\",'Lisans Öğr.Gör. Sonuç'!N66)","v":""}]
[{"$f":"IF('Lisans Öğr.Gör. Sonuç'!A67=\"\",\"\",'Lisans Öğr.Gör. Sonuç'!A67)","v":""},{"$f":"IF('Lisans Öğr.Gör. Sonuç'!B67=\"\",\"\",LEFT('Lisans Öğr.Gör. Sonuç'!B67,3)&REPT(\"*\",4)&RIGHT('Lisans Öğr.Gör. Sonuç'!B67,2))","v":""},{"$f":"IF('Lisans Öğr.Gör. Sonuç'!C67=\"\",\"\",IF(ISERR(FIND(\" \",'Lisans Öğr.Gör. Sonuç'!C67))=TRUE,LEFT('Lisans Öğr.Gör. Sonuç'!C67,2)&REPT(\"*\",3),LEFT('Lisans Öğr.Gör. Sonuç'!C67,2)&REPT(\"*\",3)&\" \"&MID('Lisans Öğr.Gör. Sonuç'!C67,FIND(\" \",'Lisans Öğr.Gör. Sonuç'!C67)+1,2)&REPT(\"*\",3)))","v":""},{"$f":"IF('Lisans Öğr.Gör. Sonuç'!D67=\"\",\"\",IF(ISERR(FIND(\" \",'Lisans Öğr.Gör. Sonuç'!D67))=TRUE,LEFT('Lisans Öğr.Gör. Sonuç'!D67,2)&REPT(\"*\",3),LEFT('Lisans Öğr.Gör. Sonuç'!D67,2)&REPT(\"*\",3)&\" \"&MID('Lisans Öğr.Gör. Sonuç'!D67,FIND(\" \",'Lisans Öğr.Gör. Sonuç'!D67)+1,2)&REPT(\"*\",3)))","v":""},{"$f":"IF('Lisans Öğr.Gör. Sonuç'!E67=\"\",\"\",'Lisans Öğr.Gör. Sonuç'!E67)","v":""},{"$f":"IF('Lisans Öğr.Gör. Sonuç'!F67=\"\",\"\",'Lisans Öğr.Gör. Sonuç'!F67)","v":""},{"$f":"IF('Lisans Öğr.Gör. Sonuç'!G67=\"\",\"\",'Lisans Öğr.Gör. Sonuç'!G67)","v":""},{"$f":"IF('Lisans Öğr.Gör. Sonuç'!H67=\"\",\"\",'Lisans Öğr.Gör. Sonuç'!H67)","v":""},{"$f":"IF('Lisans Öğr.Gör. Sonuç'!I67=\"\",\"\",'Lisans Öğr.Gör. Sonuç'!I67)","v":""},{"$f":"IF('Lisans Öğr.Gör. Sonuç'!J67=\"\",\"\",'Lisans Öğr.Gör. Sonuç'!J67)","v":""},{"$f":"IF('Lisans Öğr.Gör. Sonuç'!K67=\"\",\"\",'Lisans Öğr.Gör. Sonuç'!K67)","v":""},{"$f":"IF('Lisans Öğr.Gör. Sonuç'!L67=\"\",\"\",'Lisans Öğr.Gör. Sonuç'!L67)","v":""},{"$f":"IF('Lisans Öğr.Gör. Sonuç'!M67=\"\",\"\",'Lisans Öğr.Gör. Sonuç'!M67)","v":""},{"$f":"IF('Lisans Öğr.Gör. Sonuç'!N67=\"\",\"\",'Lisans Öğr.Gör. Sonuç'!N67)","v":""}]
[{"$f":"IF('Lisans Öğr.Gör. Sonuç'!A68=\"\",\"\",'Lisans Öğr.Gör. Sonuç'!A68)","v":""},{"$f":"IF('Lisans Öğr.Gör. Sonuç'!B68=\"\",\"\",LEFT('Lisans Öğr.Gör. Sonuç'!B68,3)&REPT(\"*\",4)&RIGHT('Lisans Öğr.Gör. Sonuç'!B68,2))","v":""},{"$f":"IF('Lisans Öğr.Gör. Sonuç'!C68=\"\",\"\",IF(ISERR(FIND(\" \",'Lisans Öğr.Gör. Sonuç'!C68))=TRUE,LEFT('Lisans Öğr.Gör. Sonuç'!C68,2)&REPT(\"*\",3),LEFT('Lisans Öğr.Gör. Sonuç'!C68,2)&REPT(\"*\",3)&\" \"&MID('Lisans Öğr.Gör. Sonuç'!C68,FIND(\" \",'Lisans Öğr.Gör. Sonuç'!C68)+1,2)&REPT(\"*\",3)))","v":""},{"$f":"IF('Lisans Öğr.Gör. Sonuç'!D68=\"\",\"\",IF(ISERR(FIND(\" \",'Lisans Öğr.Gör. Sonuç'!D68))=TRUE,LEFT('Lisans Öğr.Gör. Sonuç'!D68,2)&REPT(\"*\",3),LEFT('Lisans Öğr.Gör. Sonuç'!D68,2)&REPT(\"*\",3)&\" \"&MID('Lisans Öğr.Gör. Sonuç'!D68,FIND(\" \",'Lisans Öğr.Gör. Sonuç'!D68)+1,2)&REPT(\"*\",3)))","v":""},{"$f":"IF('Lisans Öğr.Gör. Sonuç'!E68=\"\",\"\",'Lisans Öğr.Gör. Sonuç'!E68)","v":""},{"$f":"IF('Lisans Öğr.Gör. Sonuç'!F68=\"\",\"\",'Lisans Öğr.Gör. Sonuç'!F68)","v":""},{"$f":"IF('Lisans Öğr.Gör. Sonuç'!G68=\"\",\"\",'Lisans Öğr.Gör. Sonuç'!G68)","v":""},{"$f":"IF('Lisans Öğr.Gör. Sonuç'!H68=\"\",\"\",'Lisans Öğr.Gör. Sonuç'!H68)","v":""},{"$f":"IF('Lisans Öğr.Gör. Sonuç'!I68=\"\",\"\",'Lisans Öğr.Gör. Sonuç'!I68)","v":""},{"$f":"IF('Lisans Öğr.Gör. Sonuç'!J68=\"\",\"\",'Lisans Öğr.Gör. Sonuç'!J68)","v":""},{"$f":"IF('Lisans Öğr.Gör. Sonuç'!K68=\"\",\"\",'Lisans Öğr.Gör. Sonuç'!K68)","v":""},{"$f":"IF('Lisans Öğr.Gör. Sonuç'!L68=\"\",\"\",'Lisans Öğr.Gör. Sonuç'!L68)","v":""},{"$f":"IF('Lisans Öğr.Gör. Sonuç'!M68=\"\",\"\",'Lisans Öğr.Gör. Sonuç'!M68)","v":""},{"$f":"IF('Lisans Öğr.Gör. Sonuç'!N68=\"\",\"\",'Lisans Öğr.Gör. Sonuç'!N68)","v":""}]
[{"$f":"IF('Lisans Öğr.Gör. Sonuç'!A69=\"\",\"\",'Lisans Öğr.Gör. Sonuç'!A69)","v":""},{"$f":"IF('Lisans Öğr.Gör. Sonuç'!B69=\"\",\"\",LEFT('Lisans Öğr.Gör. Sonuç'!B69,3)&REPT(\"*\",4)&RIGHT('Lisans Öğr.Gör. Sonuç'!B69,2))","v":""},{"$f":"IF('Lisans Öğr.Gör. Sonuç'!C69=\"\",\"\",IF(ISERR(FIND(\" \",'Lisans Öğr.Gör. Sonuç'!C69))=TRUE,LEFT('Lisans Öğr.Gör. Sonuç'!C69,2)&REPT(\"*\",3),LEFT('Lisans Öğr.Gör. Sonuç'!C69,2)&REPT(\"*\",3)&\" \"&MID('Lisans Öğr.Gör. Sonuç'!C69,FIND(\" \",'Lisans Öğr.Gör. Sonuç'!C69)+1,2)&REPT(\"*\",3)))","v":""},{"$f":"IF('Lisans Öğr.Gör. Sonuç'!D69=\"\",\"\",IF(ISERR(FIND(\" \",'Lisans Öğr.Gör. Sonuç'!D69))=TRUE,LEFT('Lisans Öğr.Gör. Sonuç'!D69,2)&REPT(\"*\",3),LEFT('Lisans Öğr.Gör. Sonuç'!D69,2)&REPT(\"*\",3)&\" \"&MID('Lisans Öğr.Gör. Sonuç'!D69,FIND(\" \",'Lisans Öğr.Gör. Sonuç'!D69)+1,2)&REPT(\"*\",3)))","v":""},{"$f":"IF('Lisans Öğr.Gör. Sonuç'!E69=\"\",\"\",'Lisans Öğr.Gör. Sonuç'!E69)","v":""},{"$f":"IF('Lisans Öğr.Gör. Sonuç'!F69=\"\",\"\",'Lisans Öğr.Gör. Sonuç'!F69)","v":""},{"$f":"IF('Lisans Öğr.Gör. Sonuç'!G69=\"\",\"\",'Lisans Öğr.Gör. Sonuç'!G69)","v":""},{"$f":"IF('Lisans Öğr.Gör. Sonuç'!H69=\"\",\"\",'Lisans Öğr.Gör. Sonuç'!H69)","v":""},{"$f":"IF('Lisans Öğr.Gör. Sonuç'!I69=\"\",\"\",'Lisans Öğr.Gör. Sonuç'!I69)","v":""},{"$f":"IF('Lisans Öğr.Gör. Sonuç'!J69=\"\",\"\",'Lisans Öğr.Gör. Sonuç'!J69)","v":""},{"$f":"IF('Lisans Öğr.Gör. Sonuç'!K69=\"\",\"\",'Lisans Öğr.Gör. Sonuç'!K69)","v":""},{"$f":"IF('Lisans Öğr.Gör. Sonuç'!L69=\"\",\"\",'Lisans Öğr.Gör. Sonuç'!L69)","v":""},{"$f":"IF('Lisans Öğr.Gör. Sonuç'!M69=\"\",\"\",'Lisans Öğr.Gör. Sonuç'!M69)","v":""},{"$f":"IF('Lisans Öğr.Gör. Sonuç'!N69=\"\",\"\",'Lisans Öğr.Gör. Sonuç'!N69)","v":""}]
[{"$f":"IF('Lisans Öğr.Gör. Sonuç'!A70=\"\",\"\",'Lisans Öğr.Gör. Sonuç'!A70)","v":""},{"$f":"IF('Lisans Öğr.Gör. Sonuç'!B70=\"\",\"\",LEFT('Lisans Öğr.Gör. Sonuç'!B70,3)&REPT(\"*\",4)&RIGHT('Lisans Öğr.Gör. Sonuç'!B70,2))","v":""},{"$f":"IF('Lisans Öğr.Gör. Sonuç'!C70=\"\",\"\",IF(ISERR(FIND(\" \",'Lisans Öğr.Gör. Sonuç'!C70))=TRUE,LEFT('Lisans Öğr.Gör. Sonuç'!C70,2)&REPT(\"*\",3),LEFT('Lisans Öğr.Gör. Sonuç'!C70,2)&REPT(\"*\",3)&\" \"&MID('Lisans Öğr.Gör. Sonuç'!C70,FIND(\" \",'Lisans Öğr.Gör. Sonuç'!C70)+1,2)&REPT(\"*\",3)))","v":""},{"$f":"IF('Lisans Öğr.Gör. Sonuç'!D70=\"\",\"\",IF(ISERR(FIND(\" \",'Lisans Öğr.Gör. Sonuç'!D70))=TRUE,LEFT('Lisans Öğr.Gör. Sonuç'!D70,2)&REPT(\"*\",3),LEFT('Lisans Öğr.Gör. Sonuç'!D70,2)&REPT(\"*\",3)&\" \"&MID('Lisans Öğr.Gör. Sonuç'!D70,FIND(\" \",'Lisans Öğr.Gör. Sonuç'!D70)+1,2)&REPT(\"*\",3)))","v":""},{"$f":"IF('Lisans Öğr.Gör. Sonuç'!E70=\"\",\"\",'Lisans Öğr.Gör. Sonuç'!E70)","v":""},{"$f":"IF('Lisans Öğr.Gör. Sonuç'!F70=\"\",\"\",'Lisans Öğr.Gör. Sonuç'!F70)","v":""},{"$f":"IF('Lisans Öğr.Gör. Sonuç'!G70=\"\",\"\",'Lisans Öğr.Gör. Sonuç'!G70)","v":""},{"$f":"IF('Lisans Öğr.Gör. Sonuç'!H70=\"\",\"\",'Lisans Öğr.Gör. Sonuç'!H70)","v":""},{"$f":"IF('Lisans Öğr.Gör. Sonuç'!I70=\"\",\"\",'Lisans Öğr.Gör. Sonuç'!I70)","v":""},{"$f":"IF('Lisans Öğr.Gör. Sonuç'!J70=\"\",\"\",'Lisans Öğr.Gör. Sonuç'!J70)","v":""},{"$f":"IF('Lisans Öğr.Gör. Sonuç'!K70=\"\",\"\",'Lisans Öğr.Gör. Sonuç'!K70)","v":""},{"$f":"IF('Lisans Öğr.Gör. Sonuç'!L70=\"\",\"\",'Lisans Öğr.Gör. Sonuç'!L70)","v":""},{"$f":"IF('Lisans Öğr.Gör. Sonuç'!M70=\"\",\"\",'Lisans Öğr.Gör. Sonuç'!M70)","v":""},{"$f":"IF('Lisans Öğr.Gör. Sonuç'!N70=\"\",\"\",'Lisans Öğr.Gör. Sonuç'!N70)","v":""}]
[{"$f":"IF('Lisans Öğr.Gör. Sonuç'!A71=\"\",\"\",'Lisans Öğr.Gör. Sonuç'!A71)","v":""},{"$f":"IF('Lisans Öğr.Gör. Sonuç'!B71=\"\",\"\",LEFT('Lisans Öğr.Gör. Sonuç'!B71,3)&REPT(\"*\",4)&RIGHT('Lisans Öğr.Gör. Sonuç'!B71,2))","v":""},{"$f":"IF('Lisans Öğr.Gör. Sonuç'!C71=\"\",\"\",IF(ISERR(FIND(\" \",'Lisans Öğr.Gör. Sonuç'!C71))=TRUE,LEFT('Lisans Öğr.Gör. Sonuç'!C71,2)&REPT(\"*\",3),LEFT('Lisans Öğr.Gör. Sonuç'!C71,2)&REPT(\"*\",3)&\" \"&MID('Lisans Öğr.Gör. Sonuç'!C71,FIND(\" \",'Lisans Öğr.Gör. Sonuç'!C71)+1,2)&REPT(\"*\",3)))","v":""},{"$f":"IF('Lisans Öğr.Gör. Sonuç'!D71=\"\",\"\",IF(ISERR(FIND(\" \",'Lisans Öğr.Gör. Sonuç'!D71))=TRUE,LEFT('Lisans Öğr.Gör. Sonuç'!D71,2)&REPT(\"*\",3),LEFT('Lisans Öğr.Gör. Sonuç'!D71,2)&REPT(\"*\",3)&\" \"&MID('Lisans Öğr.Gör. Sonuç'!D71,FIND(\" \",'Lisans Öğr.Gör. Sonuç'!D71)+1,2)&REPT(\"*\",3)))","v":""},{"$f":"IF('Lisans Öğr.Gör. Sonuç'!E71=\"\",\"\",'Lisans Öğr.Gör. Sonuç'!E71)","v":""},{"$f":"IF('Lisans Öğr.Gör. Sonuç'!F71=\"\",\"\",'Lisans Öğr.Gör. Sonuç'!F71)","v":""},{"$f":"IF('Lisans Öğr.Gör. Sonuç'!G71=\"\",\"\",'Lisans Öğr.Gör. Sonuç'!G71)","v":""},{"$f":"IF('Lisans Öğr.Gör. Sonuç'!H71=\"\",\"\",'Lisans Öğr.Gör. Sonuç'!H71)","v":""},{"$f":"IF('Lisans Öğr.Gör. Sonuç'!I71=\"\",\"\",'Lisans Öğr.Gör. Sonuç'!I71)","v":""},{"$f":"IF('Lisans Öğr.Gör. Sonuç'!J71=\"\",\"\",'Lisans Öğr.Gör. Sonuç'!J71)","v":""},{"$f":"IF('Lisans Öğr.Gör. Sonuç'!K71=\"\",\"\",'Lisans Öğr.Gör. Sonuç'!K71)","v":""},{"$f":"IF('Lisans Öğr.Gör. Sonuç'!L71=\"\",\"\",'Lisans Öğr.Gör. Sonuç'!L71)","v":""},{"$f":"IF('Lisans Öğr.Gör. Sonuç'!M71=\"\",\"\",'Lisans Öğr.Gör. Sonuç'!M71)","v":""},{"$f":"IF('Lisans Öğr.Gör. Sonuç'!N71=\"\",\"\",'Lisans Öğr.Gör. Sonuç'!N71)","v":""}]
[{"$f":"IF('Lisans Öğr.Gör. Sonuç'!A72=\"\",\"\",'Lisans Öğr.Gör. Sonuç'!A72)","v":""},{"$f":"IF('Lisans Öğr.Gör. Sonuç'!B72=\"\",\"\",LEFT('Lisans Öğr.Gör. Sonuç'!B72,3)&REPT(\"*\",4)&RIGHT('Lisans Öğr.Gör. Sonuç'!B72,2))","v":""},{"$f":"IF('Lisans Öğr.Gör. Sonuç'!C72=\"\",\"\",IF(ISERR(FIND(\" \",'Lisans Öğr.Gör. Sonuç'!C72))=TRUE,LEFT('Lisans Öğr.Gör. Sonuç'!C72,2)&REPT(\"*\",3),LEFT('Lisans Öğr.Gör. Sonuç'!C72,2)&REPT(\"*\",3)&\" \"&MID('Lisans Öğr.Gör. Sonuç'!C72,FIND(\" \",'Lisans Öğr.Gör. Sonuç'!C72)+1,2)&REPT(\"*\",3)))","v":""},{"$f":"IF('Lisans Öğr.Gör. Sonuç'!D72=\"\",\"\",IF(ISERR(FIND(\" \",'Lisans Öğr.Gör. Sonuç'!D72))=TRUE,LEFT('Lisans Öğr.Gör. Sonuç'!D72,2)&REPT(\"*\",3),LEFT('Lisans Öğr.Gör. Sonuç'!D72,2)&REPT(\"*\",3)&\" \"&MID('Lisans Öğr.Gör. Sonuç'!D72,FIND(\" \",'Lisans Öğr.Gör. Sonuç'!D72)+1,2)&REPT(\"*\",3)))","v":""},{"$f":"IF('Lisans Öğr.Gör. Sonuç'!E72=\"\",\"\",'Lisans Öğr.Gör. Sonuç'!E72)","v":""},{"$f":"IF('Lisans Öğr.Gör. Sonuç'!F72=\"\",\"\",'Lisans Öğr.Gör. Sonuç'!F72)","v":""},{"$f":"IF('Lisans Öğr.Gör. Sonuç'!G72=\"\",\"\",'Lisans Öğr.Gör. Sonuç'!G72)","v":""},{"$f":"IF('Lisans Öğr.Gör. Sonuç'!H72=\"\",\"\",'Lisans Öğr.Gör. Sonuç'!H72)","v":""},{"$f":"IF('Lisans Öğr.Gör. Sonuç'!I72=\"\",\"\",'Lisans Öğr.Gör. Sonuç'!I72)","v":""},{"$f":"IF('Lisans Öğr.Gör. Sonuç'!J72=\"\",\"\",'Lisans Öğr.Gör. Sonuç'!J72)","v":""},{"$f":"IF('Lisans Öğr.Gör. Sonuç'!K72=\"\",\"\",'Lisans Öğr.Gör. Sonuç'!K72)","v":""},{"$f":"IF('Lisans Öğr.Gör. Sonuç'!L72=\"\",\"\",'Lisans Öğr.Gör. Sonuç'!L72)","v":""},{"$f":"IF('Lisans Öğr.Gör. Sonuç'!M72=\"\",\"\",'Lisans Öğr.Gör. Sonuç'!M72)","v":""},{"$f":"IF('Lisans Öğr.Gör. Sonuç'!N72=\"\",\"\",'Lisans Öğr.Gör. Sonuç'!N72)","v":""}]
[{"$f":"IF('Lisans Öğr.Gör. Sonuç'!A73=\"\",\"\",'Lisans Öğr.Gör. Sonuç'!A73)","v":""},{"$f":"IF('Lisans Öğr.Gör. Sonuç'!B73=\"\",\"\",LEFT('Lisans Öğr.Gör. Sonuç'!B73,3)&REPT(\"*\",4)&RIGHT('Lisans Öğr.Gör. Sonuç'!B73,2))","v":""},{"$f":"IF('Lisans Öğr.Gör. Sonuç'!C73=\"\",\"\",IF(ISERR(FIND(\" \",'Lisans Öğr.Gör. Sonuç'!C73))=TRUE,LEFT('Lisans Öğr.Gör. Sonuç'!C73,2)&REPT(\"*\",3),LEFT('Lisans Öğr.Gör. Sonuç'!C73,2)&REPT(\"*\",3)&\" \"&MID('Lisans Öğr.Gör. Sonuç'!C73,FIND(\" \",'Lisans Öğr.Gör. Sonuç'!C73)+1,2)&REPT(\"*\",3)))","v":""},{"$f":"IF('Lisans Öğr.Gör. Sonuç'!D73=\"\",\"\",IF(ISERR(FIND(\" \",'Lisans Öğr.Gör. Sonuç'!D73))=TRUE,LEFT('Lisans Öğr.Gör. Sonuç'!D73,2)&REPT(\"*\",3),LEFT('Lisans Öğr.Gör. Sonuç'!D73,2)&REPT(\"*\",3)&\" \"&MID('Lisans Öğr.Gör. Sonuç'!D73,FIND(\" \",'Lisans Öğr.Gör. Sonuç'!D73)+1,2)&REPT(\"*\",3)))","v":""},{"$f":"IF('Lisans Öğr.Gör. Sonuç'!E73=\"\",\"\",'Lisans Öğr.Gör. Sonuç'!E73)","v":""},{"$f":"IF('Lisans Öğr.Gör. Sonuç'!F73=\"\",\"\",'Lisans Öğr.Gör. Sonuç'!F73)","v":""},{"$f":"IF('Lisans Öğr.Gör. Sonuç'!G73=\"\",\"\",'Lisans Öğr.Gör. Sonuç'!G73)","v":""},{"$f":"IF('Lisans Öğr.Gör. Sonuç'!H73=\"\",\"\",'Lisans Öğr.Gör. Sonuç'!H73)","v":""},{"$f":"IF('Lisans Öğr.Gör. Sonuç'!I73=\"\",\"\",'Lisans Öğr.Gör. Sonuç'!I73)","v":""},{"$f":"IF('Lisans Öğr.Gör. Sonuç'!J73=\"\",\"\",'Lisans Öğr.Gör. Sonuç'!J73)","v":""},{"$f":"IF('Lisans Öğr.Gör. Sonuç'!K73=\"\",\"\",'Lisans Öğr.Gör. Sonuç'!K73)","v":""},{"$f":"IF('Lisans Öğr.Gör. Sonuç'!L73=\"\",\"\",'Lisans Öğr.Gör. Sonuç'!L73)","v":""},{"$f":"IF('Lisans Öğr.Gör. Sonuç'!M73=\"\",\"\",'Lisans Öğr.Gör. Sonuç'!M73)","v":""},{"$f":"IF('Lisans Öğr.Gör. Sonuç'!N73=\"\",\"\",'Lisans Öğr.Gör. Sonuç'!N73)","v":""}]
[{"$f":"IF('Lisans Öğr.Gör. Sonuç'!A74=\"\",\"\",'Lisans Öğr.Gör. Sonuç'!A74)","v":""},{"$f":"IF('Lisans Öğr.Gör. Sonuç'!B74=\"\",\"\",LEFT('Lisans Öğr.Gör. Sonuç'!B74,3)&REPT(\"*\",4)&RIGHT('Lisans Öğr.Gör. Sonuç'!B74,2))","v":""},{"$f":"IF('Lisans Öğr.Gör. Sonuç'!C74=\"\",\"\",IF(ISERR(FIND(\" \",'Lisans Öğr.Gör. Sonuç'!C74))=TRUE,LEFT('Lisans Öğr.Gör. Sonuç'!C74,2)&REPT(\"*\",3),LEFT('Lisans Öğr.Gör. Sonuç'!C74,2)&REPT(\"*\",3)&\" \"&MID('Lisans Öğr.Gör. Sonuç'!C74,FIND(\" \",'Lisans Öğr.Gör. Sonuç'!C74)+1,2)&REPT(\"*\",3)))","v":""},{"$f":"IF('Lisans Öğr.Gör. Sonuç'!D74=\"\",\"\",IF(ISERR(FIND(\" \",'Lisans Öğr.Gör. Sonuç'!D74))=TRUE,LEFT('Lisans Öğr.Gör. Sonuç'!D74,2)&REPT(\"*\",3),LEFT('Lisans Öğr.Gör. Sonuç'!D74,2)&REPT(\"*\",3)&\" \"&MID('Lisans Öğr.Gör. Sonuç'!D74,FIND(\" \",'Lisans Öğr.Gör. Sonuç'!D74)+1,2)&REPT(\"*\",3)))","v":""},{"$f":"IF('Lisans Öğr.Gör. Sonuç'!E74=\"\",\"\",'Lisans Öğr.Gör. Sonuç'!E74)","v":""},{"$f":"IF('Lisans Öğr.Gör. Sonuç'!F74=\"\",\"\",'Lisans Öğr.Gör. Sonuç'!F74)","v":""},{"$f":"IF('Lisans Öğr.Gör. Sonuç'!G74=\"\",\"\",'Lisans Öğr.Gör. Sonuç'!G74)","v":""},{"$f":"IF('Lisans Öğr.Gör. Sonuç'!H74=\"\",\"\",'Lisans Öğr.Gör. Sonuç'!H74)","v":""},{"$f":"IF('Lisans Öğr.Gör. Sonuç'!I74=\"\",\"\",'Lisans Öğr.Gör. Sonuç'!I74)","v":""},{"$f":"IF('Lisans Öğr.Gör. Sonuç'!J74=\"\",\"\",'Lisans Öğr.Gör. Sonuç'!J74)","v":""},{"$f":"IF('Lisans Öğr.Gör. Sonuç'!K74=\"\",\"\",'Lisans Öğr.Gör. Sonuç'!K74)","v":""},{"$f":"IF('Lisans Öğr.Gör. Sonuç'!L74=\"\",\"\",'Lisans Öğr.Gör. Sonuç'!L74)","v":""},{"$f":"IF('Lisans Öğr.Gör. Sonuç'!M74=\"\",\"\",'Lisans Öğr.Gör. Sonuç'!M74)","v":""},{"$f":"IF('Lisans Öğr.Gör. Sonuç'!N74=\"\",\"\",'Lisans Öğr.Gör. Sonuç'!N74)","v":""}]
[{"$f":"IF('Lisans Öğr.Gör. Sonuç'!A75=\"\",\"\",'Lisans Öğr.Gör. Sonuç'!A75)","v":""},{"$f":"IF('Lisans Öğr.Gör. Sonuç'!B75=\"\",\"\",LEFT('Lisans Öğr.Gör. Sonuç'!B75,3)&REPT(\"*\",4)&RIGHT('Lisans Öğr.Gör. Sonuç'!B75,2))","v":""},{"$f":"IF('Lisans Öğr.Gör. Sonuç'!C75=\"\",\"\",IF(ISERR(FIND(\" \",'Lisans Öğr.Gör. Sonuç'!C75))=TRUE,LEFT('Lisans Öğr.Gör. Sonuç'!C75,2)&REPT(\"*\",3),LEFT('Lisans Öğr.Gör. Sonuç'!C75,2)&REPT(\"*\",3)&\" \"&MID('Lisans Öğr.Gör. Sonuç'!C75,FIND(\" \",'Lisans Öğr.Gör. Sonuç'!C75)+1,2)&REPT(\"*\",3)))","v":""},{"$f":"IF('Lisans Öğr.Gör. Sonuç'!D75=\"\",\"\",IF(ISERR(FIND(\" \",'Lisans Öğr.Gör. Sonuç'!D75))=TRUE,LEFT('Lisans Öğr.Gör. Sonuç'!D75,2)&REPT(\"*\",3),LEFT('Lisans Öğr.Gör. Sonuç'!D75,2)&REPT(\"*\",3)&\" \"&MID('Lisans Öğr.Gör. Sonuç'!D75,FIND(\" \",'Lisans Öğr.Gör. Sonuç'!D75)+1,2)&REPT(\"*\",3)))","v":""},{"$f":"IF('Lisans Öğr.Gör. Sonuç'!E75=\"\",\"\",'Lisans Öğr.Gör. Sonuç'!E75)","v":""},{"$f":"IF('Lisans Öğr.Gör. Sonuç'!F75=\"\",\"\",'Lisans Öğr.Gör. Sonuç'!F75)","v":""},{"$f":"IF('Lisans Öğr.Gör. Sonuç'!G75=\"\",\"\",'Lisans Öğr.Gör. Sonuç'!G75)","v":""},{"$f":"IF('Lisans Öğr.Gör. Sonuç'!H75=\"\",\"\",'Lisans Öğr.Gör. Sonuç'!H75)","v":""},{"$f":"IF('Lisans Öğr.Gör. Sonuç'!I75=\"\",\"\",'Lisans Öğr.Gör. Sonuç'!I75)","v":""},{"$f":"IF('Lisans Öğr.Gör. Sonuç'!J75=\"\",\"\",'Lisans Öğr.Gör. Sonuç'!J75)","v":""},{"$f":"IF('Lisans Öğr.Gör. Sonuç'!K75=\"\",\"\",'Lisans Öğr.Gör. Sonuç'!K75)","v":""},{"$f":"IF('Lisans Öğr.Gör. Sonuç'!L75=\"\",\"\",'Lisans Öğr.Gör. Sonuç'!L75)","v":""},{"$f":"IF('Lisans Öğr.Gör. Sonuç'!M75=\"\",\"\",'Lisans Öğr.Gör. Sonuç'!M75)","v":""},{"$f":"IF('Lisans Öğr.Gör. Sonuç'!N75=\"\",\"\",'Lisans Öğr.Gör. Sonuç'!N75)","v":""}]