{"text_format":"1","workbook":"xlsx","n_sheets":4,"sheets":["MYO Ön Değ.","Ön Değ. Rapor","MYO Sonuç","MYO Sonuç  Rapor"],"not_rendered":{"charts":0,"images":1,"macros":1,"external_links":0,"defined_names":1,"comments":0,"pivot_tables":0},"unopened":[],"bounds":{"document_bytes":16777216,"sheet_cells":100000,"rows_first":2000,"rows_last":500,"rows_between":2000,"halvings":0,"cell_chars":16384,"cell_head_chars":4096},"cells_cut":0,"cells_raw":0,"read":"whole","date_system":"1900"}

{"sheet":"MYO Ön Değ.","index":0,"n_rows":30,"n_cols":12,"rows_kept":30,"cut":false,"hidden":false,"merged":[[10,4,10,7],[31,0,31,11],[10,0,11,0],[10,8,10,11],[10,1,10,3],[0,0,0,11],[1,0,1,11],[2,0,2,11],[3,0,3,11],[4,2,4,3],[4,0,4,1],[4,4,4,6],[4,7,4,11],[9,0,9,3],[9,4,9,11],[5,2,5,3],[6,2,6,3],[7,2,7,3],[5,7,5,11],[8,2,8,11],[5,0,5,1],[6,0,6,1],[7,0,7,1],[8,0,8,1],[6,7,6,11],[7,7,7,11],[5,4,5,6],[6,4,6,6],[7,4,7,6]]}
["T.C."]
["BAYBURT ÜNİVERSİTESİ"]
["ÖĞRETİM ELEMANI ÖN DEĞERLENDİRME TUTANAĞI"]
["Üniversitemize bağlı birimlere, 2547 sayılı Kanunun ilgili maddeleri ve 09.11.2018 tarihli ve 30590 sayılı Resmi Gazetede yayımlanan \"Öğretim Üyesi Dışındaki Öğretim Elemanı Kadrolarına Yapılacak Atamalarda Uygulanacak Merkezi Sınav İle Giriş Sınavlarına İlişkin Usul ve Esaslar Hakkında Yönetmelik” 10. Maddesi Uyarınca Lisans ve Ön Lisans Düzeyindeki Eğitim Veren Yerlere Alınacak Akademik Personele Ait Ön Değerlendirme Sonuç Tutanağı  "]
["İlan No:",null,null,null,"Birimi:",null,null,"….. Meslek Yüksekokulu"]
["İlan Tarihi:",null,"…/.../....",null,"Bölümü:",null,null,"…. Bölümü"]
["Kadro Unvanı:",null,"Öğretim Görevlisi",null,"Programı:",null,null,"….. Programı"]
["Kadro Adedi:",null,null,null,"Öndeğerlendirme Tarihi:",null,null,"…/.../...."]
["İlan Özel Şartı:"]
["SINAVIN YAPILACAĞI YER, TARİH ve SAAT :",null,null,null,"……...     ../…/…. Günü Saat: …:…."]
["Sıra No","Başvuranın",null,null,"Başvuru Şartı",null,null,null,"Ön Sıralama Değerlendirme Sonuçları"]
[null,"T.C. Kimlik No","Adı","Soyadı","Alanındaki Ales Puanı","Mezuniyet Notu (100'lük)","Tezli Yüksek Lisans Belgesi","İlan Şartına Uygunluğu (Tecrübe / Nitelikler)","(A)\nALES  (%70)","(B)\nMezuniyet Notu (%30)","(A+B)\nToplam Puan","Ön Değerlendirme Sonucu      "]
[1,11111111111,"Örnek","Örnek",81.505549999999999,81.56,"Mevcut","Uygun",{"$f":"E13*0.7","v":57.053884999999994},{"$f":"F13*0.3","v":24.468},{"$f":"I13+J13","v":81.521884999999997},"Sınava Girebilir"]
[2,11111111111,"Örnek Örnek","Örnek",80.607429999999994,82.03,"Mevcut","Uygun",56.425200999999994,24.608999999999998,81.034200999999996,"Sınava Girebilir"]
[3,11111111111,"Örnek","Örnek Örnek",79.275630000000007,82.53,"Mevcut","Uygun",55.492941000000002,24.759,80.251941000000002,"Sınava Girebilir"]
[4,11111111111,"Örnek Örnek","Örnek Örnek",78.113749999999996,81.56,"Mevcut","Uygun",54.679624999999994,24.468,79.147624999999991,"Sınava Girebilir"]
[5,11111111111,"Örnek","Örnek",77.505549999999999,80.56,"Mevcut","Uygun",54.253884999999997,24.167999999999999,78.421885000000003,"Sınava Girebilir"]
[6,11111111111,"Örnek","Örnek",76.607429999999994,79.03,"Mevcut","Uygun",53.62520099999999,23.709,77.334200999999993,"Sınava Girebilir"]
[7,11111111111,"Örnek","Örnek",75.275630000000007,78.53,"Mevcut","Uygun",52.692941000000005,23.559000000000001,76.251941000000002,"Sınava Girebilir"]
[8,11111111111,"Örnek","Örnek",74.113749999999996,77.56,"Mevcut","Uygun",51.879624999999997,23.268000000000001,75.147625000000005,"Sınava Girebilir"]
[9,11111111111,"Örnek","Örnek",73.505549999999999,76.56,"Mevcut","Uygun",51.453885,22.968,74.421885000000003,"Sınava Girebilir"]
[10,11111111111,"Örnek***","Örnek***",70,80.25,"Mevcut","Uygun",49,24.074999999999999,73.075000000000003,"Sınava Girebilir"]
[11,11111111111,"Örnek","Örnek",71.275630000000007,74.53,"Mevcut","Uygun",49.892941,22.358999999999998,72.251941000000002,"Yönetmelik Gereği Elendi *"]
[12,11111111111,"Örnek","Örnek",70.113749999999996,73.56,"Mevcut","Uygun",49.079624999999993,22.068000000000001,71.147624999999991,"Yönetmelik Gereği Elendi *"]
[13,11111111111,"Örnek","Örnek",70.505549999999999,72.56,"Mevcut","Uygun Değil",49.353884999999998,21.768000000000001,71.121884999999992,"Başvuru Şartını Sağlamıyor (Sertifika eksik)"]
[14,11111111111,"Örnek","Örnek",70.113749999999996,72.56,"Mevcut","Uygun Değil",49.079624999999993,21.768000000000001,70.847624999999994,"Başvuru Şartını Sağlamıyor (Tezli Yüksek Lisans mezuniyet alanı ilanla uyumlu değil)"]
[15,11111111111,"Örnek","Örnek",80,75,"Mevcut","Uygun Değil",56,22.5,78.5,"Başvuru Şartını Sağlamıyor (Tecrübe belgesi eksik/Tecrübe şartını sağlamıyor)"]
[16,11111111111,"Örnek","Örnek",75,78,"Mevcut Değil","Uygun Değil",52.5,23.4,75.900000000000006,"Başvuru Şartını Sağlamıyor (Tezli Yüksek Lisans Mezunu Değil)"]
[17,11111111111,"Örnek","Örnek",78,70,"Mevcut","Uygun Değil",54.599999999999994,21,75.599999999999994,"Başvuru Şartını Sağlamıyor (Lisans Mezuniyet alanı ilanla uyumlu değil)"]
[18,11111111111,"Örnek","Örnek",68,80,"Mevcut","Uygun Değil",47.599999999999994,24,71.599999999999994,"Başvuru Şartını Sağlamıyor (Ales puanı yetersiz)"]

{"sheet":"Ön Değ. Rapor","index":1,"n_rows":75,"n_cols":12,"rows_kept":75,"cut":false,"hidden":false,"merged":[[0,0,0,11],[1,0,1,11],[2,0,2,11],[3,0,3,11],[4,0,4,1],[4,2,4,3],[4,4,4,6],[4,7,4,11],[5,0,5,1],[5,2,5,3],[5,4,5,6],[5,7,5,11],[6,0,6,1],[6,2,6,3],[6,4,6,6],[6,7,6,11],[7,0,7,1],[7,2,7,3],[7,4,7,6],[7,7,7,11],[8,0,8,1],[8,2,8,11],[9,0,9,3],[9,4,9,11],[10,0,11,0],[10,1,10,3],[10,4,10,7],[10,8,10,11]]}
["T.C."]
["BAYBURT ÜNİVERSİTESİ"]
["ÖĞRETİM ELEMANI ÖN DEĞERLENDİRME TUTANAĞI"]
["Üniversitemize bağlı birimlere, 2547 sayılı Kanunun ilgili maddeleri ve 09.11.2018 tarihli ve 30590 sayılı Resmi Gazetede yayımlanan \"Öğretim Üyesi Dışındaki Öğretim Elemanı Kadrolarına Yapılacak Atamalarda Uygulanacak Merkezi Sınav İle Giriş Sınavlarına İlişkin Usul ve Esaslar Hakkında Yönetmelik” 10. Maddesi Uyarınca Lisans ve Ön Lisans Düzeyindeki Eğitim Veren Yerlere Alınacak Akademik Personele Ait Ön Değerlendirme Sonuç Tutanağı  "]
["İlan No:",null,{"$f":"IF('MYO Ön Değ.'!C5=\"\",\"\",'MYO Ön Değ.'!C5)","v":""},null,"Birimi:",null,null,{"$f":"IF('MYO Ön Değ.'!H5=\"\",\"\",'MYO Ön Değ.'!H5)","v":"….. Meslek Yüksekokulu"}]
["İlan Tarihi:",null,{"$f":"IF('MYO Ön Değ.'!C6=\"\",\"\",'MYO Ön Değ.'!C6)","v":"…/.../...."},null,"Bölümü:",null,null,{"$f":"IF('MYO Ön Değ.'!H6=\"\",\"\",'MYO Ön Değ.'!H6)","v":"…. Bölümü"}]
["Kadro Unvanı:",null,{"$f":"IF('MYO Ön Değ.'!C7=\"\",\"\",'MYO Ön Değ.'!C7)","v":"Öğretim Görevlisi"},null,"Programı:",null,null,{"$f":"IF('MYO Ön Değ.'!H7=\"\",\"\",'MYO Ön Değ.'!H7)","v":"….. Programı"}]
["Kadro Adedi:",null,{"$f":"IF('MYO Ön Değ.'!C8=\"\",\"\",'MYO Ön Değ.'!C8)","v":""},null,"Öndeğerlendirme Tarihi:",null,null,{"$f":"IF('MYO Ön Değ.'!H8=\"\",\"\",'MYO Ön Değ.'!H8)","v":"…/.../...."}]
["İlan Özel Şartı:",null,{"$f":"IF('MYO Ön Değ.'!C9=\"\",\"\",'MYO Ön Değ.'!C9)","v":""}]
["SINAVIN YAPILACAĞI YER, TARİH ve SAAT :",null,null,null,{"$f":"IF('MYO Ön Değ.'!E10=\"\",\"\",'MYO Ön Değ.'!E10)","v":"……...     ../…/…. Günü Saat: …:…."}]
["Sıra No","Başvuranın",null,null,"Başvuru Şartı",null,null,null,"Ön Sıralama Değerlendirme Sonuçları"]
[null,"T.C. Kimlik No","Adı","Soyadı","Alanındaki Ales Puanı","Mezuniyet Notu (100'lük)","Tezli Yüksek Lisans Belgesi","İlan Şartına Uygunluğu (Tecrübe / Nitelikler)","(A)\nALES  (%70)","(B)\nMezuniyet Notu (%30)","(A+B)\nToplam Puan","Ön Değerlendirme Sonucu      "]
[{"$f":"IF('MYO Ön Değ.'!A13=\"\",\"\",'MYO Ön Değ.'!A13)","v":1},{"$f":"IF('MYO Ön Değ.'!B13=\"\",\"\",LEFT('MYO Ön Değ.'!B13,3)&REPT(\"*\",4)&RIGHT('MYO Ön Değ.'!B13,2))","v":"111****11"},{"$f":"IF('MYO Ön Değ.'!C13=\"\",\"\",IF(ISERR(FIND(\" \",'MYO Ön Değ.'!C13))=TRUE,LEFT('MYO Ön Değ.'!C13,2)&REPT(\"*\",3),LEFT('MYO Ön Değ.'!C13,2)&REPT(\"*\",3)&\" \"&MID('MYO Ön Değ.'!C13,FIND(\" \",'MYO Ön Değ.'!C13)+1,2)&REPT(\"*\",3)))","v":"Ör***"},{"$f":"IF('MYO Ön Değ.'!D13=\"\",\"\",IF(ISERR(FIND(\" \",'MYO Ön Değ.'!D13))=TRUE,LEFT('MYO Ön Değ.'!D13,2)&REPT(\"*\",3),LEFT('MYO Ön Değ.'!D13,2)&REPT(\"*\",3)&\" \"&MID('MYO Ön Değ.'!D13,FIND(\" \",'MYO Ön Değ.'!D13)+1,2)&REPT(\"*\",3)))","v":"Ör***"},{"$f":"IF('MYO Ön Değ.'!E13=\"\",\"\",'MYO Ön Değ.'!E13)","v":81.505549999999999},{"$f":"IF('MYO Ön Değ.'!F13=\"\",\"\",'MYO Ön Değ.'!F13)","v":81.56},{"$f":"IF('MYO Ön Değ.'!G13=\"\",\"\",'MYO Ön Değ.'!G13)","v":"Mevcut"},{"$f":"IF('MYO Ön Değ.'!H13=\"\",\"\",'MYO Ön Değ.'!H13)","v":"Uygun"},{"$f":"IF('MYO Ön Değ.'!I13=\"\",\"\",'MYO Ön Değ.'!I13)","v":57.053884999999994},{"$f":"IF('MYO Ön Değ.'!J13=\"\",\"\",'MYO Ön Değ.'!J13)","v":24.468},{"$f":"IF('MYO Ön Değ.'!K13=\"\",\"\",'MYO Ön Değ.'!K13)","v":81.521884999999997},{"$f":"IF('MYO Ön Değ.'!L13=\"\",\"\",'MYO Ön Değ.'!L13)","v":"Sınava Girebilir"}]
[{"$f":"IF('MYO Ön Değ.'!A14=\"\",\"\",'MYO Ön Değ.'!A14)","v":2},{"$f":"IF('MYO Ön Değ.'!B14=\"\",\"\",LEFT('MYO Ön Değ.'!B14,3)&REPT(\"*\",4)&RIGHT('MYO Ön Değ.'!B14,2))","v":"111****11"},{"$f":"IF('MYO Ön Değ.'!C14=\"\",\"\",IF(ISERR(FIND(\" \",'MYO Ön Değ.'!C14))=TRUE,LEFT('MYO Ön Değ.'!C14,2)&REPT(\"*\",3),LEFT('MYO Ön Değ.'!C14,2)&REPT(\"*\",3)&\" \"&MID('MYO Ön Değ.'!C14,FIND(\" \",'MYO Ön Değ.'!C14)+1,2)&REPT(\"*\",3)))","v":"Ör*** Ör***"},{"$f":"IF('MYO Ön Değ.'!D14=\"\",\"\",IF(ISERR(FIND(\" \",'MYO Ön Değ.'!D14))=TRUE,LEFT('MYO Ön Değ.'!D14,2)&REPT(\"*\",3),LEFT('MYO Ön Değ.'!D14,2)&REPT(\"*\",3)&\" \"&MID('MYO Ön Değ.'!D14,FIND(\" \",'MYO Ön Değ.'!D14)+1,2)&REPT(\"*\",3)))","v":"Ör***"},{"$f":"IF('MYO Ön Değ.'!E14=\"\",\"\",'MYO Ön Değ.'!E14)","v":80.607429999999994},{"$f":"IF('MYO Ön Değ.'!F14=\"\",\"\",'MYO Ön Değ.'!F14)","v":82.03},{"$f":"IF('MYO Ön Değ.'!G14=\"\",\"\",'MYO Ön Değ.'!G14)","v":"Mevcut"},{"$f":"IF('MYO Ön Değ.'!H14=\"\",\"\",'MYO Ön Değ.'!H14)","v":"Uygun"},{"$f":"IF('MYO Ön Değ.'!I14=\"\",\"\",'MYO Ön Değ.'!I14)","v":56.425200999999994},{"$f":"IF('MYO Ön Değ.'!J14=\"\",\"\",'MYO Ön Değ.'!J14)","v":24.608999999999998},{"$f":"IF('MYO Ön Değ.'!K14=\"\",\"\",'MYO Ön Değ.'!K14)","v":81.034200999999996},{"$f":"IF('MYO Ön Değ.'!L14=\"\",\"\",'MYO Ön Değ.'!L14)","v":"Sınava Girebilir"}]
[{"$f":"IF('MYO Ön Değ.'!A15=\"\",\"\",'MYO Ön Değ.'!A15)","v":3},{"$f":"IF('MYO Ön Değ.'!B15=\"\",\"\",LEFT('MYO Ön Değ.'!B15,3)&REPT(\"*\",4)&RIGHT('MYO Ön Değ.'!B15,2))","v":"111****11"},{"$f":"IF('MYO Ön Değ.'!C15=\"\",\"\",IF(ISERR(FIND(\" \",'MYO Ön Değ.'!C15))=TRUE,LEFT('MYO Ön Değ.'!C15,2)&REPT(\"*\",3),LEFT('MYO Ön Değ.'!C15,2)&REPT(\"*\",3)&\" \"&MID('MYO Ön Değ.'!C15,FIND(\" \",'MYO Ön Değ.'!C15)+1,2)&REPT(\"*\",3)))","v":"Ör***"},{"$f":"IF('MYO Ön Değ.'!D15=\"\",\"\",IF(ISERR(FIND(\" \",'MYO Ön Değ.'!D15))=TRUE,LEFT('MYO Ön Değ.'!D15,2)&REPT(\"*\",3),LEFT('MYO Ön Değ.'!D15,2)&REPT(\"*\",3)&\" \"&MID('MYO Ön Değ.'!D15,FIND(\" \",'MYO Ön Değ.'!D15)+1,2)&REPT(\"*\",3)))","v":"Ör*** Ör***"},{"$f":"IF('MYO Ön Değ.'!E15=\"\",\"\",'MYO Ön Değ.'!E15)","v":79.275630000000007},{"$f":"IF('MYO Ön Değ.'!F15=\"\",\"\",'MYO Ön Değ.'!F15)","v":82.53},{"$f":"IF('MYO Ön Değ.'!G15=\"\",\"\",'MYO Ön Değ.'!G15)","v":"Mevcut"},{"$f":"IF('MYO Ön Değ.'!H15=\"\",\"\",'MYO Ön Değ.'!H15)","v":"Uygun"},{"$f":"IF('MYO Ön Değ.'!I15=\"\",\"\",'MYO Ön Değ.'!I15)","v":55.492941000000002},{"$f":"IF('MYO Ön Değ.'!J15=\"\",\"\",'MYO Ön Değ.'!J15)","v":24.759},{"$f":"IF('MYO Ön Değ.'!K15=\"\",\"\",'MYO Ön Değ.'!K15)","v":80.251941000000002},{"$f":"IF('MYO Ön Değ.'!L15=\"\",\"\",'MYO Ön Değ.'!L15)","v":"Sınava Girebilir"}]
[{"$f":"IF('MYO Ön Değ.'!A16=\"\",\"\",'MYO Ön Değ.'!A16)","v":4},{"$f":"IF('MYO Ön Değ.'!B16=\"\",\"\",LEFT('MYO Ön Değ.'!B16,3)&REPT(\"*\",4)&RIGHT('MYO Ön Değ.'!B16,2))","v":"111****11"},{"$f":"IF('MYO Ön Değ.'!C16=\"\",\"\",IF(ISERR(FIND(\" \",'MYO Ön Değ.'!C16))=TRUE,LEFT('MYO Ön Değ.'!C16,2)&REPT(\"*\",3),LEFT('MYO Ön Değ.'!C16,2)&REPT(\"*\",3)&\" \"&MID('MYO Ön Değ.'!C16,FIND(\" \",'MYO Ön Değ.'!C16)+1,2)&REPT(\"*\",3)))","v":"Ör*** Ör***"},{"$f":"IF('MYO Ön Değ.'!D16=\"\",\"\",IF(ISERR(FIND(\" \",'MYO Ön Değ.'!D16))=TRUE,LEFT('MYO Ön Değ.'!D16,2)&REPT(\"*\",3),LEFT('MYO Ön Değ.'!D16,2)&REPT(\"*\",3)&\" \"&MID('MYO Ön Değ.'!D16,FIND(\" \",'MYO Ön Değ.'!D16)+1,2)&REPT(\"*\",3)))","v":"Ör*** Ör***"},{"$f":"IF('MYO Ön Değ.'!E16=\"\",\"\",'MYO Ön Değ.'!E16)","v":78.113749999999996},{"$f":"IF('MYO Ön Değ.'!F16=\"\",\"\",'MYO Ön Değ.'!F16)","v":81.56},{"$f":"IF('MYO Ön Değ.'!G16=\"\",\"\",'MYO Ön Değ.'!G16)","v":"Mevcut"},{"$f":"IF('MYO Ön Değ.'!H16=\"\",\"\",'MYO Ön Değ.'!H16)","v":"Uygun"},{"$f":"IF('MYO Ön Değ.'!I16=\"\",\"\",'MYO Ön Değ.'!I16)","v":54.679624999999994},{"$f":"IF('MYO Ön Değ.'!J16=\"\",\"\",'MYO Ön Değ.'!J16)","v":24.468},{"$f":"IF('MYO Ön Değ.'!K16=\"\",\"\",'MYO Ön Değ.'!K16)","v":79.147624999999991},{"$f":"IF('MYO Ön Değ.'!L16=\"\",\"\",'MYO Ön Değ.'!L16)","v":"Sınava Girebilir"}]
[{"$f":"IF('MYO Ön Değ.'!A17=\"\",\"\",'MYO Ön Değ.'!A17)","v":5},{"$f":"IF('MYO Ön Değ.'!B17=\"\",\"\",LEFT('MYO Ön Değ.'!B17,3)&REPT(\"*\",4)&RIGHT('MYO Ön Değ.'!B17,2))","v":"111****11"},{"$f":"IF('MYO Ön Değ.'!C17=\"\",\"\",IF(ISERR(FIND(\" \",'MYO Ön Değ.'!C17))=TRUE,LEFT('MYO Ön Değ.'!C17,2)&REPT(\"*\",3),LEFT('MYO Ön Değ.'!C17,2)&REPT(\"*\",3)&\" \"&MID('MYO Ön Değ.'!C17,FIND(\" \",'MYO Ön Değ.'!C17)+1,2)&REPT(\"*\",3)))","v":"Ör***"},{"$f":"IF('MYO Ön Değ.'!D17=\"\",\"\",IF(ISERR(FIND(\" \",'MYO Ön Değ.'!D17))=TRUE,LEFT('MYO Ön Değ.'!D17,2)&REPT(\"*\",3),LEFT('MYO Ön Değ.'!D17,2)&REPT(\"*\",3)&\" \"&MID('MYO Ön Değ.'!D17,FIND(\" \",'MYO Ön Değ.'!D17)+1,2)&REPT(\"*\",3)))","v":"Ör***"},{"$f":"IF('MYO Ön Değ.'!E17=\"\",\"\",'MYO Ön Değ.'!E17)","v":77.505549999999999},{"$f":"IF('MYO Ön Değ.'!F17=\"\",\"\",'MYO Ön Değ.'!F17)","v":80.56},{"$f":"IF('MYO Ön Değ.'!G17=\"\",\"\",'MYO Ön Değ.'!G17)","v":"Mevcut"},{"$f":"IF('MYO Ön Değ.'!H17=\"\",\"\",'MYO Ön Değ.'!H17)","v":"Uygun"},{"$f":"IF('MYO Ön Değ.'!I17=\"\",\"\",'MYO Ön Değ.'!I17)","v":54.253884999999997},{"$f":"IF('MYO Ön Değ.'!J17=\"\",\"\",'MYO Ön Değ.'!J17)","v":24.167999999999999},{"$f":"IF('MYO Ön Değ.'!K17=\"\",\"\",'MYO Ön Değ.'!K17)","v":78.421885000000003},{"$f":"IF('MYO Ön Değ.'!L17=\"\",\"\",'MYO Ön Değ.'!L17)","v":"Sınava Girebilir"}]
[{"$f":"IF('MYO Ön Değ.'!A18=\"\",\"\",'MYO Ön Değ.'!A18)","v":6},{"$f":"IF('MYO Ön Değ.'!B18=\"\",\"\",LEFT('MYO Ön Değ.'!B18,3)&REPT(\"*\",4)&RIGHT('MYO Ön Değ.'!B18,2))","v":"111****11"},{"$f":"IF('MYO Ön Değ.'!C18=\"\",\"\",IF(ISERR(FIND(\" \",'MYO Ön Değ.'!C18))=TRUE,LEFT('MYO Ön Değ.'!C18,2)&REPT(\"*\",3),LEFT('MYO Ön Değ.'!C18,2)&REPT(\"*\",3)&\" \"&MID('MYO Ön Değ.'!C18,FIND(\" \",'MYO Ön Değ.'!C18)+1,2)&REPT(\"*\",3)))","v":"Ör***"},{"$f":"IF('MYO Ön Değ.'!D18=\"\",\"\",IF(ISERR(FIND(\" \",'MYO Ön Değ.'!D18))=TRUE,LEFT('MYO Ön Değ.'!D18,2)&REPT(\"*\",3),LEFT('MYO Ön Değ.'!D18,2)&REPT(\"*\",3)&\" \"&MID('MYO Ön Değ.'!D18,FIND(\" \",'MYO Ön Değ.'!D18)+1,2)&REPT(\"*\",3)))","v":"Ör***"},{"$f":"IF('MYO Ön Değ.'!E18=\"\",\"\",'MYO Ön Değ.'!E18)","v":76.607429999999994},{"$f":"IF('MYO Ön Değ.'!F18=\"\",\"\",'MYO Ön Değ.'!F18)","v":79.03},{"$f":"IF('MYO Ön Değ.'!G18=\"\",\"\",'MYO Ön Değ.'!G18)","v":"Mevcut"},{"$f":"IF('MYO Ön Değ.'!H18=\"\",\"\",'MYO Ön Değ.'!H18)","v":"Uygun"},{"$f":"IF('MYO Ön Değ.'!I18=\"\",\"\",'MYO Ön Değ.'!I18)","v":53.62520099999999},{"$f":"IF('MYO Ön Değ.'!J18=\"\",\"\",'MYO Ön Değ.'!J18)","v":23.709},{"$f":"IF('MYO Ön Değ.'!K18=\"\",\"\",'MYO Ön Değ.'!K18)","v":77.334200999999993},{"$f":"IF('MYO Ön Değ.'!L18=\"\",\"\",'MYO Ön Değ.'!L18)","v":"Sınava Girebilir"}]
[{"$f":"IF('MYO Ön Değ.'!A19=\"\",\"\",'MYO Ön Değ.'!A19)","v":7},{"$f":"IF('MYO Ön Değ.'!B19=\"\",\"\",LEFT('MYO Ön Değ.'!B19,3)&REPT(\"*\",4)&RIGHT('MYO Ön Değ.'!B19,2))","v":"111****11"},{"$f":"IF('MYO Ön Değ.'!C19=\"\",\"\",IF(ISERR(FIND(\" \",'MYO Ön Değ.'!C19))=TRUE,LEFT('MYO Ön Değ.'!C19,2)&REPT(\"*\",3),LEFT('MYO Ön Değ.'!C19,2)&REPT(\"*\",3)&\" \"&MID('MYO Ön Değ.'!C19,FIND(\" \",'MYO Ön Değ.'!C19)+1,2)&REPT(\"*\",3)))","v":"Ör***"},{"$f":"IF('MYO Ön Değ.'!D19=\"\",\"\",IF(ISERR(FIND(\" \",'MYO Ön Değ.'!D19))=TRUE,LEFT('MYO Ön Değ.'!D19,2)&REPT(\"*\",3),LEFT('MYO Ön Değ.'!D19,2)&REPT(\"*\",3)&\" \"&MID('MYO Ön Değ.'!D19,FIND(\" \",'MYO Ön Değ.'!D19)+1,2)&REPT(\"*\",3)))","v":"Ör***"},{"$f":"IF('MYO Ön Değ.'!E19=\"\",\"\",'MYO Ön Değ.'!E19)","v":75.275630000000007},{"$f":"IF('MYO Ön Değ.'!F19=\"\",\"\",'MYO Ön Değ.'!F19)","v":78.53},{"$f":"IF('MYO Ön Değ.'!G19=\"\",\"\",'MYO Ön Değ.'!G19)","v":"Mevcut"},{"$f":"IF('MYO Ön Değ.'!H19=\"\",\"\",'MYO Ön Değ.'!H19)","v":"Uygun"},{"$f":"IF('MYO Ön Değ.'!I19=\"\",\"\",'MYO Ön Değ.'!I19)","v":52.692941000000005},{"$f":"IF('MYO Ön Değ.'!J19=\"\",\"\",'MYO Ön Değ.'!J19)","v":23.559000000000001},{"$f":"IF('MYO Ön Değ.'!K19=\"\",\"\",'MYO Ön Değ.'!K19)","v":76.251941000000002},{"$f":"IF('MYO Ön Değ.'!L19=\"\",\"\",'MYO Ön Değ.'!L19)","v":"Sınava Girebilir"}]
[{"$f":"IF('MYO Ön Değ.'!A20=\"\",\"\",'MYO Ön Değ.'!A20)","v":8},{"$f":"IF('MYO Ön Değ.'!B20=\"\",\"\",LEFT('MYO Ön Değ.'!B20,3)&REPT(\"*\",4)&RIGHT('MYO Ön Değ.'!B20,2))","v":"111****11"},{"$f":"IF('MYO Ön Değ.'!C20=\"\",\"\",IF(ISERR(FIND(\" \",'MYO Ön Değ.'!C20))=TRUE,LEFT('MYO Ön Değ.'!C20,2)&REPT(\"*\",3),LEFT('MYO Ön Değ.'!C20,2)&REPT(\"*\",3)&\" \"&MID('MYO Ön Değ.'!C20,FIND(\" \",'MYO Ön Değ.'!C20)+1,2)&REPT(\"*\",3)))","v":"Ör***"},{"$f":"IF('MYO Ön Değ.'!D20=\"\",\"\",IF(ISERR(FIND(\" \",'MYO Ön Değ.'!D20))=TRUE,LEFT('MYO Ön Değ.'!D20,2)&REPT(\"*\",3),LEFT('MYO Ön Değ.'!D20,2)&REPT(\"*\",3)&\" \"&MID('MYO Ön Değ.'!D20,FIND(\" \",'MYO Ön Değ.'!D20)+1,2)&REPT(\"*\",3)))","v":"Ör***"},{"$f":"IF('MYO Ön Değ.'!E20=\"\",\"\",'MYO Ön Değ.'!E20)","v":74.113749999999996},{"$f":"IF('MYO Ön Değ.'!F20=\"\",\"\",'MYO Ön Değ.'!F20)","v":77.56},{"$f":"IF('MYO Ön Değ.'!G20=\"\",\"\",'MYO Ön Değ.'!G20)","v":"Mevcut"},{"$f":"IF('MYO Ön Değ.'!H20=\"\",\"\",'MYO Ön Değ.'!H20)","v":"Uygun"},{"$f":"IF('MYO Ön Değ.'!I20=\"\",\"\",'MYO Ön Değ.'!I20)","v":51.879624999999997},{"$f":"IF('MYO Ön Değ.'!J20=\"\",\"\",'MYO Ön Değ.'!J20)","v":23.268000000000001},{"$f":"IF('MYO Ön Değ.'!K20=\"\",\"\",'MYO Ön Değ.'!K20)","v":75.147625000000005},{"$f":"IF('MYO Ön Değ.'!L20=\"\",\"\",'MYO Ön Değ.'!L20)","v":"Sınava Girebilir"}]
[{"$f":"IF('MYO Ön Değ.'!A21=\"\",\"\",'MYO Ön Değ.'!A21)","v":9},{"$f":"IF('MYO Ön Değ.'!B21=\"\",\"\",LEFT('MYO Ön Değ.'!B21,3)&REPT(\"*\",4)&RIGHT('MYO Ön Değ.'!B21,2))","v":"111****11"},{"$f":"IF('MYO Ön Değ.'!C21=\"\",\"\",IF(ISERR(FIND(\" \",'MYO Ön Değ.'!C21))=TRUE,LEFT('MYO Ön Değ.'!C21,2)&REPT(\"*\",3),LEFT('MYO Ön Değ.'!C21,2)&REPT(\"*\",3)&\" \"&MID('MYO Ön Değ.'!C21,FIND(\" \",'MYO Ön Değ.'!C21)+1,2)&REPT(\"*\",3)))","v":"Ör***"},{"$f":"IF('MYO Ön Değ.'!D21=\"\",\"\",IF(ISERR(FIND(\" \",'MYO Ön Değ.'!D21))=TRUE,LEFT('MYO Ön Değ.'!D21,2)&REPT(\"*\",3),LEFT('MYO Ön Değ.'!D21,2)&REPT(\"*\",3)&\" \"&MID('MYO Ön Değ.'!D21,FIND(\" \",'MYO Ön Değ.'!D21)+1,2)&REPT(\"*\",3)))","v":"Ör***"},{"$f":"IF('MYO Ön Değ.'!E21=\"\",\"\",'MYO Ön Değ.'!E21)","v":73.505549999999999},{"$f":"IF('MYO Ön Değ.'!F21=\"\",\"\",'MYO Ön Değ.'!F21)","v":76.56},{"$f":"IF('MYO Ön Değ.'!G21=\"\",\"\",'MYO Ön Değ.'!G21)","v":"Mevcut"},{"$f":"IF('MYO Ön Değ.'!H21=\"\",\"\",'MYO Ön Değ.'!H21)","v":"Uygun"},{"$f":"IF('MYO Ön Değ.'!I21=\"\",\"\",'MYO Ön Değ.'!I21)","v":51.453885},{"$f":"IF('MYO Ön Değ.'!J21=\"\",\"\",'MYO Ön Değ.'!J21)","v":22.968},{"$f":"IF('MYO Ön Değ.'!K21=\"\",\"\",'MYO Ön Değ.'!K21)","v":74.421885000000003},{"$f":"IF('MYO Ön Değ.'!L21=\"\",\"\",'MYO Ön Değ.'!L21)","v":"Sınava Girebilir"}]
[{"$f":"IF('MYO Ön Değ.'!A22=\"\",\"\",'MYO Ön Değ.'!A22)","v":10},{"$f":"IF('MYO Ön Değ.'!B22=\"\",\"\",LEFT('MYO Ön Değ.'!B22,3)&REPT(\"*\",4)&RIGHT('MYO Ön Değ.'!B22,2))","v":"111****11"},{"$f":"IF('MYO Ön Değ.'!C22=\"\",\"\",IF(ISERR(FIND(\" \",'MYO Ön Değ.'!C22))=TRUE,LEFT('MYO Ön Değ.'!C22,2)&REPT(\"*\",3),LEFT('MYO Ön Değ.'!C22,2)&REPT(\"*\",3)&\" \"&MID('MYO Ön Değ.'!C22,FIND(\" \",'MYO Ön Değ.'!C22)+1,2)&REPT(\"*\",3)))","v":"Ör***"},{"$f":"IF('MYO Ön Değ.'!D22=\"\",\"\",IF(ISERR(FIND(\" \",'MYO Ön Değ.'!D22))=TRUE,LEFT('MYO Ön Değ.'!D22,2)&REPT(\"*\",3),LEFT('MYO Ön Değ.'!D22,2)&REPT(\"*\",3)&\" \"&MID('MYO Ön Değ.'!D22,FIND(\" \",'MYO Ön Değ.'!D22)+1,2)&REPT(\"*\",3)))","v":"Ör***"},{"$f":"IF('MYO Ön Değ.'!E22=\"\",\"\",'MYO Ön Değ.'!E22)","v":70},{"$f":"IF('MYO Ön Değ.'!F22=\"\",\"\",'MYO Ön Değ.'!F22)","v":80.25},{"$f":"IF('MYO Ön Değ.'!G22=\"\",\"\",'MYO Ön Değ.'!G22)","v":"Mevcut"},{"$f":"IF('MYO Ön Değ.'!H22=\"\",\"\",'MYO Ön Değ.'!H22)","v":"Uygun"},{"$f":"IF('MYO Ön Değ.'!I22=\"\",\"\",'MYO Ön Değ.'!I22)","v":49},{"$f":"IF('MYO Ön Değ.'!J22=\"\",\"\",'MYO Ön Değ.'!J22)","v":24.074999999999999},{"$f":"IF('MYO Ön Değ.'!K22=\"\",\"\",'MYO Ön Değ.'!K22)","v":73.075000000000003},{"$f":"IF('MYO Ön Değ.'!L22=\"\",\"\",'MYO Ön Değ.'!L22)","v":"Sınava Girebilir"}]
[{"$f":"IF('MYO Ön Değ.'!A23=\"\",\"\",'MYO Ön Değ.'!A23)","v":11},{"$f":"IF('MYO Ön Değ.'!B23=\"\",\"\",LEFT('MYO Ön Değ.'!B23,3)&REPT(\"*\",4)&RIGHT('MYO Ön Değ.'!B23,2))","v":"111****11"},{"$f":"IF('MYO Ön Değ.'!C23=\"\",\"\",IF(ISERR(FIND(\" \",'MYO Ön Değ.'!C23))=TRUE,LEFT('MYO Ön Değ.'!C23,2)&REPT(\"*\",3),LEFT('MYO Ön Değ.'!C23,2)&REPT(\"*\",3)&\" \"&MID('MYO Ön Değ.'!C23,FIND(\" \",'MYO Ön Değ.'!C23)+1,2)&REPT(\"*\",3)))","v":"Ör***"},{"$f":"IF('MYO Ön Değ.'!D23=\"\",\"\",IF(ISERR(FIND(\" \",'MYO Ön Değ.'!D23))=TRUE,LEFT('MYO Ön Değ.'!D23,2)&REPT(\"*\",3),LEFT('MYO Ön Değ.'!D23,2)&REPT(\"*\",3)&\" \"&MID('MYO Ön Değ.'!D23,FIND(\" \",'MYO Ön Değ.'!D23)+1,2)&REPT(\"*\",3)))","v":"Ör***"},{"$f":"IF('MYO Ön Değ.'!E23=\"\",\"\",'MYO Ön Değ.'!E23)","v":71.275630000000007},{"$f":"IF('MYO Ön Değ.'!F23=\"\",\"\",'MYO Ön Değ.'!F23)","v":74.53},{"$f":"IF('MYO Ön Değ.'!G23=\"\",\"\",'MYO Ön Değ.'!G23)","v":"Mevcut"},{"$f":"IF('MYO Ön Değ.'!H23=\"\",\"\",'MYO Ön Değ.'!H23)","v":"Uygun"},{"$f":"IF('MYO Ön Değ.'!I23=\"\",\"\",'MYO Ön Değ.'!I23)","v":49.892941},{"$f":"IF('MYO Ön Değ.'!J23=\"\",\"\",'MYO Ön Değ.'!J23)","v":22.358999999999998},{"$f":"IF('MYO Ön Değ.'!K23=\"\",\"\",'MYO Ön Değ.'!K23)","v":72.251941000000002},{"$f":"IF('MYO Ön Değ.'!L23=\"\",\"\",'MYO Ön Değ.'!L23)","v":"Yönetmelik Gereği Elendi *"}]
[{"$f":"IF('MYO Ön Değ.'!A24=\"\",\"\",'MYO Ön Değ.'!A24)","v":12},{"$f":"IF('MYO Ön Değ.'!B24=\"\",\"\",LEFT('MYO Ön Değ.'!B24,3)&REPT(\"*\",4)&RIGHT('MYO Ön Değ.'!B24,2))","v":"111****11"},{"$f":"IF('MYO Ön Değ.'!C24=\"\",\"\",IF(ISERR(FIND(\" \",'MYO Ön Değ.'!C24))=TRUE,LEFT('MYO Ön Değ.'!C24,2)&REPT(\"*\",3),LEFT('MYO Ön Değ.'!C24,2)&REPT(\"*\",3)&\" \"&MID('MYO Ön Değ.'!C24,FIND(\" \",'MYO Ön Değ.'!C24)+1,2)&REPT(\"*\",3)))","v":"Ör***"},{"$f":"IF('MYO Ön Değ.'!D24=\"\",\"\",IF(ISERR(FIND(\" \",'MYO Ön Değ.'!D24))=TRUE,LEFT('MYO Ön Değ.'!D24,2)&REPT(\"*\",3),LEFT('MYO Ön Değ.'!D24,2)&REPT(\"*\",3)&\" \"&MID('MYO Ön Değ.'!D24,FIND(\" \",'MYO Ön Değ.'!D24)+1,2)&REPT(\"*\",3)))","v":"Ör***"},{"$f":"IF('MYO Ön Değ.'!E24=\"\",\"\",'MYO Ön Değ.'!E24)","v":70.113749999999996},{"$f":"IF('MYO Ön Değ.'!F24=\"\",\"\",'MYO Ön Değ.'!F24)","v":73.56},{"$f":"IF('MYO Ön Değ.'!G24=\"\",\"\",'MYO Ön Değ.'!G24)","v":"Mevcut"},{"$f":"IF('MYO Ön Değ.'!H24=\"\",\"\",'MYO Ön Değ.'!H24)","v":"Uygun"},{"$f":"IF('MYO Ön Değ.'!I24=\"\",\"\",'MYO Ön Değ.'!I24)","v":49.079624999999993},{"$f":"IF('MYO Ön Değ.'!J24=\"\",\"\",'MYO Ön Değ.'!J24)","v":22.068000000000001},{"$f":"IF('MYO Ön Değ.'!K24=\"\",\"\",'MYO Ön Değ.'!K24)","v":71.147624999999991},{"$f":"IF('MYO Ön Değ.'!L24=\"\",\"\",'MYO Ön Değ.'!L24)","v":"Yönetmelik Gereği Elendi *"}]
[{"$f":"IF('MYO Ön Değ.'!A25=\"\",\"\",'MYO Ön Değ.'!A25)","v":13},{"$f":"IF('MYO Ön Değ.'!B25=\"\",\"\",LEFT('MYO Ön Değ.'!B25,3)&REPT(\"*\",4)&RIGHT('MYO Ön Değ.'!B25,2))","v":"111****11"},{"$f":"IF('MYO Ön Değ.'!C25=\"\",\"\",IF(ISERR(FIND(\" \",'MYO Ön Değ.'!C25))=TRUE,LEFT('MYO Ön Değ.'!C25,2)&REPT(\"*\",3),LEFT('MYO Ön Değ.'!C25,2)&REPT(\"*\",3)&\" \"&MID('MYO Ön Değ.'!C25,FIND(\" \",'MYO Ön Değ.'!C25)+1,2)&REPT(\"*\",3)))","v":"Ör***"},{"$f":"IF('MYO Ön Değ.'!D25=\"\",\"\",IF(ISERR(FIND(\" \",'MYO Ön Değ.'!D25))=TRUE,LEFT('MYO Ön Değ.'!D25,2)&REPT(\"*\",3),LEFT('MYO Ön Değ.'!D25,2)&REPT(\"*\",3)&\" \"&MID('MYO Ön Değ.'!D25,FIND(\" \",'MYO Ön Değ.'!D25)+1,2)&REPT(\"*\",3)))","v":"Ör***"},{"$f":"IF('MYO Ön Değ.'!E25=\"\",\"\",'MYO Ön Değ.'!E25)","v":70.505549999999999},{"$f":"IF('MYO Ön Değ.'!F25=\"\",\"\",'MYO Ön Değ.'!F25)","v":72.56},{"$f":"IF('MYO Ön Değ.'!G25=\"\",\"\",'MYO Ön Değ.'!G25)","v":"Mevcut"},{"$f":"IF('MYO Ön Değ.'!H25=\"\",\"\",'MYO Ön Değ.'!H25)","v":"Uygun Değil"},{"$f":"IF('MYO Ön Değ.'!I25=\"\",\"\",'MYO Ön Değ.'!I25)","v":49.353884999999998},{"$f":"IF('MYO Ön Değ.'!J25=\"\",\"\",'MYO Ön Değ.'!J25)","v":21.768000000000001},{"$f":"IF('MYO Ön Değ.'!K25=\"\",\"\",'MYO Ön Değ.'!K25)","v":71.121884999999992},{"$f":"IF('MYO Ön Değ.'!L25=\"\",\"\",'MYO Ön Değ.'!L25)","v":"Başvuru Şartını Sağlamıyor (Sertifika eksik)"}]
[{"$f":"IF('MYO Ön Değ.'!A26=\"\",\"\",'MYO Ön Değ.'!A26)","v":14},{"$f":"IF('MYO Ön Değ.'!B26=\"\",\"\",LEFT('MYO Ön Değ.'!B26,3)&REPT(\"*\",4)&RIGHT('MYO Ön Değ.'!B26,2))","v":"111****11"},{"$f":"IF('MYO Ön Değ.'!C26=\"\",\"\",IF(ISERR(FIND(\" \",'MYO Ön Değ.'!C26))=TRUE,LEFT('MYO Ön Değ.'!C26,2)&REPT(\"*\",3),LEFT('MYO Ön Değ.'!C26,2)&REPT(\"*\",3)&\" \"&MID('MYO Ön Değ.'!C26,FIND(\" \",'MYO Ön Değ.'!C26)+1,2)&REPT(\"*\",3)))","v":"Ör***"},{"$f":"IF('MYO Ön Değ.'!D26=\"\",\"\",IF(ISERR(FIND(\" \",'MYO Ön Değ.'!D26))=TRUE,LEFT('MYO Ön Değ.'!D26,2)&REPT(\"*\",3),LEFT('MYO Ön Değ.'!D26,2)&REPT(\"*\",3)&\" \"&MID('MYO Ön Değ.'!D26,FIND(\" \",'MYO Ön Değ.'!D26)+1,2)&REPT(\"*\",3)))","v":"Ör***"},{"$f":"IF('MYO Ön Değ.'!E26=\"\",\"\",'MYO Ön Değ.'!E26)","v":70.113749999999996},{"$f":"IF('MYO Ön Değ.'!F26=\"\",\"\",'MYO Ön Değ.'!F26)","v":72.56},{"$f":"IF('MYO Ön Değ.'!G26=\"\",\"\",'MYO Ön Değ.'!G26)","v":"Mevcut"},{"$f":"IF('MYO Ön Değ.'!H26=\"\",\"\",'MYO Ön Değ.'!H26)","v":"Uygun Değil"},{"$f":"IF('MYO Ön Değ.'!I26=\"\",\"\",'MYO Ön Değ.'!I26)","v":49.079624999999993},{"$f":"IF('MYO Ön Değ.'!J26=\"\",\"\",'MYO Ön Değ.'!J26)","v":21.768000000000001},{"$f":"IF('MYO Ön Değ.'!K26=\"\",\"\",'MYO Ön Değ.'!K26)","v":70.847624999999994},{"$f":"IF('MYO Ön Değ.'!L26=\"\",\"\",'MYO Ön Değ.'!L26)","v":"Başvuru Şartını Sağlamıyor (Tezli Yüksek Lisans mezuniyet alanı ilanla uyumlu değil)"}]
[{"$f":"IF('MYO Ön Değ.'!A27=\"\",\"\",'MYO Ön Değ.'!A27)","v":15},{"$f":"IF('MYO Ön Değ.'!B27=\"\",\"\",LEFT('MYO Ön Değ.'!B27,3)&REPT(\"*\",4)&RIGHT('MYO Ön Değ.'!B27,2))","v":"111****11"},{"$f":"IF('MYO Ön Değ.'!C27=\"\",\"\",IF(ISERR(FIND(\" \",'MYO Ön Değ.'!C27))=TRUE,LEFT('MYO Ön Değ.'!C27,2)&REPT(\"*\",3),LEFT('MYO Ön Değ.'!C27,2)&REPT(\"*\",3)&\" \"&MID('MYO Ön Değ.'!C27,FIND(\" \",'MYO Ön Değ.'!C27)+1,2)&REPT(\"*\",3)))","v":"Ör***"},{"$f":"IF('MYO Ön Değ.'!D27=\"\",\"\",IF(ISERR(FIND(\" \",'MYO Ön Değ.'!D27))=TRUE,LEFT('MYO Ön Değ.'!D27,2)&REPT(\"*\",3),LEFT('MYO Ön Değ.'!D27,2)&REPT(\"*\",3)&\" \"&MID('MYO Ön Değ.'!D27,FIND(\" \",'MYO Ön Değ.'!D27)+1,2)&REPT(\"*\",3)))","v":"Ör***"},{"$f":"IF('MYO Ön Değ.'!E27=\"\",\"\",'MYO Ön Değ.'!E27)","v":80},{"$f":"IF('MYO Ön Değ.'!F27=\"\",\"\",'MYO Ön Değ.'!F27)","v":75},{"$f":"IF('MYO Ön Değ.'!G27=\"\",\"\",'MYO Ön Değ.'!G27)","v":"Mevcut"},{"$f":"IF('MYO Ön Değ.'!H27=\"\",\"\",'MYO Ön Değ.'!H27)","v":"Uygun Değil"},{"$f":"IF('MYO Ön Değ.'!I27=\"\",\"\",'MYO Ön Değ.'!I27)","v":56},{"$f":"IF('MYO Ön Değ.'!J27=\"\",\"\",'MYO Ön Değ.'!J27)","v":22.5},{"$f":"IF('MYO Ön Değ.'!K27=\"\",\"\",'MYO Ön Değ.'!K27)","v":78.5},{"$f":"IF('MYO Ön Değ.'!L27=\"\",\"\",'MYO Ön Değ.'!L27)","v":"Başvuru Şartını Sağlamıyor (Tecrübe belgesi eksik/Tecrübe şartını sağlamıyor)"}]
[{"$f":"IF('MYO Ön Değ.'!A28=\"\",\"\",'MYO Ön Değ.'!A28)","v":16},{"$f":"IF('MYO Ön Değ.'!B28=\"\",\"\",LEFT('MYO Ön Değ.'!B28,3)&REPT(\"*\",4)&RIGHT('MYO Ön Değ.'!B28,2))","v":"111****11"},{"$f":"IF('MYO Ön Değ.'!C28=\"\",\"\",IF(ISERR(FIND(\" \",'MYO Ön Değ.'!C28))=TRUE,LEFT('MYO Ön Değ.'!C28,2)&REPT(\"*\",3),LEFT('MYO Ön Değ.'!C28,2)&REPT(\"*\",3)&\" \"&MID('MYO Ön Değ.'!C28,FIND(\" \",'MYO Ön Değ.'!C28)+1,2)&REPT(\"*\",3)))","v":"Ör***"},{"$f":"IF('MYO Ön Değ.'!D28=\"\",\"\",IF(ISERR(FIND(\" \",'MYO Ön Değ.'!D28))=TRUE,LEFT('MYO Ön Değ.'!D28,2)&REPT(\"*\",3),LEFT('MYO Ön Değ.'!D28,2)&REPT(\"*\",3)&\" \"&MID('MYO Ön Değ.'!D28,FIND(\" \",'MYO Ön Değ.'!D28)+1,2)&REPT(\"*\",3)))","v":"Ör***"},{"$f":"IF('MYO Ön Değ.'!E28=\"\",\"\",'MYO Ön Değ.'!E28)","v":75},{"$f":"IF('MYO Ön Değ.'!F28=\"\",\"\",'MYO Ön Değ.'!F28)","v":78},{"$f":"IF('MYO Ön Değ.'!G28=\"\",\"\",'MYO Ön Değ.'!G28)","v":"Mevcut Değil"},{"$f":"IF('MYO Ön Değ.'!H28=\"\",\"\",'MYO Ön Değ.'!H28)","v":"Uygun Değil"},{"$f":"IF('MYO Ön Değ.'!I28=\"\",\"\",'MYO Ön Değ.'!I28)","v":52.5},{"$f":"IF('MYO Ön Değ.'!J28=\"\",\"\",'MYO Ön Değ.'!J28)","v":23.4},{"$f":"IF('MYO Ön Değ.'!K28=\"\",\"\",'MYO Ön Değ.'!K28)","v":75.900000000000006},{"$f":"IF('MYO Ön Değ.'!L28=\"\",\"\",'MYO Ön Değ.'!L28)","v":"Başvuru Şartını Sağlamıyor (Tezli Yüksek Lisans Mezunu Değil)"}]
[{"$f":"IF('MYO Ön Değ.'!A29=\"\",\"\",'MYO Ön Değ.'!A29)","v":17},{"$f":"IF('MYO Ön Değ.'!B29=\"\",\"\",LEFT('MYO Ön Değ.'!B29,3)&REPT(\"*\",4)&RIGHT('MYO Ön Değ.'!B29,2))","v":"111****11"},{"$f":"IF('MYO Ön Değ.'!C29=\"\",\"\",IF(ISERR(FIND(\" \",'MYO Ön Değ.'!C29))=TRUE,LEFT('MYO Ön Değ.'!C29,2)&REPT(\"*\",3),LEFT('MYO Ön Değ.'!C29,2)&REPT(\"*\",3)&\" \"&MID('MYO Ön Değ.'!C29,FIND(\" \",'MYO Ön Değ.'!C29)+1,2)&REPT(\"*\",3)))","v":"Ör***"},{"$f":"IF('MYO Ön Değ.'!D29=\"\",\"\",IF(ISERR(FIND(\" \",'MYO Ön Değ.'!D29))=TRUE,LEFT('MYO Ön Değ.'!D29,2)&REPT(\"*\",3),LEFT('MYO Ön Değ.'!D29,2)&REPT(\"*\",3)&\" \"&MID('MYO Ön Değ.'!D29,FIND(\" \",'MYO Ön Değ.'!D29)+1,2)&REPT(\"*\",3)))","v":"Ör***"},{"$f":"IF('MYO Ön Değ.'!E29=\"\",\"\",'MYO Ön Değ.'!E29)","v":78},{"$f":"IF('MYO Ön Değ.'!F29=\"\",\"\",'MYO Ön Değ.'!F29)","v":70},{"$f":"IF('MYO Ön Değ.'!G29=\"\",\"\",'MYO Ön Değ.'!G29)","v":"Mevcut"},{"$f":"IF('MYO Ön Değ.'!H29=\"\",\"\",'MYO Ön Değ.'!H29)","v":"Uygun Değil"},{"$f":"IF('MYO Ön Değ.'!I29=\"\",\"\",'MYO Ön Değ.'!I29)","v":54.599999999999994},{"$f":"IF('MYO Ön Değ.'!J29=\"\",\"\",'MYO Ön Değ.'!J29)","v":21},{"$f":"IF('MYO Ön Değ.'!K29=\"\",\"\",'MYO Ön Değ.'!K29)","v":75.599999999999994},{"$f":"IF('MYO Ön Değ.'!L29=\"\",\"\",'MYO Ön Değ.'!L29)","v":"Başvuru Şartını Sağlamıyor (Lisans Mezuniyet alanı ilanla uyumlu değil)"}]
[{"$f":"IF('MYO Ön Değ.'!A30=\"\",\"\",'MYO Ön Değ.'!A30)","v":18},{"$f":"IF('MYO Ön Değ.'!B30=\"\",\"\",LEFT('MYO Ön Değ.'!B30,3)&REPT(\"*\",4)&RIGHT('MYO Ön Değ.'!B30,2))","v":"111****11"},{"$f":"IF('MYO Ön Değ.'!C30=\"\",\"\",IF(ISERR(FIND(\" \",'MYO Ön Değ.'!C30))=TRUE,LEFT('MYO Ön Değ.'!C30,2)&REPT(\"*\",3),LEFT('MYO Ön Değ.'!C30,2)&REPT(\"*\",3)&\" \"&MID('MYO Ön Değ.'!C30,FIND(\" \",'MYO Ön Değ.'!C30)+1,2)&REPT(\"*\",3)))","v":"Ör***"},{"$f":"IF('MYO Ön Değ.'!D30=\"\",\"\",IF(ISERR(FIND(\" \",'MYO Ön Değ.'!D30))=TRUE,LEFT('MYO Ön Değ.'!D30,2)&REPT(\"*\",3),LEFT('MYO Ön Değ.'!D30,2)&REPT(\"*\",3)&\" \"&MID('MYO Ön Değ.'!D30,FIND(\" \",'MYO Ön Değ.'!D30)+1,2)&REPT(\"*\",3)))","v":"Ör***"},{"$f":"IF('MYO Ön Değ.'!E30=\"\",\"\",'MYO Ön Değ.'!E30)","v":68},{"$f":"IF('MYO Ön Değ.'!F30=\"\",\"\",'MYO Ön Değ.'!F30)","v":80},{"$f":"IF('MYO Ön Değ.'!G30=\"\",\"\",'MYO Ön Değ.'!G30)","v":"Mevcut"},{"$f":"IF('MYO Ön Değ.'!H30=\"\",\"\",'MYO Ön Değ.'!H30)","v":"Uygun Değil"},{"$f":"IF('MYO Ön Değ.'!I30=\"\",\"\",'MYO Ön Değ.'!I30)","v":47.599999999999994},{"$f":"IF('MYO Ön Değ.'!J30=\"\",\"\",'MYO Ön Değ.'!J30)","v":24},{"$f":"IF('MYO Ön Değ.'!K30=\"\",\"\",'MYO Ön Değ.'!K30)","v":71.599999999999994},{"$f":"IF('MYO Ön Değ.'!L30=\"\",\"\",'MYO Ön Değ.'!L30)","v":"Başvuru Şartını Sağlamıyor (Ales puanı yetersiz)"}]
[{"$f":"IF('MYO Ön Değ.'!A31=\"\",\"\",'MYO Ön Değ.'!A31)","v":""},{"$f":"IF('MYO Ön Değ.'!B31=\"\",\"\",LEFT('MYO Ön Değ.'!B31,3)&REPT(\"*\",4)&RIGHT('MYO Ön Değ.'!B31,2))","v":""},{"$f":"IF('MYO Ön Değ.'!C31=\"\",\"\",IF(ISERR(FIND(\" \",'MYO Ön Değ.'!C31))=TRUE,LEFT('MYO Ön Değ.'!C31,2)&REPT(\"*\",3),LEFT('MYO Ön Değ.'!C31,2)&REPT(\"*\",3)&\" \"&MID('MYO Ön Değ.'!C31,FIND(\" \",'MYO Ön Değ.'!C31)+1,2)&REPT(\"*\",3)))","v":""},{"$f":"IF('MYO Ön Değ.'!D31=\"\",\"\",IF(ISERR(FIND(\" \",'MYO Ön Değ.'!D31))=TRUE,LEFT('MYO Ön Değ.'!D31,2)&REPT(\"*\",3),LEFT('MYO Ön Değ.'!D31,2)&REPT(\"*\",3)&\" \"&MID('MYO Ön Değ.'!D31,FIND(\" \",'MYO Ön Değ.'!D31)+1,2)&REPT(\"*\",3)))","v":""},{"$f":"IF('MYO Ön Değ.'!E31=\"\",\"\",'MYO Ön Değ.'!E31)","v":""},{"$f":"IF('MYO Ön Değ.'!F31=\"\",\"\",'MYO Ön Değ.'!F31)","v":""},{"$f":"IF('MYO Ön Değ.'!G31=\"\",\"\",'MYO Ön Değ.'!G31)","v":""},{"$f":"IF('MYO Ön Değ.'!H31=\"\",\"\",'MYO Ön Değ.'!H31)","v":""},{"$f":"IF('MYO Ön Değ.'!I31=\"\",\"\",'MYO Ön Değ.'!I31)","v":""},{"$f":"IF('MYO Ön Değ.'!J31=\"\",\"\",'MYO Ön Değ.'!J31)","v":""},{"$f":"IF('MYO Ön Değ.'!K31=\"\",\"\",'MYO Ön Değ.'!K31)","v":""},{"$f":"IF('MYO Ön Değ.'!L31=\"\",\"\",'MYO Ön Değ.'!L31)","v":""}]
[{"$f":"IF('MYO Ön Değ.'!A32=\"\",\"\",'MYO Ön Değ.'!A32)","v":""},{"$f":"IF('MYO Ön Değ.'!B32=\"\",\"\",LEFT('MYO Ön Değ.'!B32,3)&REPT(\"*\",4)&RIGHT('MYO Ön Değ.'!B32,2))","v":""},{"$f":"IF('MYO Ön Değ.'!C32=\"\",\"\",IF(ISERR(FIND(\" \",'MYO Ön Değ.'!C32))=TRUE,LEFT('MYO Ön Değ.'!C32,2)&REPT(\"*\",3),LEFT('MYO Ön Değ.'!C32,2)&REPT(\"*\",3)&\" \"&MID('MYO Ön Değ.'!C32,FIND(\" \",'MYO Ön Değ.'!C32)+1,2)&REPT(\"*\",3)))","v":""},{"$f":"IF('MYO Ön Değ.'!D32=\"\",\"\",IF(ISERR(FIND(\" \",'MYO Ön Değ.'!D32))=TRUE,LEFT('MYO Ön Değ.'!D32,2)&REPT(\"*\",3),LEFT('MYO Ön Değ.'!D32,2)&REPT(\"*\",3)&\" \"&MID('MYO Ön Değ.'!D32,FIND(\" \",'MYO Ön Değ.'!D32)+1,2)&REPT(\"*\",3)))","v":""},{"$f":"IF('MYO Ön Değ.'!E32=\"\",\"\",'MYO Ön Değ.'!E32)","v":""},{"$f":"IF('MYO Ön Değ.'!F32=\"\",\"\",'MYO Ön Değ.'!F32)","v":""},{"$f":"IF('MYO Ön Değ.'!G32=\"\",\"\",'MYO Ön Değ.'!G32)","v":""},{"$f":"IF('MYO Ön Değ.'!H32=\"\",\"\",'MYO Ön Değ.'!H32)","v":""},{"$f":"IF('MYO Ön Değ.'!I32=\"\",\"\",'MYO Ön Değ.'!I32)","v":""},{"$f":"IF('MYO Ön Değ.'!J32=\"\",\"\",'MYO Ön Değ.'!J32)","v":""},{"$f":"IF('MYO Ön Değ.'!K32=\"\",\"\",'MYO Ön Değ.'!K32)","v":""},{"$f":"IF('MYO Ön Değ.'!L32=\"\",\"\",'MYO Ön Değ.'!L32)","v":""}]
[{"$f":"IF('MYO Ön Değ.'!A33=\"\",\"\",'MYO Ön Değ.'!A33)","v":""},{"$f":"IF('MYO Ön Değ.'!B33=\"\",\"\",LEFT('MYO Ön Değ.'!B33,3)&REPT(\"*\",4)&RIGHT('MYO Ön Değ.'!B33,2))","v":""},{"$f":"IF('MYO Ön Değ.'!C33=\"\",\"\",IF(ISERR(FIND(\" \",'MYO Ön Değ.'!C33))=TRUE,LEFT('MYO Ön Değ.'!C33,2)&REPT(\"*\",3),LEFT('MYO Ön Değ.'!C33,2)&REPT(\"*\",3)&\" \"&MID('MYO Ön Değ.'!C33,FIND(\" \",'MYO Ön Değ.'!C33)+1,2)&REPT(\"*\",3)))","v":""},{"$f":"IF('MYO Ön Değ.'!D33=\"\",\"\",IF(ISERR(FIND(\" \",'MYO Ön Değ.'!D33))=TRUE,LEFT('MYO Ön Değ.'!D33,2)&REPT(\"*\",3),LEFT('MYO Ön Değ.'!D33,2)&REPT(\"*\",3)&\" \"&MID('MYO Ön Değ.'!D33,FIND(\" \",'MYO Ön Değ.'!D33)+1,2)&REPT(\"*\",3)))","v":""},{"$f":"IF('MYO Ön Değ.'!E33=\"\",\"\",'MYO Ön Değ.'!E33)","v":""},{"$f":"IF('MYO Ön Değ.'!F33=\"\",\"\",'MYO Ön Değ.'!F33)","v":""},{"$f":"IF('MYO Ön Değ.'!G33=\"\",\"\",'MYO Ön Değ.'!G33)","v":""},{"$f":"IF('MYO Ön Değ.'!H33=\"\",\"\",'MYO Ön Değ.'!H33)","v":""},{"$f":"IF('MYO Ön Değ.'!I33=\"\",\"\",'MYO Ön Değ.'!I33)","v":""},{"$f":"IF('MYO Ön Değ.'!J33=\"\",\"\",'MYO Ön Değ.'!J33)","v":""},{"$f":"IF('MYO Ön Değ.'!K33=\"\",\"\",'MYO Ön Değ.'!K33)","v":""},{"$f":"IF('MYO Ön Değ.'!L33=\"\",\"\",'MYO Ön Değ.'!L33)","v":""}]
[{"$f":"IF('MYO Ön Değ.'!A34=\"\",\"\",'MYO Ön Değ.'!A34)","v":""},{"$f":"IF('MYO Ön Değ.'!B34=\"\",\"\",LEFT('MYO Ön Değ.'!B34,3)&REPT(\"*\",4)&RIGHT('MYO Ön Değ.'!B34,2))","v":""},{"$f":"IF('MYO Ön Değ.'!C34=\"\",\"\",IF(ISERR(FIND(\" \",'MYO Ön Değ.'!C34))=TRUE,LEFT('MYO Ön Değ.'!C34,2)&REPT(\"*\",3),LEFT('MYO Ön Değ.'!C34,2)&REPT(\"*\",3)&\" \"&MID('MYO Ön Değ.'!C34,FIND(\" \",'MYO Ön Değ.'!C34)+1,2)&REPT(\"*\",3)))","v":""},{"$f":"IF('MYO Ön Değ.'!D34=\"\",\"\",IF(ISERR(FIND(\" \",'MYO Ön Değ.'!D34))=TRUE,LEFT('MYO Ön Değ.'!D34,2)&REPT(\"*\",3),LEFT('MYO Ön Değ.'!D34,2)&REPT(\"*\",3)&\" \"&MID('MYO Ön Değ.'!D34,FIND(\" \",'MYO Ön Değ.'!D34)+1,2)&REPT(\"*\",3)))","v":""},{"$f":"IF('MYO Ön Değ.'!E34=\"\",\"\",'MYO Ön Değ.'!E34)","v":""},{"$f":"IF('MYO Ön Değ.'!F34=\"\",\"\",'MYO Ön Değ.'!F34)","v":""},{"$f":"IF('MYO Ön Değ.'!G34=\"\",\"\",'MYO Ön Değ.'!G34)","v":""},{"$f":"IF('MYO Ön Değ.'!H34=\"\",\"\",'MYO Ön Değ.'!H34)","v":""},{"$f":"IF('MYO Ön Değ.'!I34=\"\",\"\",'MYO Ön Değ.'!I34)","v":""},{"$f":"IF('MYO Ön Değ.'!J34=\"\",\"\",'MYO Ön Değ.'!J34)","v":""},{"$f":"IF('MYO Ön Değ.'!K34=\"\",\"\",'MYO Ön Değ.'!K34)","v":""},{"$f":"IF('MYO Ön Değ.'!L34=\"\",\"\",'MYO Ön Değ.'!L34)","v":""}]
[{"$f":"IF('MYO Ön Değ.'!A35=\"\",\"\",'MYO Ön Değ.'!A35)","v":""},{"$f":"IF('MYO Ön Değ.'!B35=\"\",\"\",LEFT('MYO Ön Değ.'!B35,3)&REPT(\"*\",4)&RIGHT('MYO Ön Değ.'!B35,2))","v":""},{"$f":"IF('MYO Ön Değ.'!C35=\"\",\"\",IF(ISERR(FIND(\" \",'MYO Ön Değ.'!C35))=TRUE,LEFT('MYO Ön Değ.'!C35,2)&REPT(\"*\",3),LEFT('MYO Ön Değ.'!C35,2)&REPT(\"*\",3)&\" \"&MID('MYO Ön Değ.'!C35,FIND(\" \",'MYO Ön Değ.'!C35)+1,2)&REPT(\"*\",3)))","v":""},{"$f":"IF('MYO Ön Değ.'!D35=\"\",\"\",IF(ISERR(FIND(\" \",'MYO Ön Değ.'!D35))=TRUE,LEFT('MYO Ön Değ.'!D35,2)&REPT(\"*\",3),LEFT('MYO Ön Değ.'!D35,2)&REPT(\"*\",3)&\" \"&MID('MYO Ön Değ.'!D35,FIND(\" \",'MYO Ön Değ.'!D35)+1,2)&REPT(\"*\",3)))","v":""},{"$f":"IF('MYO Ön Değ.'!E35=\"\",\"\",'MYO Ön Değ.'!E35)","v":""},{"$f":"IF('MYO Ön Değ.'!F35=\"\",\"\",'MYO Ön Değ.'!F35)","v":""},{"$f":"IF('MYO Ön Değ.'!G35=\"\",\"\",'MYO Ön Değ.'!G35)","v":""},{"$f":"IF('MYO Ön Değ.'!H35=\"\",\"\",'MYO Ön Değ.'!H35)","v":""},{"$f":"IF('MYO Ön Değ.'!I35=\"\",\"\",'MYO Ön Değ.'!I35)","v":""},{"$f":"IF('MYO Ön Değ.'!J35=\"\",\"\",'MYO Ön Değ.'!J35)","v":""},{"$f":"IF('MYO Ön Değ.'!K35=\"\",\"\",'MYO Ön Değ.'!K35)","v":""},{"$f":"IF('MYO Ön Değ.'!L35=\"\",\"\",'MYO Ön Değ.'!L35)","v":""}]
[{"$f":"IF('MYO Ön Değ.'!A36=\"\",\"\",'MYO Ön Değ.'!A36)","v":""},{"$f":"IF('MYO Ön Değ.'!B36=\"\",\"\",LEFT('MYO Ön Değ.'!B36,3)&REPT(\"*\",4)&RIGHT('MYO Ön Değ.'!B36,2))","v":""},{"$f":"IF('MYO Ön Değ.'!C36=\"\",\"\",IF(ISERR(FIND(\" \",'MYO Ön Değ.'!C36))=TRUE,LEFT('MYO Ön Değ.'!C36,2)&REPT(\"*\",3),LEFT('MYO Ön Değ.'!C36,2)&REPT(\"*\",3)&\" \"&MID('MYO Ön Değ.'!C36,FIND(\" \",'MYO Ön Değ.'!C36)+1,2)&REPT(\"*\",3)))","v":""},{"$f":"IF('MYO Ön Değ.'!D36=\"\",\"\",IF(ISERR(FIND(\" \",'MYO Ön Değ.'!D36))=TRUE,LEFT('MYO Ön Değ.'!D36,2)&REPT(\"*\",3),LEFT('MYO Ön Değ.'!D36,2)&REPT(\"*\",3)&\" \"&MID('MYO Ön Değ.'!D36,FIND(\" \",'MYO Ön Değ.'!D36)+1,2)&REPT(\"*\",3)))","v":""},{"$f":"IF('MYO Ön Değ.'!E36=\"\",\"\",'MYO Ön Değ.'!E36)","v":""},{"$f":"IF('MYO Ön Değ.'!F36=\"\",\"\",'MYO Ön Değ.'!F36)","v":""},{"$f":"IF('MYO Ön Değ.'!G36=\"\",\"\",'MYO Ön Değ.'!G36)","v":""},{"$f":"IF('MYO Ön Değ.'!H36=\"\",\"\",'MYO Ön Değ.'!H36)","v":""},{"$f":"IF('MYO Ön Değ.'!I36=\"\",\"\",'MYO Ön Değ.'!I36)","v":""},{"$f":"IF('MYO Ön Değ.'!J36=\"\",\"\",'MYO Ön Değ.'!J36)","v":""},{"$f":"IF('MYO Ön Değ.'!K36=\"\",\"\",'MYO Ön Değ.'!K36)","v":""},{"$f":"IF('MYO Ön Değ.'!L36=\"\",\"\",'MYO Ön Değ.'!L36)","v":""}]
[{"$f":"IF('MYO Ön Değ.'!A37=\"\",\"\",'MYO Ön Değ.'!A37)","v":""},{"$f":"IF('MYO Ön Değ.'!B37=\"\",\"\",LEFT('MYO Ön Değ.'!B37,3)&REPT(\"*\",4)&RIGHT('MYO Ön Değ.'!B37,2))","v":""},{"$f":"IF('MYO Ön Değ.'!C37=\"\",\"\",IF(ISERR(FIND(\" \",'MYO Ön Değ.'!C37))=TRUE,LEFT('MYO Ön Değ.'!C37,2)&REPT(\"*\",3),LEFT('MYO Ön Değ.'!C37,2)&REPT(\"*\",3)&\" \"&MID('MYO Ön Değ.'!C37,FIND(\" \",'MYO Ön Değ.'!C37)+1,2)&REPT(\"*\",3)))","v":""},{"$f":"IF('MYO Ön Değ.'!D37=\"\",\"\",IF(ISERR(FIND(\" \",'MYO Ön Değ.'!D37))=TRUE,LEFT('MYO Ön Değ.'!D37,2)&REPT(\"*\",3),LEFT('MYO Ön Değ.'!D37,2)&REPT(\"*\",3)&\" \"&MID('MYO Ön Değ.'!D37,FIND(\" \",'MYO Ön Değ.'!D37)+1,2)&REPT(\"*\",3)))","v":""},{"$f":"IF('MYO Ön Değ.'!E37=\"\",\"\",'MYO Ön Değ.'!E37)","v":""},{"$f":"IF('MYO Ön Değ.'!F37=\"\",\"\",'MYO Ön Değ.'!F37)","v":""},{"$f":"IF('MYO Ön Değ.'!G37=\"\",\"\",'MYO Ön Değ.'!G37)","v":""},{"$f":"IF('MYO Ön Değ.'!H37=\"\",\"\",'MYO Ön Değ.'!H37)","v":""},{"$f":"IF('MYO Ön Değ.'!I37=\"\",\"\",'MYO Ön Değ.'!I37)","v":""},{"$f":"IF('MYO Ön Değ.'!J37=\"\",\"\",'MYO Ön Değ.'!J37)","v":""},{"$f":"IF('MYO Ön Değ.'!K37=\"\",\"\",'MYO Ön Değ.'!K37)","v":""},{"$f":"IF('MYO Ön Değ.'!L37=\"\",\"\",'MYO Ön Değ.'!L37)","v":""}]
[{"$f":"IF('MYO Ön Değ.'!A38=\"\",\"\",'MYO Ön Değ.'!A38)","v":""},{"$f":"IF('MYO Ön Değ.'!B38=\"\",\"\",LEFT('MYO Ön Değ.'!B38,3)&REPT(\"*\",4)&RIGHT('MYO Ön Değ.'!B38,2))","v":""},{"$f":"IF('MYO Ön Değ.'!C38=\"\",\"\",IF(ISERR(FIND(\" \",'MYO Ön Değ.'!C38))=TRUE,LEFT('MYO Ön Değ.'!C38,2)&REPT(\"*\",3),LEFT('MYO Ön Değ.'!C38,2)&REPT(\"*\",3)&\" \"&MID('MYO Ön Değ.'!C38,FIND(\" \",'MYO Ön Değ.'!C38)+1,2)&REPT(\"*\",3)))","v":""},{"$f":"IF('MYO Ön Değ.'!D38=\"\",\"\",IF(ISERR(FIND(\" \",'MYO Ön Değ.'!D38))=TRUE,LEFT('MYO Ön Değ.'!D38,2)&REPT(\"*\",3),LEFT('MYO Ön Değ.'!D38,2)&REPT(\"*\",3)&\" \"&MID('MYO Ön Değ.'!D38,FIND(\" \",'MYO Ön Değ.'!D38)+1,2)&REPT(\"*\",3)))","v":""},{"$f":"IF('MYO Ön Değ.'!E38=\"\",\"\",'MYO Ön Değ.'!E38)","v":""},{"$f":"IF('MYO Ön Değ.'!F38=\"\",\"\",'MYO Ön Değ.'!F38)","v":""},{"$f":"IF('MYO Ön Değ.'!G38=\"\",\"\",'MYO Ön Değ.'!G38)","v":""},{"$f":"IF('MYO Ön Değ.'!H38=\"\",\"\",'MYO Ön Değ.'!H38)","v":""},{"$f":"IF('MYO Ön Değ.'!I38=\"\",\"\",'MYO Ön Değ.'!I38)","v":""},{"$f":"IF('MYO Ön Değ.'!J38=\"\",\"\",'MYO Ön Değ.'!J38)","v":""},{"$f":"IF('MYO Ön Değ.'!K38=\"\",\"\",'MYO Ön Değ.'!K38)","v":""},{"$f":"IF('MYO Ön Değ.'!L38=\"\",\"\",'MYO Ön Değ.'!L38)","v":""}]
[{"$f":"IF('MYO Ön Değ.'!A39=\"\",\"\",'MYO Ön Değ.'!A39)","v":""},{"$f":"IF('MYO Ön Değ.'!B39=\"\",\"\",LEFT('MYO Ön Değ.'!B39,3)&REPT(\"*\",4)&RIGHT('MYO Ön Değ.'!B39,2))","v":""},{"$f":"IF('MYO Ön Değ.'!C39=\"\",\"\",IF(ISERR(FIND(\" \",'MYO Ön Değ.'!C39))=TRUE,LEFT('MYO Ön Değ.'!C39,2)&REPT(\"*\",3),LEFT('MYO Ön Değ.'!C39,2)&REPT(\"*\",3)&\" \"&MID('MYO Ön Değ.'!C39,FIND(\" \",'MYO Ön Değ.'!C39)+1,2)&REPT(\"*\",3)))","v":""},{"$f":"IF('MYO Ön Değ.'!D39=\"\",\"\",IF(ISERR(FIND(\" \",'MYO Ön Değ.'!D39))=TRUE,LEFT('MYO Ön Değ.'!D39,2)&REPT(\"*\",3),LEFT('MYO Ön Değ.'!D39,2)&REPT(\"*\",3)&\" \"&MID('MYO Ön Değ.'!D39,FIND(\" \",'MYO Ön Değ.'!D39)+1,2)&REPT(\"*\",3)))","v":""},{"$f":"IF('MYO Ön Değ.'!E39=\"\",\"\",'MYO Ön Değ.'!E39)","v":""},{"$f":"IF('MYO Ön Değ.'!F39=\"\",\"\",'MYO Ön Değ.'!F39)","v":""},{"$f":"IF('MYO Ön Değ.'!G39=\"\",\"\",'MYO Ön Değ.'!G39)","v":""},{"$f":"IF('MYO Ön Değ.'!H39=\"\",\"\",'MYO Ön Değ.'!H39)","v":""},{"$f":"IF('MYO Ön Değ.'!I39=\"\",\"\",'MYO Ön Değ.'!I39)","v":""},{"$f":"IF('MYO Ön Değ.'!J39=\"\",\"\",'MYO Ön Değ.'!J39)","v":""},{"$f":"IF('MYO Ön Değ.'!K39=\"\",\"\",'MYO Ön Değ.'!K39)","v":""},{"$f":"IF('MYO Ön Değ.'!L39=\"\",\"\",'MYO Ön Değ.'!L39)","v":""}]
[{"$f":"IF('MYO Ön Değ.'!A40=\"\",\"\",'MYO Ön Değ.'!A40)","v":""},{"$f":"IF('MYO Ön Değ.'!B40=\"\",\"\",LEFT('MYO Ön Değ.'!B40,3)&REPT(\"*\",4)&RIGHT('MYO Ön Değ.'!B40,2))","v":""},{"$f":"IF('MYO Ön Değ.'!C40=\"\",\"\",IF(ISERR(FIND(\" \",'MYO Ön Değ.'!C40))=TRUE,LEFT('MYO Ön Değ.'!C40,2)&REPT(\"*\",3),LEFT('MYO Ön Değ.'!C40,2)&REPT(\"*\",3)&\" \"&MID('MYO Ön Değ.'!C40,FIND(\" \",'MYO Ön Değ.'!C40)+1,2)&REPT(\"*\",3)))","v":""},{"$f":"IF('MYO Ön Değ.'!D40=\"\",\"\",IF(ISERR(FIND(\" \",'MYO Ön Değ.'!D40))=TRUE,LEFT('MYO Ön Değ.'!D40,2)&REPT(\"*\",3),LEFT('MYO Ön Değ.'!D40,2)&REPT(\"*\",3)&\" \"&MID('MYO Ön Değ.'!D40,FIND(\" \",'MYO Ön Değ.'!D40)+1,2)&REPT(\"*\",3)))","v":""},{"$f":"IF('MYO Ön Değ.'!E40=\"\",\"\",'MYO Ön Değ.'!E40)","v":""},{"$f":"IF('MYO Ön Değ.'!F40=\"\",\"\",'MYO Ön Değ.'!F40)","v":""},{"$f":"IF('MYO Ön Değ.'!G40=\"\",\"\",'MYO Ön Değ.'!G40)","v":""},{"$f":"IF('MYO Ön Değ.'!H40=\"\",\"\",'MYO Ön Değ.'!H40)","v":""},{"$f":"IF('MYO Ön Değ.'!I40=\"\",\"\",'MYO Ön Değ.'!I40)","v":""},{"$f":"IF('MYO Ön Değ.'!J40=\"\",\"\",'MYO Ön Değ.'!J40)","v":""},{"$f":"IF('MYO Ön Değ.'!K40=\"\",\"\",'MYO Ön Değ.'!K40)","v":""},{"$f":"IF('MYO Ön Değ.'!L40=\"\",\"\",'MYO Ön Değ.'!L40)","v":""}]
[{"$f":"IF('MYO Ön Değ.'!A41=\"\",\"\",'MYO Ön Değ.'!A41)","v":""},{"$f":"IF('MYO Ön Değ.'!B41=\"\",\"\",LEFT('MYO Ön Değ.'!B41,3)&REPT(\"*\",4)&RIGHT('MYO Ön Değ.'!B41,2))","v":""},{"$f":"IF('MYO Ön Değ.'!C41=\"\",\"\",IF(ISERR(FIND(\" \",'MYO Ön Değ.'!C41))=TRUE,LEFT('MYO Ön Değ.'!C41,2)&REPT(\"*\",3),LEFT('MYO Ön Değ.'!C41,2)&REPT(\"*\",3)&\" \"&MID('MYO Ön Değ.'!C41,FIND(\" \",'MYO Ön Değ.'!C41)+1,2)&REPT(\"*\",3)))","v":""},{"$f":"IF('MYO Ön Değ.'!D41=\"\",\"\",IF(ISERR(FIND(\" \",'MYO Ön Değ.'!D41))=TRUE,LEFT('MYO Ön Değ.'!D41,2)&REPT(\"*\",3),LEFT('MYO Ön Değ.'!D41,2)&REPT(\"*\",3)&\" \"&MID('MYO Ön Değ.'!D41,FIND(\" \",'MYO Ön Değ.'!D41)+1,2)&REPT(\"*\",3)))","v":""},{"$f":"IF('MYO Ön Değ.'!E41=\"\",\"\",'MYO Ön Değ.'!E41)","v":""},{"$f":"IF('MYO Ön Değ.'!F41=\"\",\"\",'MYO Ön Değ.'!F41)","v":""},{"$f":"IF('MYO Ön Değ.'!G41=\"\",\"\",'MYO Ön Değ.'!G41)","v":""},{"$f":"IF('MYO Ön Değ.'!H41=\"\",\"\",'MYO Ön Değ.'!H41)","v":""},{"$f":"IF('MYO Ön Değ.'!I41=\"\",\"\",'MYO Ön Değ.'!I41)","v":""},{"$f":"IF('MYO Ön Değ.'!J41=\"\",\"\",'MYO Ön Değ.'!J41)","v":""},{"$f":"IF('MYO Ön Değ.'!K41=\"\",\"\",'MYO Ön Değ.'!K41)","v":""},{"$f":"IF('MYO Ön Değ.'!L41=\"\",\"\",'MYO Ön Değ.'!L41)","v":""}]
[{"$f":"IF('MYO Ön Değ.'!A42=\"\",\"\",'MYO Ön Değ.'!A42)","v":""},{"$f":"IF('MYO Ön Değ.'!B42=\"\",\"\",LEFT('MYO Ön Değ.'!B42,3)&REPT(\"*\",4)&RIGHT('MYO Ön Değ.'!B42,2))","v":""},{"$f":"IF('MYO Ön Değ.'!C42=\"\",\"\",IF(ISERR(FIND(\" \",'MYO Ön Değ.'!C42))=TRUE,LEFT('MYO Ön Değ.'!C42,2)&REPT(\"*\",3),LEFT('MYO Ön Değ.'!C42,2)&REPT(\"*\",3)&\" \"&MID('MYO Ön Değ.'!C42,FIND(\" \",'MYO Ön Değ.'!C42)+1,2)&REPT(\"*\",3)))","v":""},{"$f":"IF('MYO Ön Değ.'!D42=\"\",\"\",IF(ISERR(FIND(\" \",'MYO Ön Değ.'!D42))=TRUE,LEFT('MYO Ön Değ.'!D42,2)&REPT(\"*\",3),LEFT('MYO Ön Değ.'!D42,2)&REPT(\"*\",3)&\" \"&MID('MYO Ön Değ.'!D42,FIND(\" \",'MYO Ön Değ.'!D42)+1,2)&REPT(\"*\",3)))","v":""},{"$f":"IF('MYO Ön Değ.'!E42=\"\",\"\",'MYO Ön Değ.'!E42)","v":""},{"$f":"IF('MYO Ön Değ.'!F42=\"\",\"\",'MYO Ön Değ.'!F42)","v":""},{"$f":"IF('MYO Ön Değ.'!G42=\"\",\"\",'MYO Ön Değ.'!G42)","v":""},{"$f":"IF('MYO Ön Değ.'!H42=\"\",\"\",'MYO Ön Değ.'!H42)","v":""},{"$f":"IF('MYO Ön Değ.'!I42=\"\",\"\",'MYO Ön Değ.'!I42)","v":""},{"$f":"IF('MYO Ön Değ.'!J42=\"\",\"\",'MYO Ön Değ.'!J42)","v":""},{"$f":"IF('MYO Ön Değ.'!K42=\"\",\"\",'MYO Ön Değ.'!K42)","v":""},{"$f":"IF('MYO Ön Değ.'!L42=\"\",\"\",'MYO Ön Değ.'!L42)","v":""}]
[{"$f":"IF('MYO Ön Değ.'!A43=\"\",\"\",'MYO Ön Değ.'!A43)","v":""},{"$f":"IF('MYO Ön Değ.'!B43=\"\",\"\",LEFT('MYO Ön Değ.'!B43,3)&REPT(\"*\",4)&RIGHT('MYO Ön Değ.'!B43,2))","v":""},{"$f":"IF('MYO Ön Değ.'!C43=\"\",\"\",IF(ISERR(FIND(\" \",'MYO Ön Değ.'!C43))=TRUE,LEFT('MYO Ön Değ.'!C43,2)&REPT(\"*\",3),LEFT('MYO Ön Değ.'!C43,2)&REPT(\"*\",3)&\" \"&MID('MYO Ön Değ.'!C43,FIND(\" \",'MYO Ön Değ.'!C43)+1,2)&REPT(\"*\",3)))","v":""},{"$f":"IF('MYO Ön Değ.'!D43=\"\",\"\",IF(ISERR(FIND(\" \",'MYO Ön Değ.'!D43))=TRUE,LEFT('MYO Ön Değ.'!D43,2)&REPT(\"*\",3),LEFT('MYO Ön Değ.'!D43,2)&REPT(\"*\",3)&\" \"&MID('MYO Ön Değ.'!D43,FIND(\" \",'MYO Ön Değ.'!D43)+1,2)&REPT(\"*\",3)))","v":""},{"$f":"IF('MYO Ön Değ.'!E43=\"\",\"\",'MYO Ön Değ.'!E43)","v":""},{"$f":"IF('MYO Ön Değ.'!F43=\"\",\"\",'MYO Ön Değ.'!F43)","v":""},{"$f":"IF('MYO Ön Değ.'!G43=\"\",\"\",'MYO Ön Değ.'!G43)","v":""},{"$f":"IF('MYO Ön Değ.'!H43=\"\",\"\",'MYO Ön Değ.'!H43)","v":""},{"$f":"IF('MYO Ön Değ.'!I43=\"\",\"\",'MYO Ön Değ.'!I43)","v":""},{"$f":"IF('MYO Ön Değ.'!J43=\"\",\"\",'MYO Ön Değ.'!J43)","v":""},{"$f":"IF('MYO Ön Değ.'!K43=\"\",\"\",'MYO Ön Değ.'!K43)","v":""},{"$f":"IF('MYO Ön Değ.'!L43=\"\",\"\",'MYO Ön Değ.'!L43)","v":""}]
[{"$f":"IF('MYO Ön Değ.'!A44=\"\",\"\",'MYO Ön Değ.'!A44)","v":""},{"$f":"IF('MYO Ön Değ.'!B44=\"\",\"\",LEFT('MYO Ön Değ.'!B44,3)&REPT(\"*\",4)&RIGHT('MYO Ön Değ.'!B44,2))","v":""},{"$f":"IF('MYO Ön Değ.'!C44=\"\",\"\",IF(ISERR(FIND(\" \",'MYO Ön Değ.'!C44))=TRUE,LEFT('MYO Ön Değ.'!C44,2)&REPT(\"*\",3),LEFT('MYO Ön Değ.'!C44,2)&REPT(\"*\",3)&\" \"&MID('MYO Ön Değ.'!C44,FIND(\" \",'MYO Ön Değ.'!C44)+1,2)&REPT(\"*\",3)))","v":""},{"$f":"IF('MYO Ön Değ.'!D44=\"\",\"\",IF(ISERR(FIND(\" \",'MYO Ön Değ.'!D44))=TRUE,LEFT('MYO Ön Değ.'!D44,2)&REPT(\"*\",3),LEFT('MYO Ön Değ.'!D44,2)&REPT(\"*\",3)&\" \"&MID('MYO Ön Değ.'!D44,FIND(\" \",'MYO Ön Değ.'!D44)+1,2)&REPT(\"*\",3)))","v":""},{"$f":"IF('MYO Ön Değ.'!E44=\"\",\"\",'MYO Ön Değ.'!E44)","v":""},{"$f":"IF('MYO Ön Değ.'!F44=\"\",\"\",'MYO Ön Değ.'!F44)","v":""},{"$f":"IF('MYO Ön Değ.'!G44=\"\",\"\",'MYO Ön Değ.'!G44)","v":""},{"$f":"IF('MYO Ön Değ.'!H44=\"\",\"\",'MYO Ön Değ.'!H44)","v":""},{"$f":"IF('MYO Ön Değ.'!I44=\"\",\"\",'MYO Ön Değ.'!I44)","v":""},{"$f":"IF('MYO Ön Değ.'!J44=\"\",\"\",'MYO Ön Değ.'!J44)","v":""},{"$f":"IF('MYO Ön Değ.'!K44=\"\",\"\",'MYO Ön Değ.'!K44)","v":""},{"$f":"IF('MYO Ön Değ.'!L44=\"\",\"\",'MYO Ön Değ.'!L44)","v":""}]
[{"$f":"IF('MYO Ön Değ.'!A45=\"\",\"\",'MYO Ön Değ.'!A45)","v":""},{"$f":"IF('MYO Ön Değ.'!B45=\"\",\"\",LEFT('MYO Ön Değ.'!B45,3)&REPT(\"*\",4)&RIGHT('MYO Ön Değ.'!B45,2))","v":""},{"$f":"IF('MYO Ön Değ.'!C45=\"\",\"\",IF(ISERR(FIND(\" \",'MYO Ön Değ.'!C45))=TRUE,LEFT('MYO Ön Değ.'!C45,2)&REPT(\"*\",3),LEFT('MYO Ön Değ.'!C45,2)&REPT(\"*\",3)&\" \"&MID('MYO Ön Değ.'!C45,FIND(\" \",'MYO Ön Değ.'!C45)+1,2)&REPT(\"*\",3)))","v":""},{"$f":"IF('MYO Ön Değ.'!D45=\"\",\"\",IF(ISERR(FIND(\" \",'MYO Ön Değ.'!D45))=TRUE,LEFT('MYO Ön Değ.'!D45,2)&REPT(\"*\",3),LEFT('MYO Ön Değ.'!D45,2)&REPT(\"*\",3)&\" \"&MID('MYO Ön Değ.'!D45,FIND(\" \",'MYO Ön Değ.'!D45)+1,2)&REPT(\"*\",3)))","v":""},{"$f":"IF('MYO Ön Değ.'!E45=\"\",\"\",'MYO Ön Değ.'!E45)","v":""},{"$f":"IF('MYO Ön Değ.'!F45=\"\",\"\",'MYO Ön Değ.'!F45)","v":""},{"$f":"IF('MYO Ön Değ.'!G45=\"\",\"\",'MYO Ön Değ.'!G45)","v":""},{"$f":"IF('MYO Ön Değ.'!H45=\"\",\"\",'MYO Ön Değ.'!H45)","v":""},{"$f":"IF('MYO Ön Değ.'!I45=\"\",\"\",'MYO Ön Değ.'!I45)","v":""},{"$f":"IF('MYO Ön Değ.'!J45=\"\",\"\",'MYO Ön Değ.'!J45)","v":""},{"$f":"IF('MYO Ön Değ.'!K45=\"\",\"\",'MYO Ön Değ.'!K45)","v":""},{"$f":"IF('MYO Ön Değ.'!L45=\"\",\"\",'MYO Ön Değ.'!L45)","v":""}]
[{"$f":"IF('MYO Ön Değ.'!A46=\"\",\"\",'MYO Ön Değ.'!A46)","v":""},{"$f":"IF('MYO Ön Değ.'!B46=\"\",\"\",LEFT('MYO Ön Değ.'!B46,3)&REPT(\"*\",4)&RIGHT('MYO Ön Değ.'!B46,2))","v":""},{"$f":"IF('MYO Ön Değ.'!C46=\"\",\"\",IF(ISERR(FIND(\" \",'MYO Ön Değ.'!C46))=TRUE,LEFT('MYO Ön Değ.'!C46,2)&REPT(\"*\",3),LEFT('MYO Ön Değ.'!C46,2)&REPT(\"*\",3)&\" \"&MID('MYO Ön Değ.'!C46,FIND(\" \",'MYO Ön Değ.'!C46)+1,2)&REPT(\"*\",3)))","v":""},{"$f":"IF('MYO Ön Değ.'!D46=\"\",\"\",IF(ISERR(FIND(\" \",'MYO Ön Değ.'!D46))=TRUE,LEFT('MYO Ön Değ.'!D46,2)&REPT(\"*\",3),LEFT('MYO Ön Değ.'!D46,2)&REPT(\"*\",3)&\" \"&MID('MYO Ön Değ.'!D46,FIND(\" \",'MYO Ön Değ.'!D46)+1,2)&REPT(\"*\",3)))","v":""},{"$f":"IF('MYO Ön Değ.'!E46=\"\",\"\",'MYO Ön Değ.'!E46)","v":""},{"$f":"IF('MYO Ön Değ.'!F46=\"\",\"\",'MYO Ön Değ.'!F46)","v":""},{"$f":"IF('MYO Ön Değ.'!G46=\"\",\"\",'MYO Ön Değ.'!G46)","v":""},{"$f":"IF('MYO Ön Değ.'!H46=\"\",\"\",'MYO Ön Değ.'!H46)","v":""},{"$f":"IF('MYO Ön Değ.'!I46=\"\",\"\",'MYO Ön Değ.'!I46)","v":""},{"$f":"IF('MYO Ön Değ.'!J46=\"\",\"\",'MYO Ön Değ.'!J46)","v":""},{"$f":"IF('MYO Ön Değ.'!K46=\"\",\"\",'MYO Ön Değ.'!K46)","v":""},{"$f":"IF('MYO Ön Değ.'!L46=\"\",\"\",'MYO Ön Değ.'!L46)","v":""}]
[{"$f":"IF('MYO Ön Değ.'!A47=\"\",\"\",'MYO Ön Değ.'!A47)","v":""},{"$f":"IF('MYO Ön Değ.'!B47=\"\",\"\",LEFT('MYO Ön Değ.'!B47,3)&REPT(\"*\",4)&RIGHT('MYO Ön Değ.'!B47,2))","v":""},{"$f":"IF('MYO Ön Değ.'!C47=\"\",\"\",IF(ISERR(FIND(\" \",'MYO Ön Değ.'!C47))=TRUE,LEFT('MYO Ön Değ.'!C47,2)&REPT(\"*\",3),LEFT('MYO Ön Değ.'!C47,2)&REPT(\"*\",3)&\" \"&MID('MYO Ön Değ.'!C47,FIND(\" \",'MYO Ön Değ.'!C47)+1,2)&REPT(\"*\",3)))","v":""},{"$f":"IF('MYO Ön Değ.'!D47=\"\",\"\",IF(ISERR(FIND(\" \",'MYO Ön Değ.'!D47))=TRUE,LEFT('MYO Ön Değ.'!D47,2)&REPT(\"*\",3),LEFT('MYO Ön Değ.'!D47,2)&REPT(\"*\",3)&\" \"&MID('MYO Ön Değ.'!D47,FIND(\" \",'MYO Ön Değ.'!D47)+1,2)&REPT(\"*\",3)))","v":""},{"$f":"IF('MYO Ön Değ.'!E47=\"\",\"\",'MYO Ön Değ.'!E47)","v":""},{"$f":"IF('MYO Ön Değ.'!F47=\"\",\"\",'MYO Ön Değ.'!F47)","v":""},{"$f":"IF('MYO Ön Değ.'!G47=\"\",\"\",'MYO Ön Değ.'!G47)","v":""},{"$f":"IF('MYO Ön Değ.'!H47=\"\",\"\",'MYO Ön Değ.'!H47)","v":""},{"$f":"IF('MYO Ön Değ.'!I47=\"\",\"\",'MYO Ön Değ.'!I47)","v":""},{"$f":"IF('MYO Ön Değ.'!J47=\"\",\"\",'MYO Ön Değ.'!J47)","v":""},{"$f":"IF('MYO Ön Değ.'!K47=\"\",\"\",'MYO Ön Değ.'!K47)","v":""},{"$f":"IF('MYO Ön Değ.'!L47=\"\",\"\",'MYO Ön Değ.'!L47)","v":""}]
[{"$f":"IF('MYO Ön Değ.'!A48=\"\",\"\",'MYO Ön Değ.'!A48)","v":""},{"$f":"IF('MYO Ön Değ.'!B48=\"\",\"\",LEFT('MYO Ön Değ.'!B48,3)&REPT(\"*\",4)&RIGHT('MYO Ön Değ.'!B48,2))","v":""},{"$f":"IF('MYO Ön Değ.'!C48=\"\",\"\",IF(ISERR(FIND(\" \",'MYO Ön Değ.'!C48))=TRUE,LEFT('MYO Ön Değ.'!C48,2)&REPT(\"*\",3),LEFT('MYO Ön Değ.'!C48,2)&REPT(\"*\",3)&\" \"&MID('MYO Ön Değ.'!C48,FIND(\" \",'MYO Ön Değ.'!C48)+1,2)&REPT(\"*\",3)))","v":""},{"$f":"IF('MYO Ön Değ.'!D48=\"\",\"\",IF(ISERR(FIND(\" \",'MYO Ön Değ.'!D48))=TRUE,LEFT('MYO Ön Değ.'!D48,2)&REPT(\"*\",3),LEFT('MYO Ön Değ.'!D48,2)&REPT(\"*\",3)&\" \"&MID('MYO Ön Değ.'!D48,FIND(\" \",'MYO Ön Değ.'!D48)+1,2)&REPT(\"*\",3)))","v":""},{"$f":"IF('MYO Ön Değ.'!E48=\"\",\"\",'MYO Ön Değ.'!E48)","v":""},{"$f":"IF('MYO Ön Değ.'!F48=\"\",\"\",'MYO Ön Değ.'!F48)","v":""},{"$f":"IF('MYO Ön Değ.'!G48=\"\",\"\",'MYO Ön Değ.'!G48)","v":""},{"$f":"IF('MYO Ön Değ.'!H48=\"\",\"\",'MYO Ön Değ.'!H48)","v":""},{"$f":"IF('MYO Ön Değ.'!I48=\"\",\"\",'MYO Ön Değ.'!I48)","v":""},{"$f":"IF('MYO Ön Değ.'!J48=\"\",\"\",'MYO Ön Değ.'!J48)","v":""},{"$f":"IF('MYO Ön Değ.'!K48=\"\",\"\",'MYO Ön Değ.'!K48)","v":""},{"$f":"IF('MYO Ön Değ.'!L48=\"\",\"\",'MYO Ön Değ.'!L48)","v":""}]
[{"$f":"IF('MYO Ön Değ.'!A49=\"\",\"\",'MYO Ön Değ.'!A49)","v":""},{"$f":"IF('MYO Ön Değ.'!B49=\"\",\"\",LEFT('MYO Ön Değ.'!B49,3)&REPT(\"*\",4)&RIGHT('MYO Ön Değ.'!B49,2))","v":""},{"$f":"IF('MYO Ön Değ.'!C49=\"\",\"\",IF(ISERR(FIND(\" \",'MYO Ön Değ.'!C49))=TRUE,LEFT('MYO Ön Değ.'!C49,2)&REPT(\"*\",3),LEFT('MYO Ön Değ.'!C49,2)&REPT(\"*\",3)&\" \"&MID('MYO Ön Değ.'!C49,FIND(\" \",'MYO Ön Değ.'!C49)+1,2)&REPT(\"*\",3)))","v":""},{"$f":"IF('MYO Ön Değ.'!D49=\"\",\"\",IF(ISERR(FIND(\" \",'MYO Ön Değ.'!D49))=TRUE,LEFT('MYO Ön Değ.'!D49,2)&REPT(\"*\",3),LEFT('MYO Ön Değ.'!D49,2)&REPT(\"*\",3)&\" \"&MID('MYO Ön Değ.'!D49,FIND(\" \",'MYO Ön Değ.'!D49)+1,2)&REPT(\"*\",3)))","v":""},{"$f":"IF('MYO Ön Değ.'!E49=\"\",\"\",'MYO Ön Değ.'!E49)","v":""},{"$f":"IF('MYO Ön Değ.'!F49=\"\",\"\",'MYO Ön Değ.'!F49)","v":""},{"$f":"IF('MYO Ön Değ.'!G49=\"\",\"\",'MYO Ön Değ.'!G49)","v":""},{"$f":"IF('MYO Ön Değ.'!H49=\"\",\"\",'MYO Ön Değ.'!H49)","v":""},{"$f":"IF('MYO Ön Değ.'!I49=\"\",\"\",'MYO Ön Değ.'!I49)","v":""},{"$f":"IF('MYO Ön Değ.'!J49=\"\",\"\",'MYO Ön Değ.'!J49)","v":""},{"$f":"IF('MYO Ön Değ.'!K49=\"\",\"\",'MYO Ön Değ.'!K49)","v":""},{"$f":"IF('MYO Ön Değ.'!L49=\"\",\"\",'MYO Ön Değ.'!L49)","v":""}]
[{"$f":"IF('MYO Ön Değ.'!A50=\"\",\"\",'MYO Ön Değ.'!A50)","v":""},{"$f":"IF('MYO Ön Değ.'!B50=\"\",\"\",LEFT('MYO Ön Değ.'!B50,3)&REPT(\"*\",4)&RIGHT('MYO Ön Değ.'!B50,2))","v":""},{"$f":"IF('MYO Ön Değ.'!C50=\"\",\"\",IF(ISERR(FIND(\" \",'MYO Ön Değ.'!C50))=TRUE,LEFT('MYO Ön Değ.'!C50,2)&REPT(\"*\",3),LEFT('MYO Ön Değ.'!C50,2)&REPT(\"*\",3)&\" \"&MID('MYO Ön Değ.'!C50,FIND(\" \",'MYO Ön Değ.'!C50)+1,2)&REPT(\"*\",3)))","v":""},{"$f":"IF('MYO Ön Değ.'!D50=\"\",\"\",IF(ISERR(FIND(\" \",'MYO Ön Değ.'!D50))=TRUE,LEFT('MYO Ön Değ.'!D50,2)&REPT(\"*\",3),LEFT('MYO Ön Değ.'!D50,2)&REPT(\"*\",3)&\" \"&MID('MYO Ön Değ.'!D50,FIND(\" \",'MYO Ön Değ.'!D50)+1,2)&REPT(\"*\",3)))","v":""},{"$f":"IF('MYO Ön Değ.'!E50=\"\",\"\",'MYO Ön Değ.'!E50)","v":""},{"$f":"IF('MYO Ön Değ.'!F50=\"\",\"\",'MYO Ön Değ.'!F50)","v":""},{"$f":"IF('MYO Ön Değ.'!G50=\"\",\"\",'MYO Ön Değ.'!G50)","v":""},{"$f":"IF('MYO Ön Değ.'!H50=\"\",\"\",'MYO Ön Değ.'!H50)","v":""},{"$f":"IF('MYO Ön Değ.'!I50=\"\",\"\",'MYO Ön Değ.'!I50)","v":""},{"$f":"IF('MYO Ön Değ.'!J50=\"\",\"\",'MYO Ön Değ.'!J50)","v":""},{"$f":"IF('MYO Ön Değ.'!K50=\"\",\"\",'MYO Ön Değ.'!K50)","v":""},{"$f":"IF('MYO Ön Değ.'!L50=\"\",\"\",'MYO Ön Değ.'!L50)","v":""}]
[{"$f":"IF('MYO Ön Değ.'!A51=\"\",\"\",'MYO Ön Değ.'!A51)","v":""},{"$f":"IF('MYO Ön Değ.'!B51=\"\",\"\",LEFT('MYO Ön Değ.'!B51,3)&REPT(\"*\",4)&RIGHT('MYO Ön Değ.'!B51,2))","v":""},{"$f":"IF('MYO Ön Değ.'!C51=\"\",\"\",IF(ISERR(FIND(\" \",'MYO Ön Değ.'!C51))=TRUE,LEFT('MYO Ön Değ.'!C51,2)&REPT(\"*\",3),LEFT('MYO Ön Değ.'!C51,2)&REPT(\"*\",3)&\" \"&MID('MYO Ön Değ.'!C51,FIND(\" \",'MYO Ön Değ.'!C51)+1,2)&REPT(\"*\",3)))","v":""},{"$f":"IF('MYO Ön Değ.'!D51=\"\",\"\",IF(ISERR(FIND(\" \",'MYO Ön Değ.'!D51))=TRUE,LEFT('MYO Ön Değ.'!D51,2)&REPT(\"*\",3),LEFT('MYO Ön Değ.'!D51,2)&REPT(\"*\",3)&\" \"&MID('MYO Ön Değ.'!D51,FIND(\" \",'MYO Ön Değ.'!D51)+1,2)&REPT(\"*\",3)))","v":""},{"$f":"IF('MYO Ön Değ.'!E51=\"\",\"\",'MYO Ön Değ.'!E51)","v":""},{"$f":"IF('MYO Ön Değ.'!F51=\"\",\"\",'MYO Ön Değ.'!F51)","v":""},{"$f":"IF('MYO Ön Değ.'!G51=\"\",\"\",'MYO Ön Değ.'!G51)","v":""},{"$f":"IF('MYO Ön Değ.'!H51=\"\",\"\",'MYO Ön Değ.'!H51)","v":""},{"$f":"IF('MYO Ön Değ.'!I51=\"\",\"\",'MYO Ön Değ.'!I51)","v":""},{"$f":"IF('MYO Ön Değ.'!J51=\"\",\"\",'MYO Ön Değ.'!J51)","v":""},{"$f":"IF('MYO Ön Değ.'!K51=\"\",\"\",'MYO Ön Değ.'!K51)","v":""},{"$f":"IF('MYO Ön Değ.'!L51=\"\",\"\",'MYO Ön Değ.'!L51)","v":""}]
[{"$f":"IF('MYO Ön Değ.'!A52=\"\",\"\",'MYO Ön Değ.'!A52)","v":""},{"$f":"IF('MYO Ön Değ.'!B52=\"\",\"\",LEFT('MYO Ön Değ.'!B52,3)&REPT(\"*\",4)&RIGHT('MYO Ön Değ.'!B52,2))","v":""},{"$f":"IF('MYO Ön Değ.'!C52=\"\",\"\",IF(ISERR(FIND(\" \",'MYO Ön Değ.'!C52))=TRUE,LEFT('MYO Ön Değ.'!C52,2)&REPT(\"*\",3),LEFT('MYO Ön Değ.'!C52,2)&REPT(\"*\",3)&\" \"&MID('MYO Ön Değ.'!C52,FIND(\" \",'MYO Ön Değ.'!C52)+1,2)&REPT(\"*\",3)))","v":""},{"$f":"IF('MYO Ön Değ.'!D52=\"\",\"\",IF(ISERR(FIND(\" \",'MYO Ön Değ.'!D52))=TRUE,LEFT('MYO Ön Değ.'!D52,2)&REPT(\"*\",3),LEFT('MYO Ön Değ.'!D52,2)&REPT(\"*\",3)&\" \"&MID('MYO Ön Değ.'!D52,FIND(\" \",'MYO Ön Değ.'!D52)+1,2)&REPT(\"*\",3)))","v":""},{"$f":"IF('MYO Ön Değ.'!E52=\"\",\"\",'MYO Ön Değ.'!E52)","v":""},{"$f":"IF('MYO Ön Değ.'!F52=\"\",\"\",'MYO Ön Değ.'!F52)","v":""},{"$f":"IF('MYO Ön Değ.'!G52=\"\",\"\",'MYO Ön Değ.'!G52)","v":""},{"$f":"IF('MYO Ön Değ.'!H52=\"\",\"\",'MYO Ön Değ.'!H52)","v":""},{"$f":"IF('MYO Ön Değ.'!I52=\"\",\"\",'MYO Ön Değ.'!I52)","v":""},{"$f":"IF('MYO Ön Değ.'!J52=\"\",\"\",'MYO Ön Değ.'!J52)","v":""},{"$f":"IF('MYO Ön Değ.'!K52=\"\",\"\",'MYO Ön Değ.'!K52)","v":""},{"$f":"IF('MYO Ön Değ.'!L52=\"\",\"\",'MYO Ön Değ.'!L52)","v":""}]
[{"$f":"IF('MYO Ön Değ.'!A53=\"\",\"\",'MYO Ön Değ.'!A53)","v":""},{"$f":"IF('MYO Ön Değ.'!B53=\"\",\"\",LEFT('MYO Ön Değ.'!B53,3)&REPT(\"*\",4)&RIGHT('MYO Ön Değ.'!B53,2))","v":""},{"$f":"IF('MYO Ön Değ.'!C53=\"\",\"\",IF(ISERR(FIND(\" \",'MYO Ön Değ.'!C53))=TRUE,LEFT('MYO Ön Değ.'!C53,2)&REPT(\"*\",3),LEFT('MYO Ön Değ.'!C53,2)&REPT(\"*\",3)&\" \"&MID('MYO Ön Değ.'!C53,FIND(\" \",'MYO Ön Değ.'!C53)+1,2)&REPT(\"*\",3)))","v":""},{"$f":"IF('MYO Ön Değ.'!D53=\"\",\"\",IF(ISERR(FIND(\" \",'MYO Ön Değ.'!D53))=TRUE,LEFT('MYO Ön Değ.'!D53,2)&REPT(\"*\",3),LEFT('MYO Ön Değ.'!D53,2)&REPT(\"*\",3)&\" \"&MID('MYO Ön Değ.'!D53,FIND(\" \",'MYO Ön Değ.'!D53)+1,2)&REPT(\"*\",3)))","v":""},{"$f":"IF('MYO Ön Değ.'!E53=\"\",\"\",'MYO Ön Değ.'!E53)","v":""},{"$f":"IF('MYO Ön Değ.'!F53=\"\",\"\",'MYO Ön Değ.'!F53)","v":""},{"$f":"IF('MYO Ön Değ.'!G53=\"\",\"\",'MYO Ön Değ.'!G53)","v":""},{"$f":"IF('MYO Ön Değ.'!H53=\"\",\"\",'MYO Ön Değ.'!H53)","v":""},{"$f":"IF('MYO Ön Değ.'!I53=\"\",\"\",'MYO Ön Değ.'!I53)","v":""},{"$f":"IF('MYO Ön Değ.'!J53=\"\",\"\",'MYO Ön Değ.'!J53)","v":""},{"$f":"IF('MYO Ön Değ.'!K53=\"\",\"\",'MYO Ön Değ.'!K53)","v":""},{"$f":"IF('MYO Ön Değ.'!L53=\"\",\"\",'MYO Ön Değ.'!L53)","v":""}]
[{"$f":"IF('MYO Ön Değ.'!A54=\"\",\"\",'MYO Ön Değ.'!A54)","v":""},{"$f":"IF('MYO Ön Değ.'!B54=\"\",\"\",LEFT('MYO Ön Değ.'!B54,3)&REPT(\"*\",4)&RIGHT('MYO Ön Değ.'!B54,2))","v":""},{"$f":"IF('MYO Ön Değ.'!C54=\"\",\"\",IF(ISERR(FIND(\" \",'MYO Ön Değ.'!C54))=TRUE,LEFT('MYO Ön Değ.'!C54,2)&REPT(\"*\",3),LEFT('MYO Ön Değ.'!C54,2)&REPT(\"*\",3)&\" \"&MID('MYO Ön Değ.'!C54,FIND(\" \",'MYO Ön Değ.'!C54)+1,2)&REPT(\"*\",3)))","v":""},{"$f":"IF('MYO Ön Değ.'!D54=\"\",\"\",IF(ISERR(FIND(\" \",'MYO Ön Değ.'!D54))=TRUE,LEFT('MYO Ön Değ.'!D54,2)&REPT(\"*\",3),LEFT('MYO Ön Değ.'!D54,2)&REPT(\"*\",3)&\" \"&MID('MYO Ön Değ.'!D54,FIND(\" \",'MYO Ön Değ.'!D54)+1,2)&REPT(\"*\",3)))","v":""},{"$f":"IF('MYO Ön Değ.'!E54=\"\",\"\",'MYO Ön Değ.'!E54)","v":""},{"$f":"IF('MYO Ön Değ.'!F54=\"\",\"\",'MYO Ön Değ.'!F54)","v":""},{"$f":"IF('MYO Ön Değ.'!G54=\"\",\"\",'MYO Ön Değ.'!G54)","v":""},{"$f":"IF('MYO Ön Değ.'!H54=\"\",\"\",'MYO Ön Değ.'!H54)","v":""},{"$f":"IF('MYO Ön Değ.'!I54=\"\",\"\",'MYO Ön Değ.'!I54)","v":""},{"$f":"IF('MYO Ön Değ.'!J54=\"\",\"\",'MYO Ön Değ.'!J54)","v":""},{"$f":"IF('MYO Ön Değ.'!K54=\"\",\"\",'MYO Ön Değ.'!K54)","v":""},{"$f":"IF('MYO Ön Değ.'!L54=\"\",\"\",'MYO Ön Değ.'!L54)","v":""}]
[{"$f":"IF('MYO Ön Değ.'!A55=\"\",\"\",'MYO Ön Değ.'!A55)","v":""},{"$f":"IF('MYO Ön Değ.'!B55=\"\",\"\",LEFT('MYO Ön Değ.'!B55,3)&REPT(\"*\",4)&RIGHT('MYO Ön Değ.'!B55,2))","v":""},{"$f":"IF('MYO Ön Değ.'!C55=\"\",\"\",IF(ISERR(FIND(\" \",'MYO Ön Değ.'!C55))=TRUE,LEFT('MYO Ön Değ.'!C55,2)&REPT(\"*\",3),LEFT('MYO Ön Değ.'!C55,2)&REPT(\"*\",3)&\" \"&MID('MYO Ön Değ.'!C55,FIND(\" \",'MYO Ön Değ.'!C55)+1,2)&REPT(\"*\",3)))","v":""},{"$f":"IF('MYO Ön Değ.'!D55=\"\",\"\",IF(ISERR(FIND(\" \",'MYO Ön Değ.'!D55))=TRUE,LEFT('MYO Ön Değ.'!D55,2)&REPT(\"*\",3),LEFT('MYO Ön Değ.'!D55,2)&REPT(\"*\",3)&\" \"&MID('MYO Ön Değ.'!D55,FIND(\" \",'MYO Ön Değ.'!D55)+1,2)&REPT(\"*\",3)))","v":""},{"$f":"IF('MYO Ön Değ.'!E55=\"\",\"\",'MYO Ön Değ.'!E55)","v":""},{"$f":"IF('MYO Ön Değ.'!F55=\"\",\"\",'MYO Ön Değ.'!F55)","v":""},{"$f":"IF('MYO Ön Değ.'!G55=\"\",\"\",'MYO Ön Değ.'!G55)","v":""},{"$f":"IF('MYO Ön Değ.'!H55=\"\",\"\",'MYO Ön Değ.'!H55)","v":""},{"$f":"IF('MYO Ön Değ.'!I55=\"\",\"\",'MYO Ön Değ.'!I55)","v":""},{"$f":"IF('MYO Ön Değ.'!J55=\"\",\"\",'MYO Ön Değ.'!J55)","v":""},{"$f":"IF('MYO Ön Değ.'!K55=\"\",\"\",'MYO Ön Değ.'!K55)","v":""},{"$f":"IF('MYO Ön Değ.'!L55=\"\",\"\",'MYO Ön Değ.'!L55)","v":""}]
[{"$f":"IF('MYO Ön Değ.'!A56=\"\",\"\",'MYO Ön Değ.'!A56)","v":""},{"$f":"IF('MYO Ön Değ.'!B56=\"\",\"\",LEFT('MYO Ön Değ.'!B56,3)&REPT(\"*\",4)&RIGHT('MYO Ön Değ.'!B56,2))","v":""},{"$f":"IF('MYO Ön Değ.'!C56=\"\",\"\",IF(ISERR(FIND(\" \",'MYO Ön Değ.'!C56))=TRUE,LEFT('MYO Ön Değ.'!C56,2)&REPT(\"*\",3),LEFT('MYO Ön Değ.'!C56,2)&REPT(\"*\",3)&\" \"&MID('MYO Ön Değ.'!C56,FIND(\" \",'MYO Ön Değ.'!C56)+1,2)&REPT(\"*\",3)))","v":""},{"$f":"IF('MYO Ön Değ.'!D56=\"\",\"\",IF(ISERR(FIND(\" \",'MYO Ön Değ.'!D56))=TRUE,LEFT('MYO Ön Değ.'!D56,2)&REPT(\"*\",3),LEFT('MYO Ön Değ.'!D56,2)&REPT(\"*\",3)&\" \"&MID('MYO Ön Değ.'!D56,FIND(\" \",'MYO Ön Değ.'!D56)+1,2)&REPT(\"*\",3)))","v":""},{"$f":"IF('MYO Ön Değ.'!E56=\"\",\"\",'MYO Ön Değ.'!E56)","v":""},{"$f":"IF('MYO Ön Değ.'!F56=\"\",\"\",'MYO Ön Değ.'!F56)","v":""},{"$f":"IF('MYO Ön Değ.'!G56=\"\",\"\",'MYO Ön Değ.'!G56)","v":""},{"$f":"IF('MYO Ön Değ.'!H56=\"\",\"\",'MYO Ön Değ.'!H56)","v":""},{"$f":"IF('MYO Ön Değ.'!I56=\"\",\"\",'MYO Ön Değ.'!I56)","v":""},{"$f":"IF('MYO Ön Değ.'!J56=\"\",\"\",'MYO Ön Değ.'!J56)","v":""},{"$f":"IF('MYO Ön Değ.'!K56=\"\",\"\",'MYO Ön Değ.'!K56)","v":""},{"$f":"IF('MYO Ön Değ.'!L56=\"\",\"\",'MYO Ön Değ.'!L56)","v":""}]
[{"$f":"IF('MYO Ön Değ.'!A57=\"\",\"\",'MYO Ön Değ.'!A57)","v":""},{"$f":"IF('MYO Ön Değ.'!B57=\"\",\"\",LEFT('MYO Ön Değ.'!B57,3)&REPT(\"*\",4)&RIGHT('MYO Ön Değ.'!B57,2))","v":""},{"$f":"IF('MYO Ön Değ.'!C57=\"\",\"\",IF(ISERR(FIND(\" \",'MYO Ön Değ.'!C57))=TRUE,LEFT('MYO Ön Değ.'!C57,2)&REPT(\"*\",3),LEFT('MYO Ön Değ.'!C57,2)&REPT(\"*\",3)&\" \"&MID('MYO Ön Değ.'!C57,FIND(\" \",'MYO Ön Değ.'!C57)+1,2)&REPT(\"*\",3)))","v":""},{"$f":"IF('MYO Ön Değ.'!D57=\"\",\"\",IF(ISERR(FIND(\" \",'MYO Ön Değ.'!D57))=TRUE,LEFT('MYO Ön Değ.'!D57,2)&REPT(\"*\",3),LEFT('MYO Ön Değ.'!D57,2)&REPT(\"*\",3)&\" \"&MID('MYO Ön Değ.'!D57,FIND(\" \",'MYO Ön Değ.'!D57)+1,2)&REPT(\"*\",3)))","v":""},{"$f":"IF('MYO Ön Değ.'!E57=\"\",\"\",'MYO Ön Değ.'!E57)","v":""},{"$f":"IF('MYO Ön Değ.'!F57=\"\",\"\",'MYO Ön Değ.'!F57)","v":""},{"$f":"IF('MYO Ön Değ.'!G57=\"\",\"\",'MYO Ön Değ.'!G57)","v":""},{"$f":"IF('MYO Ön Değ.'!H57=\"\",\"\",'MYO Ön Değ.'!H57)","v":""},{"$f":"IF('MYO Ön Değ.'!I57=\"\",\"\",'MYO Ön Değ.'!I57)","v":""},{"$f":"IF('MYO Ön Değ.'!J57=\"\",\"\",'MYO Ön Değ.'!J57)","v":""},{"$f":"IF('MYO Ön Değ.'!K57=\"\",\"\",'MYO Ön Değ.'!K57)","v":""},{"$f":"IF('MYO Ön Değ.'!L57=\"\",\"\",'MYO Ön Değ.'!L57)","v":""}]
[{"$f":"IF('MYO Ön Değ.'!A58=\"\",\"\",'MYO Ön Değ.'!A58)","v":""},{"$f":"IF('MYO Ön Değ.'!B58=\"\",\"\",LEFT('MYO Ön Değ.'!B58,3)&REPT(\"*\",4)&RIGHT('MYO Ön Değ.'!B58,2))","v":""},{"$f":"IF('MYO Ön Değ.'!C58=\"\",\"\",IF(ISERR(FIND(\" \",'MYO Ön Değ.'!C58))=TRUE,LEFT('MYO Ön Değ.'!C58,2)&REPT(\"*\",3),LEFT('MYO Ön Değ.'!C58,2)&REPT(\"*\",3)&\" \"&MID('MYO Ön Değ.'!C58,FIND(\" \",'MYO Ön Değ.'!C58)+1,2)&REPT(\"*\",3)))","v":""},{"$f":"IF('MYO Ön Değ.'!D58=\"\",\"\",IF(ISERR(FIND(\" \",'MYO Ön Değ.'!D58))=TRUE,LEFT('MYO Ön Değ.'!D58,2)&REPT(\"*\",3),LEFT('MYO Ön Değ.'!D58,2)&REPT(\"*\",3)&\" \"&MID('MYO Ön Değ.'!D58,FIND(\" \",'MYO Ön Değ.'!D58)+1,2)&REPT(\"*\",3)))","v":""},{"$f":"IF('MYO Ön Değ.'!E58=\"\",\"\",'MYO Ön Değ.'!E58)","v":""},{"$f":"IF('MYO Ön Değ.'!F58=\"\",\"\",'MYO Ön Değ.'!F58)","v":""},{"$f":"IF('MYO Ön Değ.'!G58=\"\",\"\",'MYO Ön Değ.'!G58)","v":""},{"$f":"IF('MYO Ön Değ.'!H58=\"\",\"\",'MYO Ön Değ.'!H58)","v":""},{"$f":"IF('MYO Ön Değ.'!I58=\"\",\"\",'MYO Ön Değ.'!I58)","v":""},{"$f":"IF('MYO Ön Değ.'!J58=\"\",\"\",'MYO Ön Değ.'!J58)","v":""},{"$f":"IF('MYO Ön Değ.'!K58=\"\",\"\",'MYO Ön Değ.'!K58)","v":""},{"$f":"IF('MYO Ön Değ.'!L58=\"\",\"\",'MYO Ön Değ.'!L58)","v":""}]
[{"$f":"IF('MYO Ön Değ.'!A59=\"\",\"\",'MYO Ön Değ.'!A59)","v":""},{"$f":"IF('MYO Ön Değ.'!B59=\"\",\"\",LEFT('MYO Ön Değ.'!B59,3)&REPT(\"*\",4)&RIGHT('MYO Ön Değ.'!B59,2))","v":""},{"$f":"IF('MYO Ön Değ.'!C59=\"\",\"\",IF(ISERR(FIND(\" \",'MYO Ön Değ.'!C59))=TRUE,LEFT('MYO Ön Değ.'!C59,2)&REPT(\"*\",3),LEFT('MYO Ön Değ.'!C59,2)&REPT(\"*\",3)&\" \"&MID('MYO Ön Değ.'!C59,FIND(\" \",'MYO Ön Değ.'!C59)+1,2)&REPT(\"*\",3)))","v":""},{"$f":"IF('MYO Ön Değ.'!D59=\"\",\"\",IF(ISERR(FIND(\" \",'MYO Ön Değ.'!D59))=TRUE,LEFT('MYO Ön Değ.'!D59,2)&REPT(\"*\",3),LEFT('MYO Ön Değ.'!D59,2)&REPT(\"*\",3)&\" \"&MID('MYO Ön Değ.'!D59,FIND(\" \",'MYO Ön Değ.'!D59)+1,2)&REPT(\"*\",3)))","v":""},{"$f":"IF('MYO Ön Değ.'!E59=\"\",\"\",'MYO Ön Değ.'!E59)","v":""},{"$f":"IF('MYO Ön Değ.'!F59=\"\",\"\",'MYO Ön Değ.'!F59)","v":""},{"$f":"IF('MYO Ön Değ.'!G59=\"\",\"\",'MYO Ön Değ.'!G59)","v":""},{"$f":"IF('MYO Ön Değ.'!H59=\"\",\"\",'MYO Ön Değ.'!H59)","v":""},{"$f":"IF('MYO Ön Değ.'!I59=\"\",\"\",'MYO Ön Değ.'!I59)","v":""},{"$f":"IF('MYO Ön Değ.'!J59=\"\",\"\",'MYO Ön Değ.'!J59)","v":""},{"$f":"IF('MYO Ön Değ.'!K59=\"\",\"\",'MYO Ön Değ.'!K59)","v":""},{"$f":"IF('MYO Ön Değ.'!L59=\"\",\"\",'MYO Ön Değ.'!L59)","v":""}]
[{"$f":"IF('MYO Ön Değ.'!A60=\"\",\"\",'MYO Ön Değ.'!A60)","v":""},{"$f":"IF('MYO Ön Değ.'!B60=\"\",\"\",LEFT('MYO Ön Değ.'!B60,3)&REPT(\"*\",4)&RIGHT('MYO Ön Değ.'!B60,2))","v":""},{"$f":"IF('MYO Ön Değ.'!C60=\"\",\"\",IF(ISERR(FIND(\" \",'MYO Ön Değ.'!C60))=TRUE,LEFT('MYO Ön Değ.'!C60,2)&REPT(\"*\",3),LEFT('MYO Ön Değ.'!C60,2)&REPT(\"*\",3)&\" \"&MID('MYO Ön Değ.'!C60,FIND(\" \",'MYO Ön Değ.'!C60)+1,2)&REPT(\"*\",3)))","v":""},{"$f":"IF('MYO Ön Değ.'!D60=\"\",\"\",IF(ISERR(FIND(\" \",'MYO Ön Değ.'!D60))=TRUE,LEFT('MYO Ön Değ.'!D60,2)&REPT(\"*\",3),LEFT('MYO Ön Değ.'!D60,2)&REPT(\"*\",3)&\" \"&MID('MYO Ön Değ.'!D60,FIND(\" \",'MYO Ön Değ.'!D60)+1,2)&REPT(\"*\",3)))","v":""},{"$f":"IF('MYO Ön Değ.'!E60=\"\",\"\",'MYO Ön Değ.'!E60)","v":""},{"$f":"IF('MYO Ön Değ.'!F60=\"\",\"\",'MYO Ön Değ.'!F60)","v":""},{"$f":"IF('MYO Ön Değ.'!G60=\"\",\"\",'MYO Ön Değ.'!G60)","v":""},{"$f":"IF('MYO Ön Değ.'!H60=\"\",\"\",'MYO Ön Değ.'!H60)","v":""},{"$f":"IF('MYO Ön Değ.'!I60=\"\",\"\",'MYO Ön Değ.'!I60)","v":""},{"$f":"IF('MYO Ön Değ.'!J60=\"\",\"\",'MYO Ön Değ.'!J60)","v":""},{"$f":"IF('MYO Ön Değ.'!K60=\"\",\"\",'MYO Ön Değ.'!K60)","v":""},{"$f":"IF('MYO Ön Değ.'!L60=\"\",\"\",'MYO Ön Değ.'!L60)","v":""}]
[{"$f":"IF('MYO Ön Değ.'!A61=\"\",\"\",'MYO Ön Değ.'!A61)","v":""},{"$f":"IF('MYO Ön Değ.'!B61=\"\",\"\",LEFT('MYO Ön Değ.'!B61,3)&REPT(\"*\",4)&RIGHT('MYO Ön Değ.'!B61,2))","v":""},{"$f":"IF('MYO Ön Değ.'!C61=\"\",\"\",IF(ISERR(FIND(\" \",'MYO Ön Değ.'!C61))=TRUE,LEFT('MYO Ön Değ.'!C61,2)&REPT(\"*\",3),LEFT('MYO Ön Değ.'!C61,2)&REPT(\"*\",3)&\" \"&MID('MYO Ön Değ.'!C61,FIND(\" \",'MYO Ön Değ.'!C61)+1,2)&REPT(\"*\",3)))","v":""},{"$f":"IF('MYO Ön Değ.'!D61=\"\",\"\",IF(ISERR(FIND(\" \",'MYO Ön Değ.'!D61))=TRUE,LEFT('MYO Ön Değ.'!D61,2)&REPT(\"*\",3),LEFT('MYO Ön Değ.'!D61,2)&REPT(\"*\",3)&\" \"&MID('MYO Ön Değ.'!D61,FIND(\" \",'MYO Ön Değ.'!D61)+1,2)&REPT(\"*\",3)))","v":""},{"$f":"IF('MYO Ön Değ.'!E61=\"\",\"\",'MYO Ön Değ.'!E61)","v":""},{"$f":"IF('MYO Ön Değ.'!F61=\"\",\"\",'MYO Ön Değ.'!F61)","v":""},{"$f":"IF('MYO Ön Değ.'!G61=\"\",\"\",'MYO Ön Değ.'!G61)","v":""},{"$f":"IF('MYO Ön Değ.'!H61=\"\",\"\",'MYO Ön Değ.'!H61)","v":""},{"$f":"IF('MYO Ön Değ.'!I61=\"\",\"\",'MYO Ön Değ.'!I61)","v":""},{"$f":"IF('MYO Ön Değ.'!J61=\"\",\"\",'MYO Ön Değ.'!J61)","v":""},{"$f":"IF('MYO Ön Değ.'!K61=\"\",\"\",'MYO Ön Değ.'!K61)","v":""},{"$f":"IF('MYO Ön Değ.'!L61=\"\",\"\",'MYO Ön Değ.'!L61)","v":""}]
[{"$f":"IF('MYO Ön Değ.'!A62=\"\",\"\",'MYO Ön Değ.'!A62)","v":""},{"$f":"IF('MYO Ön Değ.'!B62=\"\",\"\",LEFT('MYO Ön Değ.'!B62,3)&REPT(\"*\",4)&RIGHT('MYO Ön Değ.'!B62,2))","v":""},{"$f":"IF('MYO Ön Değ.'!C62=\"\",\"\",IF(ISERR(FIND(\" \",'MYO Ön Değ.'!C62))=TRUE,LEFT('MYO Ön Değ.'!C62,2)&REPT(\"*\",3),LEFT('MYO Ön Değ.'!C62,2)&REPT(\"*\",3)&\" \"&MID('MYO Ön Değ.'!C62,FIND(\" \",'MYO Ön Değ.'!C62)+1,2)&REPT(\"*\",3)))","v":""},{"$f":"IF('MYO Ön Değ.'!D62=\"\",\"\",IF(ISERR(FIND(\" \",'MYO Ön Değ.'!D62))=TRUE,LEFT('MYO Ön Değ.'!D62,2)&REPT(\"*\",3),LEFT('MYO Ön Değ.'!D62,2)&REPT(\"*\",3)&\" \"&MID('MYO Ön Değ.'!D62,FIND(\" \",'MYO Ön Değ.'!D62)+1,2)&REPT(\"*\",3)))","v":""},{"$f":"IF('MYO Ön Değ.'!E62=\"\",\"\",'MYO Ön Değ.'!E62)","v":""},{"$f":"IF('MYO Ön Değ.'!F62=\"\",\"\",'MYO Ön Değ.'!F62)","v":""},{"$f":"IF('MYO Ön Değ.'!G62=\"\",\"\",'MYO Ön Değ.'!G62)","v":""},{"$f":"IF('MYO Ön Değ.'!H62=\"\",\"\",'MYO Ön Değ.'!H62)","v":""},{"$f":"IF('MYO Ön Değ.'!I62=\"\",\"\",'MYO Ön Değ.'!I62)","v":""},{"$f":"IF('MYO Ön Değ.'!J62=\"\",\"\",'MYO Ön Değ.'!J62)","v":""},{"$f":"IF('MYO Ön Değ.'!K62=\"\",\"\",'MYO Ön Değ.'!K62)","v":""},{"$f":"IF('MYO Ön Değ.'!L62=\"\",\"\",'MYO Ön Değ.'!L62)","v":""}]
[{"$f":"IF('MYO Ön Değ.'!A63=\"\",\"\",'MYO Ön Değ.'!A63)","v":""},{"$f":"IF('MYO Ön Değ.'!B63=\"\",\"\",LEFT('MYO Ön Değ.'!B63,3)&REPT(\"*\",4)&RIGHT('MYO Ön Değ.'!B63,2))","v":""},{"$f":"IF('MYO Ön Değ.'!C63=\"\",\"\",IF(ISERR(FIND(\" \",'MYO Ön Değ.'!C63))=TRUE,LEFT('MYO Ön Değ.'!C63,2)&REPT(\"*\",3),LEFT('MYO Ön Değ.'!C63,2)&REPT(\"*\",3)&\" \"&MID('MYO Ön Değ.'!C63,FIND(\" \",'MYO Ön Değ.'!C63)+1,2)&REPT(\"*\",3)))","v":""},{"$f":"IF('MYO Ön Değ.'!D63=\"\",\"\",IF(ISERR(FIND(\" \",'MYO Ön Değ.'!D63))=TRUE,LEFT('MYO Ön Değ.'!D63,2)&REPT(\"*\",3),LEFT('MYO Ön Değ.'!D63,2)&REPT(\"*\",3)&\" \"&MID('MYO Ön Değ.'!D63,FIND(\" \",'MYO Ön Değ.'!D63)+1,2)&REPT(\"*\",3)))","v":""},{"$f":"IF('MYO Ön Değ.'!E63=\"\",\"\",'MYO Ön Değ.'!E63)","v":""},{"$f":"IF('MYO Ön Değ.'!F63=\"\",\"\",'MYO Ön Değ.'!F63)","v":""},{"$f":"IF('MYO Ön Değ.'!G63=\"\",\"\",'MYO Ön Değ.'!G63)","v":""},{"$f":"IF('MYO Ön Değ.'!H63=\"\",\"\",'MYO Ön Değ.'!H63)","v":""},{"$f":"IF('MYO Ön Değ.'!I63=\"\",\"\",'MYO Ön Değ.'!I63)","v":""},{"$f":"IF('MYO Ön Değ.'!J63=\"\",\"\",'MYO Ön Değ.'!J63)","v":""},{"$f":"IF('MYO Ön Değ.'!K63=\"\",\"\",'MYO Ön Değ.'!K63)","v":""},{"$f":"IF('MYO Ön Değ.'!L63=\"\",\"\",'MYO Ön Değ.'!L63)","v":""}]
[{"$f":"IF('MYO Ön Değ.'!A64=\"\",\"\",'MYO Ön Değ.'!A64)","v":""},{"$f":"IF('MYO Ön Değ.'!B64=\"\",\"\",LEFT('MYO Ön Değ.'!B64,3)&REPT(\"*\",4)&RIGHT('MYO Ön Değ.'!B64,2))","v":""},{"$f":"IF('MYO Ön Değ.'!C64=\"\",\"\",IF(ISERR(FIND(\" \",'MYO Ön Değ.'!C64))=TRUE,LEFT('MYO Ön Değ.'!C64,2)&REPT(\"*\",3),LEFT('MYO Ön Değ.'!C64,2)&REPT(\"*\",3)&\" \"&MID('MYO Ön Değ.'!C64,FIND(\" \",'MYO Ön Değ.'!C64)+1,2)&REPT(\"*\",3)))","v":""},{"$f":"IF('MYO Ön Değ.'!D64=\"\",\"\",IF(ISERR(FIND(\" \",'MYO Ön Değ.'!D64))=TRUE,LEFT('MYO Ön Değ.'!D64,2)&REPT(\"*\",3),LEFT('MYO Ön Değ.'!D64,2)&REPT(\"*\",3)&\" \"&MID('MYO Ön Değ.'!D64,FIND(\" \",'MYO Ön Değ.'!D64)+1,2)&REPT(\"*\",3)))","v":""},{"$f":"IF('MYO Ön Değ.'!E64=\"\",\"\",'MYO Ön Değ.'!E64)","v":""},{"$f":"IF('MYO Ön Değ.'!F64=\"\",\"\",'MYO Ön Değ.'!F64)","v":""},{"$f":"IF('MYO Ön Değ.'!G64=\"\",\"\",'MYO Ön Değ.'!G64)","v":""},{"$f":"IF('MYO Ön Değ.'!H64=\"\",\"\",'MYO Ön Değ.'!H64)","v":""},{"$f":"IF('MYO Ön Değ.'!I64=\"\",\"\",'MYO Ön Değ.'!I64)","v":""},{"$f":"IF('MYO Ön Değ.'!J64=\"\",\"\",'MYO Ön Değ.'!J64)","v":""},{"$f":"IF('MYO Ön Değ.'!K64=\"\",\"\",'MYO Ön Değ.'!K64)","v":""},{"$f":"IF('MYO Ön Değ.'!L64=\"\",\"\",'MYO Ön Değ.'!L64)","v":""}]
[{"$f":"IF('MYO Ön Değ.'!A65=\"\",\"\",'MYO Ön Değ.'!A65)","v":""},{"$f":"IF('MYO Ön Değ.'!B65=\"\",\"\",LEFT('MYO Ön Değ.'!B65,3)&REPT(\"*\",4)&RIGHT('MYO Ön Değ.'!B65,2))","v":""},{"$f":"IF('MYO Ön Değ.'!C65=\"\",\"\",IF(ISERR(FIND(\" \",'MYO Ön Değ.'!C65))=TRUE,LEFT('MYO Ön Değ.'!C65,2)&REPT(\"*\",3),LEFT('MYO Ön Değ.'!C65,2)&REPT(\"*\",3)&\" \"&MID('MYO Ön Değ.'!C65,FIND(\" \",'MYO Ön Değ.'!C65)+1,2)&REPT(\"*\",3)))","v":""},{"$f":"IF('MYO Ön Değ.'!D65=\"\",\"\",IF(ISERR(FIND(\" \",'MYO Ön Değ.'!D65))=TRUE,LEFT('MYO Ön Değ.'!D65,2)&REPT(\"*\",3),LEFT('MYO Ön Değ.'!D65,2)&REPT(\"*\",3)&\" \"&MID('MYO Ön Değ.'!D65,FIND(\" \",'MYO Ön Değ.'!D65)+1,2)&REPT(\"*\",3)))","v":""},{"$f":"IF('MYO Ön Değ.'!E65=\"\",\"\",'MYO Ön Değ.'!E65)","v":""},{"$f":"IF('MYO Ön Değ.'!F65=\"\",\"\",'MYO Ön Değ.'!F65)","v":""},{"$f":"IF('MYO Ön Değ.'!G65=\"\",\"\",'MYO Ön Değ.'!G65)","v":""},{"$f":"IF('MYO Ön Değ.'!H65=\"\",\"\",'MYO Ön Değ.'!H65)","v":""},{"$f":"IF('MYO Ön Değ.'!I65=\"\",\"\",'MYO Ön Değ.'!I65)","v":""},{"$f":"IF('MYO Ön Değ.'!J65=\"\",\"\",'MYO Ön Değ.'!J65)","v":""},{"$f":"IF('MYO Ön Değ.'!K65=\"\",\"\",'MYO Ön Değ.'!K65)","v":""},{"$f":"IF('MYO Ön Değ.'!L65=\"\",\"\",'MYO Ön Değ.'!L65)","v":""}]
[{"$f":"IF('MYO Ön Değ.'!A66=\"\",\"\",'MYO Ön Değ.'!A66)","v":""},{"$f":"IF('MYO Ön Değ.'!B66=\"\",\"\",LEFT('MYO Ön Değ.'!B66,3)&REPT(\"*\",4)&RIGHT('MYO Ön Değ.'!B66,2))","v":""},{"$f":"IF('MYO Ön Değ.'!C66=\"\",\"\",IF(ISERR(FIND(\" \",'MYO Ön Değ.'!C66))=TRUE,LEFT('MYO Ön Değ.'!C66,2)&REPT(\"*\",3),LEFT('MYO Ön Değ.'!C66,2)&REPT(\"*\",3)&\" \"&MID('MYO Ön Değ.'!C66,FIND(\" \",'MYO Ön Değ.'!C66)+1,2)&REPT(\"*\",3)))","v":""},{"$f":"IF('MYO Ön Değ.'!D66=\"\",\"\",IF(ISERR(FIND(\" \",'MYO Ön Değ.'!D66))=TRUE,LEFT('MYO Ön Değ.'!D66,2)&REPT(\"*\",3),LEFT('MYO Ön Değ.'!D66,2)&REPT(\"*\",3)&\" \"&MID('MYO Ön Değ.'!D66,FIND(\" \",'MYO Ön Değ.'!D66)+1,2)&REPT(\"*\",3)))","v":""},{"$f":"IF('MYO Ön Değ.'!E66=\"\",\"\",'MYO Ön Değ.'!E66)","v":""},{"$f":"IF('MYO Ön Değ.'!F66=\"\",\"\",'MYO Ön Değ.'!F66)","v":""},{"$f":"IF('MYO Ön Değ.'!G66=\"\",\"\",'MYO Ön Değ.'!G66)","v":""},{"$f":"IF('MYO Ön Değ.'!H66=\"\",\"\",'MYO Ön Değ.'!H66)","v":""},{"$f":"IF('MYO Ön Değ.'!I66=\"\",\"\",'MYO Ön Değ.'!I66)","v":""},{"$f":"IF('MYO Ön Değ.'!J66=\"\",\"\",'MYO Ön Değ.'!J66)","v":""},{"$f":"IF('MYO Ön Değ.'!K66=\"\",\"\",'MYO Ön Değ.'!K66)","v":""},{"$f":"IF('MYO Ön Değ.'!L66=\"\",\"\",'MYO Ön Değ.'!L66)","v":""}]
[{"$f":"IF('MYO Ön Değ.'!A67=\"\",\"\",'MYO Ön Değ.'!A67)","v":""},{"$f":"IF('MYO Ön Değ.'!B67=\"\",\"\",LEFT('MYO Ön Değ.'!B67,3)&REPT(\"*\",4)&RIGHT('MYO Ön Değ.'!B67,2))","v":""},{"$f":"IF('MYO Ön Değ.'!C67=\"\",\"\",IF(ISERR(FIND(\" \",'MYO Ön Değ.'!C67))=TRUE,LEFT('MYO Ön Değ.'!C67,2)&REPT(\"*\",3),LEFT('MYO Ön Değ.'!C67,2)&REPT(\"*\",3)&\" \"&MID('MYO Ön Değ.'!C67,FIND(\" \",'MYO Ön Değ.'!C67)+1,2)&REPT(\"*\",3)))","v":""},{"$f":"IF('MYO Ön Değ.'!D67=\"\",\"\",IF(ISERR(FIND(\" \",'MYO Ön Değ.'!D67))=TRUE,LEFT('MYO Ön Değ.'!D67,2)&REPT(\"*\",3),LEFT('MYO Ön Değ.'!D67,2)&REPT(\"*\",3)&\" \"&MID('MYO Ön Değ.'!D67,FIND(\" \",'MYO Ön Değ.'!D67)+1,2)&REPT(\"*\",3)))","v":""},{"$f":"IF('MYO Ön Değ.'!E67=\"\",\"\",'MYO Ön Değ.'!E67)","v":""},{"$f":"IF('MYO Ön Değ.'!F67=\"\",\"\",'MYO Ön Değ.'!F67)","v":""},{"$f":"IF('MYO Ön Değ.'!G67=\"\",\"\",'MYO Ön Değ.'!G67)","v":""},{"$f":"IF('MYO Ön Değ.'!H67=\"\",\"\",'MYO Ön Değ.'!H67)","v":""},{"$f":"IF('MYO Ön Değ.'!I67=\"\",\"\",'MYO Ön Değ.'!I67)","v":""},{"$f":"IF('MYO Ön Değ.'!J67=\"\",\"\",'MYO Ön Değ.'!J67)","v":""},{"$f":"IF('MYO Ön Değ.'!K67=\"\",\"\",'MYO Ön Değ.'!K67)","v":""},{"$f":"IF('MYO Ön Değ.'!L67=\"\",\"\",'MYO Ön Değ.'!L67)","v":""}]
[{"$f":"IF('MYO Ön Değ.'!A68=\"\",\"\",'MYO Ön Değ.'!A68)","v":""},{"$f":"IF('MYO Ön Değ.'!B68=\"\",\"\",LEFT('MYO Ön Değ.'!B68,3)&REPT(\"*\",4)&RIGHT('MYO Ön Değ.'!B68,2))","v":""},{"$f":"IF('MYO Ön Değ.'!C68=\"\",\"\",IF(ISERR(FIND(\" \",'MYO Ön Değ.'!C68))=TRUE,LEFT('MYO Ön Değ.'!C68,2)&REPT(\"*\",3),LEFT('MYO Ön Değ.'!C68,2)&REPT(\"*\",3)&\" \"&MID('MYO Ön Değ.'!C68,FIND(\" \",'MYO Ön Değ.'!C68)+1,2)&REPT(\"*\",3)))","v":""},{"$f":"IF('MYO Ön Değ.'!D68=\"\",\"\",IF(ISERR(FIND(\" \",'MYO Ön Değ.'!D68))=TRUE,LEFT('MYO Ön Değ.'!D68,2)&REPT(\"*\",3),LEFT('MYO Ön Değ.'!D68,2)&REPT(\"*\",3)&\" \"&MID('MYO Ön Değ.'!D68,FIND(\" \",'MYO Ön Değ.'!D68)+1,2)&REPT(\"*\",3)))","v":""},{"$f":"IF('MYO Ön Değ.'!E68=\"\",\"\",'MYO Ön Değ.'!E68)","v":""},{"$f":"IF('MYO Ön Değ.'!F68=\"\",\"\",'MYO Ön Değ.'!F68)","v":""},{"$f":"IF('MYO Ön Değ.'!G68=\"\",\"\",'MYO Ön Değ.'!G68)","v":""},{"$f":"IF('MYO Ön Değ.'!H68=\"\",\"\",'MYO Ön Değ.'!H68)","v":""},{"$f":"IF('MYO Ön Değ.'!I68=\"\",\"\",'MYO Ön Değ.'!I68)","v":""},{"$f":"IF('MYO Ön Değ.'!J68=\"\",\"\",'MYO Ön Değ.'!J68)","v":""},{"$f":"IF('MYO Ön Değ.'!K68=\"\",\"\",'MYO Ön Değ.'!K68)","v":""},{"$f":"IF('MYO Ön Değ.'!L68=\"\",\"\",'MYO Ön Değ.'!L68)","v":""}]
[{"$f":"IF('MYO Ön Değ.'!A69=\"\",\"\",'MYO Ön Değ.'!A69)","v":""},{"$f":"IF('MYO Ön Değ.'!B69=\"\",\"\",LEFT('MYO Ön Değ.'!B69,3)&REPT(\"*\",4)&RIGHT('MYO Ön Değ.'!B69,2))","v":""},{"$f":"IF('MYO Ön Değ.'!C69=\"\",\"\",IF(ISERR(FIND(\" \",'MYO Ön Değ.'!C69))=TRUE,LEFT('MYO Ön Değ.'!C69,2)&REPT(\"*\",3),LEFT('MYO Ön Değ.'!C69,2)&REPT(\"*\",3)&\" \"&MID('MYO Ön Değ.'!C69,FIND(\" \",'MYO Ön Değ.'!C69)+1,2)&REPT(\"*\",3)))","v":""},{"$f":"IF('MYO Ön Değ.'!D69=\"\",\"\",IF(ISERR(FIND(\" \",'MYO Ön Değ.'!D69))=TRUE,LEFT('MYO Ön Değ.'!D69,2)&REPT(\"*\",3),LEFT('MYO Ön Değ.'!D69,2)&REPT(\"*\",3)&\" \"&MID('MYO Ön Değ.'!D69,FIND(\" \",'MYO Ön Değ.'!D69)+1,2)&REPT(\"*\",3)))","v":""},{"$f":"IF('MYO Ön Değ.'!E69=\"\",\"\",'MYO Ön Değ.'!E69)","v":""},{"$f":"IF('MYO Ön Değ.'!F69=\"\",\"\",'MYO Ön Değ.'!F69)","v":""},{"$f":"IF('MYO Ön Değ.'!G69=\"\",\"\",'MYO Ön Değ.'!G69)","v":""},{"$f":"IF('MYO Ön Değ.'!H69=\"\",\"\",'MYO Ön Değ.'!H69)","v":""},{"$f":"IF('MYO Ön Değ.'!I69=\"\",\"\",'MYO Ön Değ.'!I69)","v":""},{"$f":"IF('MYO Ön Değ.'!J69=\"\",\"\",'MYO Ön Değ.'!J69)","v":""},{"$f":"IF('MYO Ön Değ.'!K69=\"\",\"\",'MYO Ön Değ.'!K69)","v":""},{"$f":"IF('MYO Ön Değ.'!L69=\"\",\"\",'MYO Ön Değ.'!L69)","v":""}]
[{"$f":"IF('MYO Ön Değ.'!A70=\"\",\"\",'MYO Ön Değ.'!A70)","v":""},{"$f":"IF('MYO Ön Değ.'!B70=\"\",\"\",LEFT('MYO Ön Değ.'!B70,3)&REPT(\"*\",4)&RIGHT('MYO Ön Değ.'!B70,2))","v":""},{"$f":"IF('MYO Ön Değ.'!C70=\"\",\"\",IF(ISERR(FIND(\" \",'MYO Ön Değ.'!C70))=TRUE,LEFT('MYO Ön Değ.'!C70,2)&REPT(\"*\",3),LEFT('MYO Ön Değ.'!C70,2)&REPT(\"*\",3)&\" \"&MID('MYO Ön Değ.'!C70,FIND(\" \",'MYO Ön Değ.'!C70)+1,2)&REPT(\"*\",3)))","v":""},{"$f":"IF('MYO Ön Değ.'!D70=\"\",\"\",IF(ISERR(FIND(\" \",'MYO Ön Değ.'!D70))=TRUE,LEFT('MYO Ön Değ.'!D70,2)&REPT(\"*\",3),LEFT('MYO Ön Değ.'!D70,2)&REPT(\"*\",3)&\" \"&MID('MYO Ön Değ.'!D70,FIND(\" \",'MYO Ön Değ.'!D70)+1,2)&REPT(\"*\",3)))","v":""},{"$f":"IF('MYO Ön Değ.'!E70=\"\",\"\",'MYO Ön Değ.'!E70)","v":""},{"$f":"IF('MYO Ön Değ.'!F70=\"\",\"\",'MYO Ön Değ.'!F70)","v":""},{"$f":"IF('MYO Ön Değ.'!G70=\"\",\"\",'MYO Ön Değ.'!G70)","v":""},{"$f":"IF('MYO Ön Değ.'!H70=\"\",\"\",'MYO Ön Değ.'!H70)","v":""},{"$f":"IF('MYO Ön Değ.'!I70=\"\",\"\",'MYO Ön Değ.'!I70)","v":""},{"$f":"IF('MYO Ön Değ.'!J70=\"\",\"\",'MYO Ön Değ.'!J70)","v":""},{"$f":"IF('MYO Ön Değ.'!K70=\"\",\"\",'MYO Ön Değ.'!K70)","v":""},{"$f":"IF('MYO Ön Değ.'!L70=\"\",\"\",'MYO Ön Değ.'!L70)","v":""}]
[{"$f":"IF('MYO Ön Değ.'!A71=\"\",\"\",'MYO Ön Değ.'!A71)","v":""},{"$f":"IF('MYO Ön Değ.'!B71=\"\",\"\",LEFT('MYO Ön Değ.'!B71,3)&REPT(\"*\",4)&RIGHT('MYO Ön Değ.'!B71,2))","v":""},{"$f":"IF('MYO Ön Değ.'!C71=\"\",\"\",IF(ISERR(FIND(\" \",'MYO Ön Değ.'!C71))=TRUE,LEFT('MYO Ön Değ.'!C71,2)&REPT(\"*\",3),LEFT('MYO Ön Değ.'!C71,2)&REPT(\"*\",3)&\" \"&MID('MYO Ön Değ.'!C71,FIND(\" \",'MYO Ön Değ.'!C71)+1,2)&REPT(\"*\",3)))","v":""},{"$f":"IF('MYO Ön Değ.'!D71=\"\",\"\",IF(ISERR(FIND(\" \",'MYO Ön Değ.'!D71))=TRUE,LEFT('MYO Ön Değ.'!D71,2)&REPT(\"*\",3),LEFT('MYO Ön Değ.'!D71,2)&REPT(\"*\",3)&\" \"&MID('MYO Ön Değ.'!D71,FIND(\" \",'MYO Ön Değ.'!D71)+1,2)&REPT(\"*\",3)))","v":""},{"$f":"IF('MYO Ön Değ.'!E71=\"\",\"\",'MYO Ön Değ.'!E71)","v":""},{"$f":"IF('MYO Ön Değ.'!F71=\"\",\"\",'MYO Ön Değ.'!F71)","v":""},{"$f":"IF('MYO Ön Değ.'!G71=\"\",\"\",'MYO Ön Değ.'!G71)","v":""},{"$f":"IF('MYO Ön Değ.'!H71=\"\",\"\",'MYO Ön Değ.'!H71)","v":""},{"$f":"IF('MYO Ön Değ.'!I71=\"\",\"\",'MYO Ön Değ.'!I71)","v":""},{"$f":"IF('MYO Ön Değ.'!J71=\"\",\"\",'MYO Ön Değ.'!J71)","v":""},{"$f":"IF('MYO Ön Değ.'!K71=\"\",\"\",'MYO Ön Değ.'!K71)","v":""},{"$f":"IF('MYO Ön Değ.'!L71=\"\",\"\",'MYO Ön Değ.'!L71)","v":""}]
[{"$f":"IF('MYO Ön Değ.'!A72=\"\",\"\",'MYO Ön Değ.'!A72)","v":""},{"$f":"IF('MYO Ön Değ.'!B72=\"\",\"\",LEFT('MYO Ön Değ.'!B72,3)&REPT(\"*\",4)&RIGHT('MYO Ön Değ.'!B72,2))","v":""},{"$f":"IF('MYO Ön Değ.'!C72=\"\",\"\",IF(ISERR(FIND(\" \",'MYO Ön Değ.'!C72))=TRUE,LEFT('MYO Ön Değ.'!C72,2)&REPT(\"*\",3),LEFT('MYO Ön Değ.'!C72,2)&REPT(\"*\",3)&\" \"&MID('MYO Ön Değ.'!C72,FIND(\" \",'MYO Ön Değ.'!C72)+1,2)&REPT(\"*\",3)))","v":""},{"$f":"IF('MYO Ön Değ.'!D72=\"\",\"\",IF(ISERR(FIND(\" \",'MYO Ön Değ.'!D72))=TRUE,LEFT('MYO Ön Değ.'!D72,2)&REPT(\"*\",3),LEFT('MYO Ön Değ.'!D72,2)&REPT(\"*\",3)&\" \"&MID('MYO Ön Değ.'!D72,FIND(\" \",'MYO Ön Değ.'!D72)+1,2)&REPT(\"*\",3)))","v":""},{"$f":"IF('MYO Ön Değ.'!E72=\"\",\"\",'MYO Ön Değ.'!E72)","v":""},{"$f":"IF('MYO Ön Değ.'!F72=\"\",\"\",'MYO Ön Değ.'!F72)","v":""},{"$f":"IF('MYO Ön Değ.'!G72=\"\",\"\",'MYO Ön Değ.'!G72)","v":""},{"$f":"IF('MYO Ön Değ.'!H72=\"\",\"\",'MYO Ön Değ.'!H72)","v":""},{"$f":"IF('MYO Ön Değ.'!I72=\"\",\"\",'MYO Ön Değ.'!I72)","v":""},{"$f":"IF('MYO Ön Değ.'!J72=\"\",\"\",'MYO Ön Değ.'!J72)","v":""},{"$f":"IF('MYO Ön Değ.'!K72=\"\",\"\",'MYO Ön Değ.'!K72)","v":""},{"$f":"IF('MYO Ön Değ.'!L72=\"\",\"\",'MYO Ön Değ.'!L72)","v":""}]
[{"$f":"IF('MYO Ön Değ.'!A73=\"\",\"\",'MYO Ön Değ.'!A73)","v":""},{"$f":"IF('MYO Ön Değ.'!B73=\"\",\"\",LEFT('MYO Ön Değ.'!B73,3)&REPT(\"*\",4)&RIGHT('MYO Ön Değ.'!B73,2))","v":""},{"$f":"IF('MYO Ön Değ.'!C73=\"\",\"\",IF(ISERR(FIND(\" \",'MYO Ön Değ.'!C73))=TRUE,LEFT('MYO Ön Değ.'!C73,2)&REPT(\"*\",3),LEFT('MYO Ön Değ.'!C73,2)&REPT(\"*\",3)&\" \"&MID('MYO Ön Değ.'!C73,FIND(\" \",'MYO Ön Değ.'!C73)+1,2)&REPT(\"*\",3)))","v":""},{"$f":"IF('MYO Ön Değ.'!D73=\"\",\"\",IF(ISERR(FIND(\" \",'MYO Ön Değ.'!D73))=TRUE,LEFT('MYO Ön Değ.'!D73,2)&REPT(\"*\",3),LEFT('MYO Ön Değ.'!D73,2)&REPT(\"*\",3)&\" \"&MID('MYO Ön Değ.'!D73,FIND(\" \",'MYO Ön Değ.'!D73)+1,2)&REPT(\"*\",3)))","v":""},{"$f":"IF('MYO Ön Değ.'!E73=\"\",\"\",'MYO Ön Değ.'!E73)","v":""},{"$f":"IF('MYO Ön Değ.'!F73=\"\",\"\",'MYO Ön Değ.'!F73)","v":""},{"$f":"IF('MYO Ön Değ.'!G73=\"\",\"\",'MYO Ön Değ.'!G73)","v":""},{"$f":"IF('MYO Ön Değ.'!H73=\"\",\"\",'MYO Ön Değ.'!H73)","v":""},{"$f":"IF('MYO Ön Değ.'!I73=\"\",\"\",'MYO Ön Değ.'!I73)","v":""},{"$f":"IF('MYO Ön Değ.'!J73=\"\",\"\",'MYO Ön Değ.'!J73)","v":""},{"$f":"IF('MYO Ön Değ.'!K73=\"\",\"\",'MYO Ön Değ.'!K73)","v":""},{"$f":"IF('MYO Ön Değ.'!L73=\"\",\"\",'MYO Ön Değ.'!L73)","v":""}]
[{"$f":"IF('MYO Ön Değ.'!A74=\"\",\"\",'MYO Ön Değ.'!A74)","v":""},{"$f":"IF('MYO Ön Değ.'!B74=\"\",\"\",LEFT('MYO Ön Değ.'!B74,3)&REPT(\"*\",4)&RIGHT('MYO Ön Değ.'!B74,2))","v":""},{"$f":"IF('MYO Ön Değ.'!C74=\"\",\"\",IF(ISERR(FIND(\" \",'MYO Ön Değ.'!C74))=TRUE,LEFT('MYO Ön Değ.'!C74,2)&REPT(\"*\",3),LEFT('MYO Ön Değ.'!C74,2)&REPT(\"*\",3)&\" \"&MID('MYO Ön Değ.'!C74,FIND(\" \",'MYO Ön Değ.'!C74)+1,2)&REPT(\"*\",3)))","v":""},{"$f":"IF('MYO Ön Değ.'!D74=\"\",\"\",IF(ISERR(FIND(\" \",'MYO Ön Değ.'!D74))=TRUE,LEFT('MYO Ön Değ.'!D74,2)&REPT(\"*\",3),LEFT('MYO Ön Değ.'!D74,2)&REPT(\"*\",3)&\" \"&MID('MYO Ön Değ.'!D74,FIND(\" \",'MYO Ön Değ.'!D74)+1,2)&REPT(\"*\",3)))","v":""},{"$f":"IF('MYO Ön Değ.'!E74=\"\",\"\",'MYO Ön Değ.'!E74)","v":""},{"$f":"IF('MYO Ön Değ.'!F74=\"\",\"\",'MYO Ön Değ.'!F74)","v":""},{"$f":"IF('MYO Ön Değ.'!G74=\"\",\"\",'MYO Ön Değ.'!G74)","v":""},{"$f":"IF('MYO Ön Değ.'!H74=\"\",\"\",'MYO Ön Değ.'!H74)","v":""},{"$f":"IF('MYO Ön Değ.'!I74=\"\",\"\",'MYO Ön Değ.'!I74)","v":""},{"$f":"IF('MYO Ön Değ.'!J74=\"\",\"\",'MYO Ön Değ.'!J74)","v":""},{"$f":"IF('MYO Ön Değ.'!K74=\"\",\"\",'MYO Ön Değ.'!K74)","v":""},{"$f":"IF('MYO Ön Değ.'!L74=\"\",\"\",'MYO Ön Değ.'!L74)","v":""}]
[{"$f":"IF('MYO Ön Değ.'!A75=\"\",\"\",'MYO Ön Değ.'!A75)","v":""},{"$f":"IF('MYO Ön Değ.'!B75=\"\",\"\",LEFT('MYO Ön Değ.'!B75,3)&REPT(\"*\",4)&RIGHT('MYO Ön Değ.'!B75,2))","v":""},{"$f":"IF('MYO Ön Değ.'!C75=\"\",\"\",IF(ISERR(FIND(\" \",'MYO Ön Değ.'!C75))=TRUE,LEFT('MYO Ön Değ.'!C75,2)&REPT(\"*\",3),LEFT('MYO Ön Değ.'!C75,2)&REPT(\"*\",3)&\" \"&MID('MYO Ön Değ.'!C75,FIND(\" \",'MYO Ön Değ.'!C75)+1,2)&REPT(\"*\",3)))","v":""},{"$f":"IF('MYO Ön Değ.'!D75=\"\",\"\",IF(ISERR(FIND(\" \",'MYO Ön Değ.'!D75))=TRUE,LEFT('MYO Ön Değ.'!D75,2)&REPT(\"*\",3),LEFT('MYO Ön Değ.'!D75,2)&REPT(\"*\",3)&\" \"&MID('MYO Ön Değ.'!D75,FIND(\" \",'MYO Ön Değ.'!D75)+1,2)&REPT(\"*\",3)))","v":""},{"$f":"IF('MYO Ön Değ.'!E75=\"\",\"\",'MYO Ön Değ.'!E75)","v":""},{"$f":"IF('MYO Ön Değ.'!F75=\"\",\"\",'MYO Ön Değ.'!F75)","v":""},{"$f":"IF('MYO Ön Değ.'!G75=\"\",\"\",'MYO Ön Değ.'!G75)","v":""},{"$f":"IF('MYO Ön Değ.'!H75=\"\",\"\",'MYO Ön Değ.'!H75)","v":""},{"$f":"IF('MYO Ön Değ.'!I75=\"\",\"\",'MYO Ön Değ.'!I75)","v":""},{"$f":"IF('MYO Ön Değ.'!J75=\"\",\"\",'MYO Ön Değ.'!J75)","v":""},{"$f":"IF('MYO Ön Değ.'!K75=\"\",\"\",'MYO Ön Değ.'!K75)","v":""},{"$f":"IF('MYO Ön Değ.'!L75=\"\",\"\",'MYO Ön Değ.'!L75)","v":""}]

{"sheet":"MYO Sonuç","index":2,"n_rows":19,"n_cols":12,"rows_kept":19,"cut":false,"hidden":false,"merged":[[0,0,0,11],[1,0,1,11],[2,0,2,11],[3,0,3,11],[4,0,4,1],[4,2,4,3],[4,4,4,6],[4,7,4,11],[5,7,5,11],[6,7,6,11],[7,7,7,8],[7,9,7,10],[9,0,10,0],[9,10,10,10],[9,11,10,11],[5,0,5,1],[8,0,8,1],[8,2,8,11],[9,1,9,3],[9,4,9,5],[9,6,9,7],[9,8,9,9],[5,4,5,6],[6,4,6,6],[7,4,7,6],[5,2,5,3],[6,0,6,1],[6,2,6,3],[7,0,7,1],[7,2,7,3]]}
["T.C."]
["BAYBURT ÜNİVERSİTESİ"]
["GİRİŞ SINAVI SONUÇ TUTANAĞI"]
[" Üniversitemize bağlı birimlere, 2547 sayılı Kanunun ilgili maddeleri ve 09.11.2018 tarih ve 30590 sayılı Resmi Gazetede yayımlanan \"Öğretim Üyesi Dışındaki Öğretim Elemanı Kadrolarına Naklen veya Açıktan Yapılacak Atamalarda Uygulanacak Merkezi Sınav ile Giriş Sınavlarına İlişkin Usul ve Esaslar Hakkında Yönetmelik” 11. ve 12. maddeleri hükümleri uyarınca yapılan Giriş Sınavında başarılı olan adayların isimleri aşağıda belirtilmiştir."]
["İlan No:",null,null,null,"Birimi:",null,null,"….. Meslek Yüksekokulu"]
["İlan Tarihi:",null,"…/.../....",null,"Bölümü:",null,null,"….. Bölümü"]
["Kadro Unvanı:",null,"Öğretim Görevlisi",null,"Programı:",null,null,"….. Programı"]
["Kadro Adedi:",null,null,null,"Sınav Tarihi:",null,null,"…/.../....",null,"Sonuç Tarihi:",null,"…/.../...."]
["İlan Özel Şartı:"]
["Sıra No","Başvuranın",null,null,"ALES Puanı",null,"Lisans Mezuniyet Notu",null,"Giriş Sınavı",null,"(A+B+C) Değerlendirme Notu","Sonuç"]
[null,"T.C. Kimlik No","Adı","Soyadı","Puanı","(A) Puanın %35' i","100' lük Sistem ","(B) Notun %30' u","Giriş Sınav Notu","(C) Notunun %35' i"]
[1,11111111111,"Örnek","Örnek",82.513919999999999,{"$f":"E12*0.35","v":28.879871999999999},76.66,{"$f":"G12*0.3","v":22.997999999999998},95,{"$f":"I12*0.35","v":33.25},{"$f":"F12+H12+J12","v":85.127871999999996},"BAŞARILI (ASIL)"]
[2,11111111111,"Örnek Örnek","Örnek",85.030479999999997,29.760667999999995,76.66,22.997999999999998,63,22.049999999999997,74.808667999999983,"BAŞARILI (YEDEK)"]
[3,11111111111,"Örnek Örnek","Örnek Örnek",84.431349999999995,29.550972499999997,83.66,25.097999999999999,45,15.749999999999998,70.398972499999999,"YÖNETMELİK GEREĞİ ELENDİ*"]
[4,11111111111,"Örnek","Örnek Örnek",82.45635,28.859722499999997,82.66,24.797999999999998,42,14.7,68.357722499999994,"YÖNETMELİK GEREĞİ ELENDİ*"]
[5,11111111111,"Örnek Örnek","Örnek Örnek",82,28.7,76.66,22.997999999999998,35,12.25,63.947999999999993,"BAŞARISIZ**"]
[6,11111111111,"Örnek","Örnek",81,28.349999999999998,74.66,22.398,32,11.2,61.947999999999993,"BAŞARISIZ**"]
[7,11111111111,"Örnek","Örnek",81.431349999999995,28.500972499999996,83.66,25.097999999999999,"Sınava Girmedi","-","-","SINAVA GİRMEDİ"]
[8,11111111111,"Örnek","Örnek",86.431349999999995,30.250972499999996,70.66,21.197999999999997,"Sınava Girmedi","-","-","SINAVA GİRMEDİ"]

{"sheet":"MYO Sonuç  Rapor","index":3,"n_rows":75,"n_cols":12,"rows_kept":75,"cut":false,"hidden":false,"merged":[[0,0,0,11],[1,0,1,11],[2,0,2,11],[3,0,3,11],[4,0,4,1],[4,2,4,3],[4,4,4,6],[4,7,4,11],[8,0,8,1],[8,2,8,11],[5,0,5,1],[5,2,5,3],[5,4,5,6],[5,7,5,11],[6,0,6,1],[6,2,6,3],[6,4,6,6],[6,7,6,11],[7,0,7,1],[7,2,7,3],[7,4,7,6],[7,7,7,8],[7,9,7,10],[9,11,10,11],[9,0,10,0],[9,1,9,3],[9,4,9,5],[9,6,9,7],[9,8,9,9],[9,10,10,10]]}
["T.C."]
["BAYBURT ÜNİVERSİTESİ"]
["GİRİŞ SINAVI SONUÇ TUTANAĞI"]
[" Üniversitemize bağlı birimlere, 2547 sayılı Kanunun ilgili maddeleri ve 09.11.2018 tarih ve 30590 sayılı Resmi Gazetede yayımlanan \"Öğretim Üyesi Dışındaki Öğretim Elemanı Kadrolarına Naklen veya Açıktan Yapılacak Atamalarda Uygulanacak Merkezi Sınav ile Giriş Sınavlarına İlişkin Usul ve Esaslar Hakkında Yönetmelik” 11. ve 12. maddeleri hükümleri uyarınca yapılan Giriş Sınavında başarılı olan adayların isimleri aşağıda belirtilmiştir."]
["İlan No:",null,{"$f":"IF('MYO Sonuç'!C5=\"\",\"\",'MYO Sonuç'!C5)","v":""},null,"Birimi:",null,null,{"$f":"IF('MYO Sonuç'!H5=\"\",\"\",'MYO Sonuç'!H5)","v":"….. Meslek Yüksekokulu"}]
["İlan Tarihi:",null,{"$f":"IF('MYO Sonuç'!C6=\"\",\"\",'MYO Sonuç'!C6)","v":"…/.../...."},null,"Bölümü:",null,null,{"$f":"IF('MYO Sonuç'!H6=\"\",\"\",'MYO Sonuç'!H6)","v":"….. Bölümü"}]
["Kadro Unvanı:",null,{"$f":"IF('MYO Sonuç'!C7=\"\",\"\",'MYO Sonuç'!C7)","v":"Öğretim Görevlisi"},null,"Programı:",null,null,{"$f":"IF('MYO Sonuç'!H7=\"\",\"\",'MYO Sonuç'!H7)","v":"….. Programı"}]
["Kadro Adedi:",null,{"$f":"IF('MYO Sonuç'!C8=\"\",\"\",'MYO Sonuç'!C8)","v":""},null,"Sınav Tarihi:",null,null,{"$f":"IF('MYO Sonuç'!H8=\"\",\"\",'MYO Sonuç'!H8)","v":"…/.../...."},null,"Sonuç Tarihi:",null,{"$f":"IF('MYO Sonuç'!L8=\"\",\"\",'MYO Sonuç'!L8)","v":"…/.../...."}]
["İlan Özel Şartı:",null,{"$f":"IF('MYO Sonuç'!C9=\"\",\"\",'MYO Sonuç'!C9)","v":""}]
["Sıra No","Başvuranın",null,null,"ALES Puanı",null,"Lisans Mezuniyet Notu",null,"Giriş Sınavı",null,"(A+B+C) Değerlendirme Notu","Sonuç"]
[null,"T.C. Kimlik No","Adı","Soyadı","Puanı","(A) Puanın %35' i","100' lük Sistem ","(B) Notun %30' u","Giriş Sınav Notu","(C) Notunun %35' i"]
[{"$f":"IF('MYO Sonuç'!A12=\"\",\"\",'MYO Sonuç'!A12)","v":1},{"$f":"IF('MYO Sonuç'!B12=\"\",\"\",LEFT('MYO Sonuç'!B12,3)&REPT(\"*\",4)&RIGHT('MYO Sonuç'!B12,2))","v":"111****11"},{"$f":"IF('MYO Sonuç'!C12=\"\",\"\",IF(ISERR(FIND(\" \",'MYO Sonuç'!C12))=TRUE,LEFT('MYO Sonuç'!C12,2)&REPT(\"*\",3),LEFT('MYO Sonuç'!C12,2)&REPT(\"*\",3)&\" \"&MID('MYO Sonuç'!C12,FIND(\" \",'MYO Sonuç'!C12)+1,2)&REPT(\"*\",3)))","v":"Ör***"},{"$f":"IF('MYO Sonuç'!D12=\"\",\"\",IF(ISERR(FIND(\" \",'MYO Sonuç'!D12))=TRUE,LEFT('MYO Sonuç'!D12,2)&REPT(\"*\",3),LEFT('MYO Sonuç'!D12,2)&REPT(\"*\",3)&\" \"&MID('MYO Sonuç'!D12,FIND(\" \",'MYO Sonuç'!D12)+1,2)&REPT(\"*\",3)))","v":"Ör***"},{"$f":"IF('MYO Sonuç'!E12=\"\",\"\",'MYO Sonuç'!E12)","v":82.513919999999999},{"$f":"IF('MYO Sonuç'!F12=\"\",\"\",'MYO Sonuç'!F12)","v":28.879871999999999},{"$f":"IF('MYO Sonuç'!G12=\"\",\"\",'MYO Sonuç'!G12)","v":76.66},{"$f":"IF('MYO Sonuç'!H12=\"\",\"\",'MYO Sonuç'!H12)","v":22.997999999999998},{"$f":"IF('MYO Sonuç'!I12=\"\",\"\",'MYO Sonuç'!I12)","v":95},{"$f":"IF('MYO Sonuç'!J12=\"\",\"\",'MYO Sonuç'!J12)","v":33.25},{"$f":"IF('MYO Sonuç'!K12=\"\",\"\",'MYO Sonuç'!K12)","v":85.127871999999996},{"$f":"IF('MYO Sonuç'!L12=\"\",\"\",'MYO Sonuç'!L12)","v":"BAŞARILI (ASIL)"}]
[{"$f":"IF('MYO Sonuç'!A13=\"\",\"\",'MYO Sonuç'!A13)","v":2},{"$f":"IF('MYO Sonuç'!B13=\"\",\"\",LEFT('MYO Sonuç'!B13,3)&REPT(\"*\",4)&RIGHT('MYO Sonuç'!B13,2))","v":"111****11"},{"$f":"IF('MYO Sonuç'!C13=\"\",\"\",IF(ISERR(FIND(\" \",'MYO Sonuç'!C13))=TRUE,LEFT('MYO Sonuç'!C13,2)&REPT(\"*\",3),LEFT('MYO Sonuç'!C13,2)&REPT(\"*\",3)&\" \"&MID('MYO Sonuç'!C13,FIND(\" \",'MYO Sonuç'!C13)+1,2)&REPT(\"*\",3)))","v":"Ör*** Ör***"},{"$f":"IF('MYO Sonuç'!D13=\"\",\"\",IF(ISERR(FIND(\" \",'MYO Sonuç'!D13))=TRUE,LEFT('MYO Sonuç'!D13,2)&REPT(\"*\",3),LEFT('MYO Sonuç'!D13,2)&REPT(\"*\",3)&\" \"&MID('MYO Sonuç'!D13,FIND(\" \",'MYO Sonuç'!D13)+1,2)&REPT(\"*\",3)))","v":"Ör***"},{"$f":"IF('MYO Sonuç'!E13=\"\",\"\",'MYO Sonuç'!E13)","v":85.030479999999997},{"$f":"IF('MYO Sonuç'!F13=\"\",\"\",'MYO Sonuç'!F13)","v":29.760667999999995},{"$f":"IF('MYO Sonuç'!G13=\"\",\"\",'MYO Sonuç'!G13)","v":76.66},{"$f":"IF('MYO Sonuç'!H13=\"\",\"\",'MYO Sonuç'!H13)","v":22.997999999999998},{"$f":"IF('MYO Sonuç'!I13=\"\",\"\",'MYO Sonuç'!I13)","v":63},{"$f":"IF('MYO Sonuç'!J13=\"\",\"\",'MYO Sonuç'!J13)","v":22.049999999999997},{"$f":"IF('MYO Sonuç'!K13=\"\",\"\",'MYO Sonuç'!K13)","v":74.808667999999983},{"$f":"IF('MYO Sonuç'!L13=\"\",\"\",'MYO Sonuç'!L13)","v":"BAŞARILI (YEDEK)"}]
[{"$f":"IF('MYO Sonuç'!A14=\"\",\"\",'MYO Sonuç'!A14)","v":3},{"$f":"IF('MYO Sonuç'!B14=\"\",\"\",LEFT('MYO Sonuç'!B14,3)&REPT(\"*\",4)&RIGHT('MYO Sonuç'!B14,2))","v":"111****11"},{"$f":"IF('MYO Sonuç'!C14=\"\",\"\",IF(ISERR(FIND(\" \",'MYO Sonuç'!C14))=TRUE,LEFT('MYO Sonuç'!C14,2)&REPT(\"*\",3),LEFT('MYO Sonuç'!C14,2)&REPT(\"*\",3)&\" \"&MID('MYO Sonuç'!C14,FIND(\" \",'MYO Sonuç'!C14)+1,2)&REPT(\"*\",3)))","v":"Ör*** Ör***"},{"$f":"IF('MYO Sonuç'!D14=\"\",\"\",IF(ISERR(FIND(\" \",'MYO Sonuç'!D14))=TRUE,LEFT('MYO Sonuç'!D14,2)&REPT(\"*\",3),LEFT('MYO Sonuç'!D14,2)&REPT(\"*\",3)&\" \"&MID('MYO Sonuç'!D14,FIND(\" \",'MYO Sonuç'!D14)+1,2)&REPT(\"*\",3)))","v":"Ör*** Ör***"},{"$f":"IF('MYO Sonuç'!E14=\"\",\"\",'MYO Sonuç'!E14)","v":84.431349999999995},{"$f":"IF('MYO Sonuç'!F14=\"\",\"\",'MYO Sonuç'!F14)","v":29.550972499999997},{"$f":"IF('MYO Sonuç'!G14=\"\",\"\",'MYO Sonuç'!G14)","v":83.66},{"$f":"IF('MYO Sonuç'!H14=\"\",\"\",'MYO Sonuç'!H14)","v":25.097999999999999},{"$f":"IF('MYO Sonuç'!I14=\"\",\"\",'MYO Sonuç'!I14)","v":45},{"$f":"IF('MYO Sonuç'!J14=\"\",\"\",'MYO Sonuç'!J14)","v":15.749999999999998},{"$f":"IF('MYO Sonuç'!K14=\"\",\"\",'MYO Sonuç'!K14)","v":70.398972499999999},{"$f":"IF('MYO Sonuç'!L14=\"\",\"\",'MYO Sonuç'!L14)","v":"YÖNETMELİK GEREĞİ ELENDİ*"}]
[{"$f":"IF('MYO Sonuç'!A15=\"\",\"\",'MYO Sonuç'!A15)","v":4},{"$f":"IF('MYO Sonuç'!B15=\"\",\"\",LEFT('MYO Sonuç'!B15,3)&REPT(\"*\",4)&RIGHT('MYO Sonuç'!B15,2))","v":"111****11"},{"$f":"IF('MYO Sonuç'!C15=\"\",\"\",IF(ISERR(FIND(\" \",'MYO Sonuç'!C15))=TRUE,LEFT('MYO Sonuç'!C15,2)&REPT(\"*\",3),LEFT('MYO Sonuç'!C15,2)&REPT(\"*\",3)&\" \"&MID('MYO Sonuç'!C15,FIND(\" \",'MYO Sonuç'!C15)+1,2)&REPT(\"*\",3)))","v":"Ör***"},{"$f":"IF('MYO Sonuç'!D15=\"\",\"\",IF(ISERR(FIND(\" \",'MYO Sonuç'!D15))=TRUE,LEFT('MYO Sonuç'!D15,2)&REPT(\"*\",3),LEFT('MYO Sonuç'!D15,2)&REPT(\"*\",3)&\" \"&MID('MYO Sonuç'!D15,FIND(\" \",'MYO Sonuç'!D15)+1,2)&REPT(\"*\",3)))","v":"Ör*** Ör***"},{"$f":"IF('MYO Sonuç'!E15=\"\",\"\",'MYO Sonuç'!E15)","v":82.45635},{"$f":"IF('MYO Sonuç'!F15=\"\",\"\",'MYO Sonuç'!F15)","v":28.859722499999997},{"$f":"IF('MYO Sonuç'!G15=\"\",\"\",'MYO Sonuç'!G15)","v":82.66},{"$f":"IF('MYO Sonuç'!H15=\"\",\"\",'MYO Sonuç'!H15)","v":24.797999999999998},{"$f":"IF('MYO Sonuç'!I15=\"\",\"\",'MYO Sonuç'!I15)","v":42},{"$f":"IF('MYO Sonuç'!J15=\"\",\"\",'MYO Sonuç'!J15)","v":14.7},{"$f":"IF('MYO Sonuç'!K15=\"\",\"\",'MYO Sonuç'!K15)","v":68.357722499999994},{"$f":"IF('MYO Sonuç'!L15=\"\",\"\",'MYO Sonuç'!L15)","v":"YÖNETMELİK GEREĞİ ELENDİ*"}]
[{"$f":"IF('MYO Sonuç'!A16=\"\",\"\",'MYO Sonuç'!A16)","v":5},{"$f":"IF('MYO Sonuç'!B16=\"\",\"\",LEFT('MYO Sonuç'!B16,3)&REPT(\"*\",4)&RIGHT('MYO Sonuç'!B16,2))","v":"111****11"},{"$f":"IF('MYO Sonuç'!C16=\"\",\"\",IF(ISERR(FIND(\" \",'MYO Sonuç'!C16))=TRUE,LEFT('MYO Sonuç'!C16,2)&REPT(\"*\",3),LEFT('MYO Sonuç'!C16,2)&REPT(\"*\",3)&\" \"&MID('MYO Sonuç'!C16,FIND(\" \",'MYO Sonuç'!C16)+1,2)&REPT(\"*\",3)))","v":"Ör*** Ör***"},{"$f":"IF('MYO Sonuç'!D16=\"\",\"\",IF(ISERR(FIND(\" \",'MYO Sonuç'!D16))=TRUE,LEFT('MYO Sonuç'!D16,2)&REPT(\"*\",3),LEFT('MYO Sonuç'!D16,2)&REPT(\"*\",3)&\" \"&MID('MYO Sonuç'!D16,FIND(\" \",'MYO Sonuç'!D16)+1,2)&REPT(\"*\",3)))","v":"Ör*** Ör***"},{"$f":"IF('MYO Sonuç'!E16=\"\",\"\",'MYO Sonuç'!E16)","v":82},{"$f":"IF('MYO Sonuç'!F16=\"\",\"\",'MYO Sonuç'!F16)","v":28.7},{"$f":"IF('MYO Sonuç'!G16=\"\",\"\",'MYO Sonuç'!G16)","v":76.66},{"$f":"IF('MYO Sonuç'!H16=\"\",\"\",'MYO Sonuç'!H16)","v":22.997999999999998},{"$f":"IF('MYO Sonuç'!I16=\"\",\"\",'MYO Sonuç'!I16)","v":35},{"$f":"IF('MYO Sonuç'!J16=\"\",\"\",'MYO Sonuç'!J16)","v":12.25},{"$f":"IF('MYO Sonuç'!K16=\"\",\"\",'MYO Sonuç'!K16)","v":63.947999999999993},{"$f":"IF('MYO Sonuç'!L16=\"\",\"\",'MYO Sonuç'!L16)","v":"BAŞARISIZ**"}]
[{"$f":"IF('MYO Sonuç'!A17=\"\",\"\",'MYO Sonuç'!A17)","v":6},{"$f":"IF('MYO Sonuç'!B17=\"\",\"\",LEFT('MYO Sonuç'!B17,3)&REPT(\"*\",4)&RIGHT('MYO Sonuç'!B17,2))","v":"111****11"},{"$f":"IF('MYO Sonuç'!C17=\"\",\"\",IF(ISERR(FIND(\" \",'MYO Sonuç'!C17))=TRUE,LEFT('MYO Sonuç'!C17,2)&REPT(\"*\",3),LEFT('MYO Sonuç'!C17,2)&REPT(\"*\",3)&\" \"&MID('MYO Sonuç'!C17,FIND(\" \",'MYO Sonuç'!C17)+1,2)&REPT(\"*\",3)))","v":"Ör***"},{"$f":"IF('MYO Sonuç'!D17=\"\",\"\",IF(ISERR(FIND(\" \",'MYO Sonuç'!D17))=TRUE,LEFT('MYO Sonuç'!D17,2)&REPT(\"*\",3),LEFT('MYO Sonuç'!D17,2)&REPT(\"*\",3)&\" \"&MID('MYO Sonuç'!D17,FIND(\" \",'MYO Sonuç'!D17)+1,2)&REPT(\"*\",3)))","v":"Ör***"},{"$f":"IF('MYO Sonuç'!E17=\"\",\"\",'MYO Sonuç'!E17)","v":81},{"$f":"IF('MYO Sonuç'!F17=\"\",\"\",'MYO Sonuç'!F17)","v":28.349999999999998},{"$f":"IF('MYO Sonuç'!G17=\"\",\"\",'MYO Sonuç'!G17)","v":74.66},{"$f":"IF('MYO Sonuç'!H17=\"\",\"\",'MYO Sonuç'!H17)","v":22.398},{"$f":"IF('MYO Sonuç'!I17=\"\",\"\",'MYO Sonuç'!I17)","v":32},{"$f":"IF('MYO Sonuç'!J17=\"\",\"\",'MYO Sonuç'!J17)","v":11.2},{"$f":"IF('MYO Sonuç'!K17=\"\",\"\",'MYO Sonuç'!K17)","v":61.947999999999993},{"$f":"IF('MYO Sonuç'!L17=\"\",\"\",'MYO Sonuç'!L17)","v":"BAŞARISIZ**"}]
[{"$f":"IF('MYO Sonuç'!A18=\"\",\"\",'MYO Sonuç'!A18)","v":7},{"$f":"IF('MYO Sonuç'!B18=\"\",\"\",LEFT('MYO Sonuç'!B18,3)&REPT(\"*\",4)&RIGHT('MYO Sonuç'!B18,2))","v":"111****11"},{"$f":"IF('MYO Sonuç'!C18=\"\",\"\",IF(ISERR(FIND(\" \",'MYO Sonuç'!C18))=TRUE,LEFT('MYO Sonuç'!C18,2)&REPT(\"*\",3),LEFT('MYO Sonuç'!C18,2)&REPT(\"*\",3)&\" \"&MID('MYO Sonuç'!C18,FIND(\" \",'MYO Sonuç'!C18)+1,2)&REPT(\"*\",3)))","v":"Ör***"},{"$f":"IF('MYO Sonuç'!D18=\"\",\"\",IF(ISERR(FIND(\" \",'MYO Sonuç'!D18))=TRUE,LEFT('MYO Sonuç'!D18,2)&REPT(\"*\",3),LEFT('MYO Sonuç'!D18,2)&REPT(\"*\",3)&\" \"&MID('MYO Sonuç'!D18,FIND(\" \",'MYO Sonuç'!D18)+1,2)&REPT(\"*\",3)))","v":"Ör***"},{"$f":"IF('MYO Sonuç'!E18=\"\",\"\",'MYO Sonuç'!E18)","v":81.431349999999995},{"$f":"IF('MYO Sonuç'!F18=\"\",\"\",'MYO Sonuç'!F18)","v":28.500972499999996},{"$f":"IF('MYO Sonuç'!G18=\"\",\"\",'MYO Sonuç'!G18)","v":83.66},{"$f":"IF('MYO Sonuç'!H18=\"\",\"\",'MYO Sonuç'!H18)","v":25.097999999999999},{"$f":"IF('MYO Sonuç'!I18=\"\",\"\",'MYO Sonuç'!I18)","v":"Sınava Girmedi"},{"$f":"IF('MYO Sonuç'!J18=\"\",\"\",'MYO Sonuç'!J18)","v":"-"},{"$f":"IF('MYO Sonuç'!K18=\"\",\"\",'MYO Sonuç'!K18)","v":"-"},{"$f":"IF('MYO Sonuç'!L18=\"\",\"\",'MYO Sonuç'!L18)","v":"SINAVA GİRMEDİ"}]
[{"$f":"IF('MYO Sonuç'!A19=\"\",\"\",'MYO Sonuç'!A19)","v":8},{"$f":"IF('MYO Sonuç'!B19=\"\",\"\",LEFT('MYO Sonuç'!B19,3)&REPT(\"*\",4)&RIGHT('MYO Sonuç'!B19,2))","v":"111****11"},{"$f":"IF('MYO Sonuç'!C19=\"\",\"\",IF(ISERR(FIND(\" \",'MYO Sonuç'!C19))=TRUE,LEFT('MYO Sonuç'!C19,2)&REPT(\"*\",3),LEFT('MYO Sonuç'!C19,2)&REPT(\"*\",3)&\" \"&MID('MYO Sonuç'!C19,FIND(\" \",'MYO Sonuç'!C19)+1,2)&REPT(\"*\",3)))","v":"Ör***"},{"$f":"IF('MYO Sonuç'!D19=\"\",\"\",IF(ISERR(FIND(\" \",'MYO Sonuç'!D19))=TRUE,LEFT('MYO Sonuç'!D19,2)&REPT(\"*\",3),LEFT('MYO Sonuç'!D19,2)&REPT(\"*\",3)&\" \"&MID('MYO Sonuç'!D19,FIND(\" \",'MYO Sonuç'!D19)+1,2)&REPT(\"*\",3)))","v":"Ör***"},{"$f":"IF('MYO Sonuç'!E19=\"\",\"\",'MYO Sonuç'!E19)","v":86.431349999999995},{"$f":"IF('MYO Sonuç'!F19=\"\",\"\",'MYO Sonuç'!F19)","v":30.250972499999996},{"$f":"IF('MYO Sonuç'!G19=\"\",\"\",'MYO Sonuç'!G19)","v":70.66},{"$f":"IF('MYO Sonuç'!H19=\"\",\"\",'MYO Sonuç'!H19)","v":21.197999999999997},{"$f":"IF('MYO Sonuç'!I19=\"\",\"\",'MYO Sonuç'!I19)","v":"Sınava Girmedi"},{"$f":"IF('MYO Sonuç'!J19=\"\",\"\",'MYO Sonuç'!J19)","v":"-"},{"$f":"IF('MYO Sonuç'!K19=\"\",\"\",'MYO Sonuç'!K19)","v":"-"},{"$f":"IF('MYO Sonuç'!L19=\"\",\"\",'MYO Sonuç'!L19)","v":"SINAVA GİRMEDİ"}]
[{"$f":"IF('MYO Sonuç'!A20=\"\",\"\",'MYO Sonuç'!A20)","v":""},{"$f":"IF('MYO Sonuç'!B20=\"\",\"\",LEFT('MYO Sonuç'!B20,3)&REPT(\"*\",4)&RIGHT('MYO Sonuç'!B20,2))","v":""},{"$f":"IF('MYO Sonuç'!C20=\"\",\"\",IF(ISERR(FIND(\" \",'MYO Sonuç'!C20))=TRUE,LEFT('MYO Sonuç'!C20,2)&REPT(\"*\",3),LEFT('MYO Sonuç'!C20,2)&REPT(\"*\",3)&\" \"&MID('MYO Sonuç'!C20,FIND(\" \",'MYO Sonuç'!C20)+1,2)&REPT(\"*\",3)))","v":""},{"$f":"IF('MYO Sonuç'!D20=\"\",\"\",IF(ISERR(FIND(\" \",'MYO Sonuç'!D20))=TRUE,LEFT('MYO Sonuç'!D20,2)&REPT(\"*\",3),LEFT('MYO Sonuç'!D20,2)&REPT(\"*\",3)&\" \"&MID('MYO Sonuç'!D20,FIND(\" \",'MYO Sonuç'!D20)+1,2)&REPT(\"*\",3)))","v":""},{"$f":"IF('MYO Sonuç'!E20=\"\",\"\",'MYO Sonuç'!E20)","v":""},{"$f":"IF('MYO Sonuç'!F20=\"\",\"\",'MYO Sonuç'!F20)","v":""},{"$f":"IF('MYO Sonuç'!G20=\"\",\"\",'MYO Sonuç'!G20)","v":""},{"$f":"IF('MYO Sonuç'!H20=\"\",\"\",'MYO Sonuç'!H20)","v":""},{"$f":"IF('MYO Sonuç'!I20=\"\",\"\",'MYO Sonuç'!I20)","v":""},{"$f":"IF('MYO Sonuç'!J20=\"\",\"\",'MYO Sonuç'!J20)","v":""},{"$f":"IF('MYO Sonuç'!K20=\"\",\"\",'MYO Sonuç'!K20)","v":""},{"$f":"IF('MYO Sonuç'!L20=\"\",\"\",'MYO Sonuç'!L20)","v":""}]
[{"$f":"IF('MYO Sonuç'!A21=\"\",\"\",'MYO Sonuç'!A21)","v":""},{"$f":"IF('MYO Sonuç'!B21=\"\",\"\",LEFT('MYO Sonuç'!B21,3)&REPT(\"*\",4)&RIGHT('MYO Sonuç'!B21,2))","v":""},{"$f":"IF('MYO Sonuç'!C21=\"\",\"\",IF(ISERR(FIND(\" \",'MYO Sonuç'!C21))=TRUE,LEFT('MYO Sonuç'!C21,2)&REPT(\"*\",3),LEFT('MYO Sonuç'!C21,2)&REPT(\"*\",3)&\" \"&MID('MYO Sonuç'!C21,FIND(\" \",'MYO Sonuç'!C21)+1,2)&REPT(\"*\",3)))","v":""},{"$f":"IF('MYO Sonuç'!D21=\"\",\"\",IF(ISERR(FIND(\" \",'MYO Sonuç'!D21))=TRUE,LEFT('MYO Sonuç'!D21,2)&REPT(\"*\",3),LEFT('MYO Sonuç'!D21,2)&REPT(\"*\",3)&\" \"&MID('MYO Sonuç'!D21,FIND(\" \",'MYO Sonuç'!D21)+1,2)&REPT(\"*\",3)))","v":""},{"$f":"IF('MYO Sonuç'!E21=\"\",\"\",'MYO Sonuç'!E21)","v":""},{"$f":"IF('MYO Sonuç'!F21=\"\",\"\",'MYO Sonuç'!F21)","v":""},{"$f":"IF('MYO Sonuç'!G21=\"\",\"\",'MYO Sonuç'!G21)","v":""},{"$f":"IF('MYO Sonuç'!H21=\"\",\"\",'MYO Sonuç'!H21)","v":""},{"$f":"IF('MYO Sonuç'!I21=\"\",\"\",'MYO Sonuç'!I21)","v":""},{"$f":"IF('MYO Sonuç'!J21=\"\",\"\",'MYO Sonuç'!J21)","v":""},{"$f":"IF('MYO Sonuç'!K21=\"\",\"\",'MYO Sonuç'!K21)","v":""},{"$f":"IF('MYO Sonuç'!L21=\"\",\"\",'MYO Sonuç'!L21)","v":""}]
[{"$f":"IF('MYO Sonuç'!A22=\"\",\"\",'MYO Sonuç'!A22)","v":""},{"$f":"IF('MYO Sonuç'!B22=\"\",\"\",LEFT('MYO Sonuç'!B22,3)&REPT(\"*\",4)&RIGHT('MYO Sonuç'!B22,2))","v":""},{"$f":"IF('MYO Sonuç'!C22=\"\",\"\",IF(ISERR(FIND(\" \",'MYO Sonuç'!C22))=TRUE,LEFT('MYO Sonuç'!C22,2)&REPT(\"*\",3),LEFT('MYO Sonuç'!C22,2)&REPT(\"*\",3)&\" \"&MID('MYO Sonuç'!C22,FIND(\" \",'MYO Sonuç'!C22)+1,2)&REPT(\"*\",3)))","v":""},{"$f":"IF('MYO Sonuç'!D22=\"\",\"\",IF(ISERR(FIND(\" \",'MYO Sonuç'!D22))=TRUE,LEFT('MYO Sonuç'!D22,2)&REPT(\"*\",3),LEFT('MYO Sonuç'!D22,2)&REPT(\"*\",3)&\" \"&MID('MYO Sonuç'!D22,FIND(\" \",'MYO Sonuç'!D22)+1,2)&REPT(\"*\",3)))","v":""},{"$f":"IF('MYO Sonuç'!E22=\"\",\"\",'MYO Sonuç'!E22)","v":""},{"$f":"IF('MYO Sonuç'!F22=\"\",\"\",'MYO Sonuç'!F22)","v":""},{"$f":"IF('MYO Sonuç'!G22=\"\",\"\",'MYO Sonuç'!G22)","v":""},{"$f":"IF('MYO Sonuç'!H22=\"\",\"\",'MYO Sonuç'!H22)","v":""},{"$f":"IF('MYO Sonuç'!I22=\"\",\"\",'MYO Sonuç'!I22)","v":""},{"$f":"IF('MYO Sonuç'!J22=\"\",\"\",'MYO Sonuç'!J22)","v":""},{"$f":"IF('MYO Sonuç'!K22=\"\",\"\",'MYO Sonuç'!K22)","v":""},{"$f":"IF('MYO Sonuç'!L22=\"\",\"\",'MYO Sonuç'!L22)","v":""}]
[{"$f":"IF('MYO Sonuç'!A23=\"\",\"\",'MYO Sonuç'!A23)","v":""},{"$f":"IF('MYO Sonuç'!B23=\"\",\"\",LEFT('MYO Sonuç'!B23,3)&REPT(\"*\",4)&RIGHT('MYO Sonuç'!B23,2))","v":""},{"$f":"IF('MYO Sonuç'!C23=\"\",\"\",IF(ISERR(FIND(\" \",'MYO Sonuç'!C23))=TRUE,LEFT('MYO Sonuç'!C23,2)&REPT(\"*\",3),LEFT('MYO Sonuç'!C23,2)&REPT(\"*\",3)&\" \"&MID('MYO Sonuç'!C23,FIND(\" \",'MYO Sonuç'!C23)+1,2)&REPT(\"*\",3)))","v":""},{"$f":"IF('MYO Sonuç'!D23=\"\",\"\",IF(ISERR(FIND(\" \",'MYO Sonuç'!D23))=TRUE,LEFT('MYO Sonuç'!D23,2)&REPT(\"*\",3),LEFT('MYO Sonuç'!D23,2)&REPT(\"*\",3)&\" \"&MID('MYO Sonuç'!D23,FIND(\" \",'MYO Sonuç'!D23)+1,2)&REPT(\"*\",3)))","v":""},{"$f":"IF('MYO Sonuç'!E23=\"\",\"\",'MYO Sonuç'!E23)","v":""},{"$f":"IF('MYO Sonuç'!F23=\"\",\"\",'MYO Sonuç'!F23)","v":""},{"$f":"IF('MYO Sonuç'!G23=\"\",\"\",'MYO Sonuç'!G23)","v":""},{"$f":"IF('MYO Sonuç'!H23=\"\",\"\",'MYO Sonuç'!H23)","v":""},{"$f":"IF('MYO Sonuç'!I23=\"\",\"\",'MYO Sonuç'!I23)","v":""},{"$f":"IF('MYO Sonuç'!J23=\"\",\"\",'MYO Sonuç'!J23)","v":""},{"$f":"IF('MYO Sonuç'!K23=\"\",\"\",'MYO Sonuç'!K23)","v":""},{"$f":"IF('MYO Sonuç'!L23=\"\",\"\",'MYO Sonuç'!L23)","v":""}]
[{"$f":"IF('MYO Sonuç'!A24=\"\",\"\",'MYO Sonuç'!A24)","v":""},{"$f":"IF('MYO Sonuç'!B24=\"\",\"\",LEFT('MYO Sonuç'!B24,3)&REPT(\"*\",4)&RIGHT('MYO Sonuç'!B24,2))","v":""},{"$f":"IF('MYO Sonuç'!C24=\"\",\"\",IF(ISERR(FIND(\" \",'MYO Sonuç'!C24))=TRUE,LEFT('MYO Sonuç'!C24,2)&REPT(\"*\",3),LEFT('MYO Sonuç'!C24,2)&REPT(\"*\",3)&\" \"&MID('MYO Sonuç'!C24,FIND(\" \",'MYO Sonuç'!C24)+1,2)&REPT(\"*\",3)))","v":""},{"$f":"IF('MYO Sonuç'!D24=\"\",\"\",IF(ISERR(FIND(\" \",'MYO Sonuç'!D24))=TRUE,LEFT('MYO Sonuç'!D24,2)&REPT(\"*\",3),LEFT('MYO Sonuç'!D24,2)&REPT(\"*\",3)&\" \"&MID('MYO Sonuç'!D24,FIND(\" \",'MYO Sonuç'!D24)+1,2)&REPT(\"*\",3)))","v":""},{"$f":"IF('MYO Sonuç'!E24=\"\",\"\",'MYO Sonuç'!E24)","v":""},{"$f":"IF('MYO Sonuç'!F24=\"\",\"\",'MYO Sonuç'!F24)","v":""},{"$f":"IF('MYO Sonuç'!G24=\"\",\"\",'MYO Sonuç'!G24)","v":""},{"$f":"IF('MYO Sonuç'!H24=\"\",\"\",'MYO Sonuç'!H24)","v":""},{"$f":"IF('MYO Sonuç'!I24=\"\",\"\",'MYO Sonuç'!I24)","v":""},{"$f":"IF('MYO Sonuç'!J24=\"\",\"\",'MYO Sonuç'!J24)","v":""},{"$f":"IF('MYO Sonuç'!K24=\"\",\"\",'MYO Sonuç'!K24)","v":""},{"$f":"IF('MYO Sonuç'!L24=\"\",\"\",'MYO Sonuç'!L24)","v":""}]
[{"$f":"IF('MYO Sonuç'!A25=\"\",\"\",'MYO Sonuç'!A25)","v":""},{"$f":"IF('MYO Sonuç'!B25=\"\",\"\",LEFT('MYO Sonuç'!B25,3)&REPT(\"*\",4)&RIGHT('MYO Sonuç'!B25,2))","v":""},{"$f":"IF('MYO Sonuç'!C25=\"\",\"\",IF(ISERR(FIND(\" \",'MYO Sonuç'!C25))=TRUE,LEFT('MYO Sonuç'!C25,2)&REPT(\"*\",3),LEFT('MYO Sonuç'!C25,2)&REPT(\"*\",3)&\" \"&MID('MYO Sonuç'!C25,FIND(\" \",'MYO Sonuç'!C25)+1,2)&REPT(\"*\",3)))","v":""},{"$f":"IF('MYO Sonuç'!D25=\"\",\"\",IF(ISERR(FIND(\" \",'MYO Sonuç'!D25))=TRUE,LEFT('MYO Sonuç'!D25,2)&REPT(\"*\",3),LEFT('MYO Sonuç'!D25,2)&REPT(\"*\",3)&\" \"&MID('MYO Sonuç'!D25,FIND(\" \",'MYO Sonuç'!D25)+1,2)&REPT(\"*\",3)))","v":""},{"$f":"IF('MYO Sonuç'!E25=\"\",\"\",'MYO Sonuç'!E25)","v":""},{"$f":"IF('MYO Sonuç'!F25=\"\",\"\",'MYO Sonuç'!F25)","v":""},{"$f":"IF('MYO Sonuç'!G25=\"\",\"\",'MYO Sonuç'!G25)","v":""},{"$f":"IF('MYO Sonuç'!H25=\"\",\"\",'MYO Sonuç'!H25)","v":""},{"$f":"IF('MYO Sonuç'!I25=\"\",\"\",'MYO Sonuç'!I25)","v":""},{"$f":"IF('MYO Sonuç'!J25=\"\",\"\",'MYO Sonuç'!J25)","v":""},{"$f":"IF('MYO Sonuç'!K25=\"\",\"\",'MYO Sonuç'!K25)","v":""},{"$f":"IF('MYO Sonuç'!L25=\"\",\"\",'MYO Sonuç'!L25)","v":""}]
[{"$f":"IF('MYO Sonuç'!A26=\"\",\"\",'MYO Sonuç'!A26)","v":""},{"$f":"IF('MYO Sonuç'!B26=\"\",\"\",LEFT('MYO Sonuç'!B26,3)&REPT(\"*\",4)&RIGHT('MYO Sonuç'!B26,2))","v":""},{"$f":"IF('MYO Sonuç'!C26=\"\",\"\",IF(ISERR(FIND(\" \",'MYO Sonuç'!C26))=TRUE,LEFT('MYO Sonuç'!C26,2)&REPT(\"*\",3),LEFT('MYO Sonuç'!C26,2)&REPT(\"*\",3)&\" \"&MID('MYO Sonuç'!C26,FIND(\" \",'MYO Sonuç'!C26)+1,2)&REPT(\"*\",3)))","v":""},{"$f":"IF('MYO Sonuç'!D26=\"\",\"\",IF(ISERR(FIND(\" \",'MYO Sonuç'!D26))=TRUE,LEFT('MYO Sonuç'!D26,2)&REPT(\"*\",3),LEFT('MYO Sonuç'!D26,2)&REPT(\"*\",3)&\" \"&MID('MYO Sonuç'!D26,FIND(\" \",'MYO Sonuç'!D26)+1,2)&REPT(\"*\",3)))","v":""},{"$f":"IF('MYO Sonuç'!E26=\"\",\"\",'MYO Sonuç'!E26)","v":""},{"$f":"IF('MYO Sonuç'!F26=\"\",\"\",'MYO Sonuç'!F26)","v":""},{"$f":"IF('MYO Sonuç'!G26=\"\",\"\",'MYO Sonuç'!G26)","v":""},{"$f":"IF('MYO Sonuç'!H26=\"\",\"\",'MYO Sonuç'!H26)","v":""},{"$f":"IF('MYO Sonuç'!I26=\"\",\"\",'MYO Sonuç'!I26)","v":""},{"$f":"IF('MYO Sonuç'!J26=\"\",\"\",'MYO Sonuç'!J26)","v":""},{"$f":"IF('MYO Sonuç'!K26=\"\",\"\",'MYO Sonuç'!K26)","v":""},{"$f":"IF('MYO Sonuç'!L26=\"\",\"\",'MYO Sonuç'!L26)","v":""}]
[{"$f":"IF('MYO Sonuç'!A27=\"\",\"\",'MYO Sonuç'!A27)","v":""},{"$f":"IF('MYO Sonuç'!B27=\"\",\"\",LEFT('MYO Sonuç'!B27,3)&REPT(\"*\",4)&RIGHT('MYO Sonuç'!B27,2))","v":""},{"$f":"IF('MYO Sonuç'!C27=\"\",\"\",IF(ISERR(FIND(\" \",'MYO Sonuç'!C27))=TRUE,LEFT('MYO Sonuç'!C27,2)&REPT(\"*\",3),LEFT('MYO Sonuç'!C27,2)&REPT(\"*\",3)&\" \"&MID('MYO Sonuç'!C27,FIND(\" \",'MYO Sonuç'!C27)+1,2)&REPT(\"*\",3)))","v":""},{"$f":"IF('MYO Sonuç'!D27=\"\",\"\",IF(ISERR(FIND(\" \",'MYO Sonuç'!D27))=TRUE,LEFT('MYO Sonuç'!D27,2)&REPT(\"*\",3),LEFT('MYO Sonuç'!D27,2)&REPT(\"*\",3)&\" \"&MID('MYO Sonuç'!D27,FIND(\" \",'MYO Sonuç'!D27)+1,2)&REPT(\"*\",3)))","v":""},{"$f":"IF('MYO Sonuç'!E27=\"\",\"\",'MYO Sonuç'!E27)","v":""},{"$f":"IF('MYO Sonuç'!F27=\"\",\"\",'MYO Sonuç'!F27)","v":""},{"$f":"IF('MYO Sonuç'!G27=\"\",\"\",'MYO Sonuç'!G27)","v":""},{"$f":"IF('MYO Sonuç'!H27=\"\",\"\",'MYO Sonuç'!H27)","v":""},{"$f":"IF('MYO Sonuç'!I27=\"\",\"\",'MYO Sonuç'!I27)","v":""},{"$f":"IF('MYO Sonuç'!J27=\"\",\"\",'MYO Sonuç'!J27)","v":""},{"$f":"IF('MYO Sonuç'!K27=\"\",\"\",'MYO Sonuç'!K27)","v":""},{"$f":"IF('MYO Sonuç'!L27=\"\",\"\",'MYO Sonuç'!L27)","v":""}]
[{"$f":"IF('MYO Sonuç'!A28=\"\",\"\",'MYO Sonuç'!A28)","v":""},{"$f":"IF('MYO Sonuç'!B28=\"\",\"\",LEFT('MYO Sonuç'!B28,3)&REPT(\"*\",4)&RIGHT('MYO Sonuç'!B28,2))","v":""},{"$f":"IF('MYO Sonuç'!C28=\"\",\"\",IF(ISERR(FIND(\" \",'MYO Sonuç'!C28))=TRUE,LEFT('MYO Sonuç'!C28,2)&REPT(\"*\",3),LEFT('MYO Sonuç'!C28,2)&REPT(\"*\",3)&\" \"&MID('MYO Sonuç'!C28,FIND(\" \",'MYO Sonuç'!C28)+1,2)&REPT(\"*\",3)))","v":""},{"$f":"IF('MYO Sonuç'!D28=\"\",\"\",IF(ISERR(FIND(\" \",'MYO Sonuç'!D28))=TRUE,LEFT('MYO Sonuç'!D28,2)&REPT(\"*\",3),LEFT('MYO Sonuç'!D28,2)&REPT(\"*\",3)&\" \"&MID('MYO Sonuç'!D28,FIND(\" \",'MYO Sonuç'!D28)+1,2)&REPT(\"*\",3)))","v":""},{"$f":"IF('MYO Sonuç'!E28=\"\",\"\",'MYO Sonuç'!E28)","v":""},{"$f":"IF('MYO Sonuç'!F28=\"\",\"\",'MYO Sonuç'!F28)","v":""},{"$f":"IF('MYO Sonuç'!G28=\"\",\"\",'MYO Sonuç'!G28)","v":""},{"$f":"IF('MYO Sonuç'!H28=\"\",\"\",'MYO Sonuç'!H28)","v":""},{"$f":"IF('MYO Sonuç'!I28=\"\",\"\",'MYO Sonuç'!I28)","v":""},{"$f":"IF('MYO Sonuç'!J28=\"\",\"\",'MYO Sonuç'!J28)","v":""},{"$f":"IF('MYO Sonuç'!K28=\"\",\"\",'MYO Sonuç'!K28)","v":""},{"$f":"IF('MYO Sonuç'!L28=\"\",\"\",'MYO Sonuç'!L28)","v":""}]
[{"$f":"IF('MYO Sonuç'!A29=\"\",\"\",'MYO Sonuç'!A29)","v":""},{"$f":"IF('MYO Sonuç'!B29=\"\",\"\",LEFT('MYO Sonuç'!B29,3)&REPT(\"*\",4)&RIGHT('MYO Sonuç'!B29,2))","v":""},{"$f":"IF('MYO Sonuç'!C29=\"\",\"\",IF(ISERR(FIND(\" \",'MYO Sonuç'!C29))=TRUE,LEFT('MYO Sonuç'!C29,2)&REPT(\"*\",3),LEFT('MYO Sonuç'!C29,2)&REPT(\"*\",3)&\" \"&MID('MYO Sonuç'!C29,FIND(\" \",'MYO Sonuç'!C29)+1,2)&REPT(\"*\",3)))","v":""},{"$f":"IF('MYO Sonuç'!D29=\"\",\"\",IF(ISERR(FIND(\" \",'MYO Sonuç'!D29))=TRUE,LEFT('MYO Sonuç'!D29,2)&REPT(\"*\",3),LEFT('MYO Sonuç'!D29,2)&REPT(\"*\",3)&\" \"&MID('MYO Sonuç'!D29,FIND(\" \",'MYO Sonuç'!D29)+1,2)&REPT(\"*\",3)))","v":""},{"$f":"IF('MYO Sonuç'!E29=\"\",\"\",'MYO Sonuç'!E29)","v":""},{"$f":"IF('MYO Sonuç'!F29=\"\",\"\",'MYO Sonuç'!F29)","v":""},{"$f":"IF('MYO Sonuç'!G29=\"\",\"\",'MYO Sonuç'!G29)","v":""},{"$f":"IF('MYO Sonuç'!H29=\"\",\"\",'MYO Sonuç'!H29)","v":""},{"$f":"IF('MYO Sonuç'!I29=\"\",\"\",'MYO Sonuç'!I29)","v":""},{"$f":"IF('MYO Sonuç'!J29=\"\",\"\",'MYO Sonuç'!J29)","v":""},{"$f":"IF('MYO Sonuç'!K29=\"\",\"\",'MYO Sonuç'!K29)","v":""},{"$f":"IF('MYO Sonuç'!L29=\"\",\"\",'MYO Sonuç'!L29)","v":""}]
[{"$f":"IF('MYO Sonuç'!A30=\"\",\"\",'MYO Sonuç'!A30)","v":""},{"$f":"IF('MYO Sonuç'!B30=\"\",\"\",LEFT('MYO Sonuç'!B30,3)&REPT(\"*\",4)&RIGHT('MYO Sonuç'!B30,2))","v":""},{"$f":"IF('MYO Sonuç'!C30=\"\",\"\",IF(ISERR(FIND(\" \",'MYO Sonuç'!C30))=TRUE,LEFT('MYO Sonuç'!C30,2)&REPT(\"*\",3),LEFT('MYO Sonuç'!C30,2)&REPT(\"*\",3)&\" \"&MID('MYO Sonuç'!C30,FIND(\" \",'MYO Sonuç'!C30)+1,2)&REPT(\"*\",3)))","v":""},{"$f":"IF('MYO Sonuç'!D30=\"\",\"\",IF(ISERR(FIND(\" \",'MYO Sonuç'!D30))=TRUE,LEFT('MYO Sonuç'!D30,2)&REPT(\"*\",3),LEFT('MYO Sonuç'!D30,2)&REPT(\"*\",3)&\" \"&MID('MYO Sonuç'!D30,FIND(\" \",'MYO Sonuç'!D30)+1,2)&REPT(\"*\",3)))","v":""},{"$f":"IF('MYO Sonuç'!E30=\"\",\"\",'MYO Sonuç'!E30)","v":""},{"$f":"IF('MYO Sonuç'!F30=\"\",\"\",'MYO Sonuç'!F30)","v":""},{"$f":"IF('MYO Sonuç'!G30=\"\",\"\",'MYO Sonuç'!G30)","v":""},{"$f":"IF('MYO Sonuç'!H30=\"\",\"\",'MYO Sonuç'!H30)","v":""},{"$f":"IF('MYO Sonuç'!I30=\"\",\"\",'MYO Sonuç'!I30)","v":""},{"$f":"IF('MYO Sonuç'!J30=\"\",\"\",'MYO Sonuç'!J30)","v":""},{"$f":"IF('MYO Sonuç'!K30=\"\",\"\",'MYO Sonuç'!K30)","v":""},{"$f":"IF('MYO Sonuç'!L30=\"\",\"\",'MYO Sonuç'!L30)","v":""}]
[{"$f":"IF('MYO Sonuç'!A31=\"\",\"\",'MYO Sonuç'!A31)","v":""},{"$f":"IF('MYO Sonuç'!B31=\"\",\"\",LEFT('MYO Sonuç'!B31,3)&REPT(\"*\",4)&RIGHT('MYO Sonuç'!B31,2))","v":""},{"$f":"IF('MYO Sonuç'!C31=\"\",\"\",IF(ISERR(FIND(\" \",'MYO Sonuç'!C31))=TRUE,LEFT('MYO Sonuç'!C31,2)&REPT(\"*\",3),LEFT('MYO Sonuç'!C31,2)&REPT(\"*\",3)&\" \"&MID('MYO Sonuç'!C31,FIND(\" \",'MYO Sonuç'!C31)+1,2)&REPT(\"*\",3)))","v":""},{"$f":"IF('MYO Sonuç'!D31=\"\",\"\",IF(ISERR(FIND(\" \",'MYO Sonuç'!D31))=TRUE,LEFT('MYO Sonuç'!D31,2)&REPT(\"*\",3),LEFT('MYO Sonuç'!D31,2)&REPT(\"*\",3)&\" \"&MID('MYO Sonuç'!D31,FIND(\" \",'MYO Sonuç'!D31)+1,2)&REPT(\"*\",3)))","v":""},{"$f":"IF('MYO Sonuç'!E31=\"\",\"\",'MYO Sonuç'!E31)","v":""},{"$f":"IF('MYO Sonuç'!F31=\"\",\"\",'MYO Sonuç'!F31)","v":""},{"$f":"IF('MYO Sonuç'!G31=\"\",\"\",'MYO Sonuç'!G31)","v":""},{"$f":"IF('MYO Sonuç'!H31=\"\",\"\",'MYO Sonuç'!H31)","v":""},{"$f":"IF('MYO Sonuç'!I31=\"\",\"\",'MYO Sonuç'!I31)","v":""},{"$f":"IF('MYO Sonuç'!J31=\"\",\"\",'MYO Sonuç'!J31)","v":""},{"$f":"IF('MYO Sonuç'!K31=\"\",\"\",'MYO Sonuç'!K31)","v":""},{"$f":"IF('MYO Sonuç'!L31=\"\",\"\",'MYO Sonuç'!L31)","v":""}]
[{"$f":"IF('MYO Sonuç'!A32=\"\",\"\",'MYO Sonuç'!A32)","v":""},{"$f":"IF('MYO Sonuç'!B32=\"\",\"\",LEFT('MYO Sonuç'!B32,3)&REPT(\"*\",4)&RIGHT('MYO Sonuç'!B32,2))","v":""},{"$f":"IF('MYO Sonuç'!C32=\"\",\"\",IF(ISERR(FIND(\" \",'MYO Sonuç'!C32))=TRUE,LEFT('MYO Sonuç'!C32,2)&REPT(\"*\",3),LEFT('MYO Sonuç'!C32,2)&REPT(\"*\",3)&\" \"&MID('MYO Sonuç'!C32,FIND(\" \",'MYO Sonuç'!C32)+1,2)&REPT(\"*\",3)))","v":""},{"$f":"IF('MYO Sonuç'!D32=\"\",\"\",IF(ISERR(FIND(\" \",'MYO Sonuç'!D32))=TRUE,LEFT('MYO Sonuç'!D32,2)&REPT(\"*\",3),LEFT('MYO Sonuç'!D32,2)&REPT(\"*\",3)&\" \"&MID('MYO Sonuç'!D32,FIND(\" \",'MYO Sonuç'!D32)+1,2)&REPT(\"*\",3)))","v":""},{"$f":"IF('MYO Sonuç'!E32=\"\",\"\",'MYO Sonuç'!E32)","v":""},{"$f":"IF('MYO Sonuç'!F32=\"\",\"\",'MYO Sonuç'!F32)","v":""},{"$f":"IF('MYO Sonuç'!G32=\"\",\"\",'MYO Sonuç'!G32)","v":""},{"$f":"IF('MYO Sonuç'!H32=\"\",\"\",'MYO Sonuç'!H32)","v":""},{"$f":"IF('MYO Sonuç'!I32=\"\",\"\",'MYO Sonuç'!I32)","v":""},{"$f":"IF('MYO Sonuç'!J32=\"\",\"\",'MYO Sonuç'!J32)","v":""},{"$f":"IF('MYO Sonuç'!K32=\"\",\"\",'MYO Sonuç'!K32)","v":""},{"$f":"IF('MYO Sonuç'!L32=\"\",\"\",'MYO Sonuç'!L32)","v":""}]
[{"$f":"IF('MYO Sonuç'!A33=\"\",\"\",'MYO Sonuç'!A33)","v":""},{"$f":"IF('MYO Sonuç'!B33=\"\",\"\",LEFT('MYO Sonuç'!B33,3)&REPT(\"*\",4)&RIGHT('MYO Sonuç'!B33,2))","v":""},{"$f":"IF('MYO Sonuç'!C33=\"\",\"\",IF(ISERR(FIND(\" \",'MYO Sonuç'!C33))=TRUE,LEFT('MYO Sonuç'!C33,2)&REPT(\"*\",3),LEFT('MYO Sonuç'!C33,2)&REPT(\"*\",3)&\" \"&MID('MYO Sonuç'!C33,FIND(\" \",'MYO Sonuç'!C33)+1,2)&REPT(\"*\",3)))","v":""},{"$f":"IF('MYO Sonuç'!D33=\"\",\"\",IF(ISERR(FIND(\" \",'MYO Sonuç'!D33))=TRUE,LEFT('MYO Sonuç'!D33,2)&REPT(\"*\",3),LEFT('MYO Sonuç'!D33,2)&REPT(\"*\",3)&\" \"&MID('MYO Sonuç'!D33,FIND(\" \",'MYO Sonuç'!D33)+1,2)&REPT(\"*\",3)))","v":""},{"$f":"IF('MYO Sonuç'!E33=\"\",\"\",'MYO Sonuç'!E33)","v":""},{"$f":"IF('MYO Sonuç'!F33=\"\",\"\",'MYO Sonuç'!F33)","v":""},{"$f":"IF('MYO Sonuç'!G33=\"\",\"\",'MYO Sonuç'!G33)","v":""},{"$f":"IF('MYO Sonuç'!H33=\"\",\"\",'MYO Sonuç'!H33)","v":""},{"$f":"IF('MYO Sonuç'!I33=\"\",\"\",'MYO Sonuç'!I33)","v":""},{"$f":"IF('MYO Sonuç'!J33=\"\",\"\",'MYO Sonuç'!J33)","v":""},{"$f":"IF('MYO Sonuç'!K33=\"\",\"\",'MYO Sonuç'!K33)","v":""},{"$f":"IF('MYO Sonuç'!L33=\"\",\"\",'MYO Sonuç'!L33)","v":""}]
[{"$f":"IF('MYO Sonuç'!A34=\"\",\"\",'MYO Sonuç'!A34)","v":""},{"$f":"IF('MYO Sonuç'!B34=\"\",\"\",LEFT('MYO Sonuç'!B34,3)&REPT(\"*\",4)&RIGHT('MYO Sonuç'!B34,2))","v":""},{"$f":"IF('MYO Sonuç'!C34=\"\",\"\",IF(ISERR(FIND(\" \",'MYO Sonuç'!C34))=TRUE,LEFT('MYO Sonuç'!C34,2)&REPT(\"*\",3),LEFT('MYO Sonuç'!C34,2)&REPT(\"*\",3)&\" \"&MID('MYO Sonuç'!C34,FIND(\" \",'MYO Sonuç'!C34)+1,2)&REPT(\"*\",3)))","v":""},{"$f":"IF('MYO Sonuç'!D34=\"\",\"\",IF(ISERR(FIND(\" \",'MYO Sonuç'!D34))=TRUE,LEFT('MYO Sonuç'!D34,2)&REPT(\"*\",3),LEFT('MYO Sonuç'!D34,2)&REPT(\"*\",3)&\" \"&MID('MYO Sonuç'!D34,FIND(\" \",'MYO Sonuç'!D34)+1,2)&REPT(\"*\",3)))","v":""},{"$f":"IF('MYO Sonuç'!E34=\"\",\"\",'MYO Sonuç'!E34)","v":""},{"$f":"IF('MYO Sonuç'!F34=\"\",\"\",'MYO Sonuç'!F34)","v":""},{"$f":"IF('MYO Sonuç'!G34=\"\",\"\",'MYO Sonuç'!G34)","v":""},{"$f":"IF('MYO Sonuç'!H34=\"\",\"\",'MYO Sonuç'!H34)","v":""},{"$f":"IF('MYO Sonuç'!I34=\"\",\"\",'MYO Sonuç'!I34)","v":""},{"$f":"IF('MYO Sonuç'!J34=\"\",\"\",'MYO Sonuç'!J34)","v":""},{"$f":"IF('MYO Sonuç'!K34=\"\",\"\",'MYO Sonuç'!K34)","v":""},{"$f":"IF('MYO Sonuç'!L34=\"\",\"\",'MYO Sonuç'!L34)","v":""}]
[{"$f":"IF('MYO Sonuç'!A35=\"\",\"\",'MYO Sonuç'!A35)","v":""},{"$f":"IF('MYO Sonuç'!B35=\"\",\"\",LEFT('MYO Sonuç'!B35,3)&REPT(\"*\",4)&RIGHT('MYO Sonuç'!B35,2))","v":""},{"$f":"IF('MYO Sonuç'!C35=\"\",\"\",IF(ISERR(FIND(\" \",'MYO Sonuç'!C35))=TRUE,LEFT('MYO Sonuç'!C35,2)&REPT(\"*\",3),LEFT('MYO Sonuç'!C35,2)&REPT(\"*\",3)&\" \"&MID('MYO Sonuç'!C35,FIND(\" \",'MYO Sonuç'!C35)+1,2)&REPT(\"*\",3)))","v":""},{"$f":"IF('MYO Sonuç'!D35=\"\",\"\",IF(ISERR(FIND(\" \",'MYO Sonuç'!D35))=TRUE,LEFT('MYO Sonuç'!D35,2)&REPT(\"*\",3),LEFT('MYO Sonuç'!D35,2)&REPT(\"*\",3)&\" \"&MID('MYO Sonuç'!D35,FIND(\" \",'MYO Sonuç'!D35)+1,2)&REPT(\"*\",3)))","v":""},{"$f":"IF('MYO Sonuç'!E35=\"\",\"\",'MYO Sonuç'!E35)","v":""},{"$f":"IF('MYO Sonuç'!F35=\"\",\"\",'MYO Sonuç'!F35)","v":""},{"$f":"IF('MYO Sonuç'!G35=\"\",\"\",'MYO Sonuç'!G35)","v":""},{"$f":"IF('MYO Sonuç'!H35=\"\",\"\",'MYO Sonuç'!H35)","v":""},{"$f":"IF('MYO Sonuç'!I35=\"\",\"\",'MYO Sonuç'!I35)","v":""},{"$f":"IF('MYO Sonuç'!J35=\"\",\"\",'MYO Sonuç'!J35)","v":""},{"$f":"IF('MYO Sonuç'!K35=\"\",\"\",'MYO Sonuç'!K35)","v":""},{"$f":"IF('MYO Sonuç'!L35=\"\",\"\",'MYO Sonuç'!L35)","v":""}]
[{"$f":"IF('MYO Sonuç'!A36=\"\",\"\",'MYO Sonuç'!A36)","v":""},{"$f":"IF('MYO Sonuç'!B36=\"\",\"\",LEFT('MYO Sonuç'!B36,3)&REPT(\"*\",4)&RIGHT('MYO Sonuç'!B36,2))","v":""},{"$f":"IF('MYO Sonuç'!C36=\"\",\"\",IF(ISERR(FIND(\" \",'MYO Sonuç'!C36))=TRUE,LEFT('MYO Sonuç'!C36,2)&REPT(\"*\",3),LEFT('MYO Sonuç'!C36,2)&REPT(\"*\",3)&\" \"&MID('MYO Sonuç'!C36,FIND(\" \",'MYO Sonuç'!C36)+1,2)&REPT(\"*\",3)))","v":""},{"$f":"IF('MYO Sonuç'!D36=\"\",\"\",IF(ISERR(FIND(\" \",'MYO Sonuç'!D36))=TRUE,LEFT('MYO Sonuç'!D36,2)&REPT(\"*\",3),LEFT('MYO Sonuç'!D36,2)&REPT(\"*\",3)&\" \"&MID('MYO Sonuç'!D36,FIND(\" \",'MYO Sonuç'!D36)+1,2)&REPT(\"*\",3)))","v":""},{"$f":"IF('MYO Sonuç'!E36=\"\",\"\",'MYO Sonuç'!E36)","v":""},{"$f":"IF('MYO Sonuç'!F36=\"\",\"\",'MYO Sonuç'!F36)","v":""},{"$f":"IF('MYO Sonuç'!G36=\"\",\"\",'MYO Sonuç'!G36)","v":""},{"$f":"IF('MYO Sonuç'!H36=\"\",\"\",'MYO Sonuç'!H36)","v":""},{"$f":"IF('MYO Sonuç'!I36=\"\",\"\",'MYO Sonuç'!I36)","v":""},{"$f":"IF('MYO Sonuç'!J36=\"\",\"\",'MYO Sonuç'!J36)","v":""},{"$f":"IF('MYO Sonuç'!K36=\"\",\"\",'MYO Sonuç'!K36)","v":""},{"$f":"IF('MYO Sonuç'!L36=\"\",\"\",'MYO Sonuç'!L36)","v":""}]
[{"$f":"IF('MYO Sonuç'!A37=\"\",\"\",'MYO Sonuç'!A37)","v":""},{"$f":"IF('MYO Sonuç'!B37=\"\",\"\",LEFT('MYO Sonuç'!B37,3)&REPT(\"*\",4)&RIGHT('MYO Sonuç'!B37,2))","v":""},{"$f":"IF('MYO Sonuç'!C37=\"\",\"\",IF(ISERR(FIND(\" \",'MYO Sonuç'!C37))=TRUE,LEFT('MYO Sonuç'!C37,2)&REPT(\"*\",3),LEFT('MYO Sonuç'!C37,2)&REPT(\"*\",3)&\" \"&MID('MYO Sonuç'!C37,FIND(\" \",'MYO Sonuç'!C37)+1,2)&REPT(\"*\",3)))","v":""},{"$f":"IF('MYO Sonuç'!D37=\"\",\"\",IF(ISERR(FIND(\" \",'MYO Sonuç'!D37))=TRUE,LEFT('MYO Sonuç'!D37,2)&REPT(\"*\",3),LEFT('MYO Sonuç'!D37,2)&REPT(\"*\",3)&\" \"&MID('MYO Sonuç'!D37,FIND(\" \",'MYO Sonuç'!D37)+1,2)&REPT(\"*\",3)))","v":""},{"$f":"IF('MYO Sonuç'!E37=\"\",\"\",'MYO Sonuç'!E37)","v":""},{"$f":"IF('MYO Sonuç'!F37=\"\",\"\",'MYO Sonuç'!F37)","v":""},{"$f":"IF('MYO Sonuç'!G37=\"\",\"\",'MYO Sonuç'!G37)","v":""},{"$f":"IF('MYO Sonuç'!H37=\"\",\"\",'MYO Sonuç'!H37)","v":""},{"$f":"IF('MYO Sonuç'!I37=\"\",\"\",'MYO Sonuç'!I37)","v":""},{"$f":"IF('MYO Sonuç'!J37=\"\",\"\",'MYO Sonuç'!J37)","v":""},{"$f":"IF('MYO Sonuç'!K37=\"\",\"\",'MYO Sonuç'!K37)","v":""},{"$f":"IF('MYO Sonuç'!L37=\"\",\"\",'MYO Sonuç'!L37)","v":""}]
[{"$f":"IF('MYO Sonuç'!A38=\"\",\"\",'MYO Sonuç'!A38)","v":""},{"$f":"IF('MYO Sonuç'!B38=\"\",\"\",LEFT('MYO Sonuç'!B38,3)&REPT(\"*\",4)&RIGHT('MYO Sonuç'!B38,2))","v":""},{"$f":"IF('MYO Sonuç'!C38=\"\",\"\",IF(ISERR(FIND(\" \",'MYO Sonuç'!C38))=TRUE,LEFT('MYO Sonuç'!C38,2)&REPT(\"*\",3),LEFT('MYO Sonuç'!C38,2)&REPT(\"*\",3)&\" \"&MID('MYO Sonuç'!C38,FIND(\" \",'MYO Sonuç'!C38)+1,2)&REPT(\"*\",3)))","v":""},{"$f":"IF('MYO Sonuç'!D38=\"\",\"\",IF(ISERR(FIND(\" \",'MYO Sonuç'!D38))=TRUE,LEFT('MYO Sonuç'!D38,2)&REPT(\"*\",3),LEFT('MYO Sonuç'!D38,2)&REPT(\"*\",3)&\" \"&MID('MYO Sonuç'!D38,FIND(\" \",'MYO Sonuç'!D38)+1,2)&REPT(\"*\",3)))","v":""},{"$f":"IF('MYO Sonuç'!E38=\"\",\"\",'MYO Sonuç'!E38)","v":""},{"$f":"IF('MYO Sonuç'!F38=\"\",\"\",'MYO Sonuç'!F38)","v":""},{"$f":"IF('MYO Sonuç'!G38=\"\",\"\",'MYO Sonuç'!G38)","v":""},{"$f":"IF('MYO Sonuç'!H38=\"\",\"\",'MYO Sonuç'!H38)","v":""},{"$f":"IF('MYO Sonuç'!I38=\"\",\"\",'MYO Sonuç'!I38)","v":""},{"$f":"IF('MYO Sonuç'!J38=\"\",\"\",'MYO Sonuç'!J38)","v":""},{"$f":"IF('MYO Sonuç'!K38=\"\",\"\",'MYO Sonuç'!K38)","v":""},{"$f":"IF('MYO Sonuç'!L38=\"\",\"\",'MYO Sonuç'!L38)","v":""}]
[{"$f":"IF('MYO Sonuç'!A39=\"\",\"\",'MYO Sonuç'!A39)","v":""},{"$f":"IF('MYO Sonuç'!B39=\"\",\"\",LEFT('MYO Sonuç'!B39,3)&REPT(\"*\",4)&RIGHT('MYO Sonuç'!B39,2))","v":""},{"$f":"IF('MYO Sonuç'!C39=\"\",\"\",IF(ISERR(FIND(\" \",'MYO Sonuç'!C39))=TRUE,LEFT('MYO Sonuç'!C39,2)&REPT(\"*\",3),LEFT('MYO Sonuç'!C39,2)&REPT(\"*\",3)&\" \"&MID('MYO Sonuç'!C39,FIND(\" \",'MYO Sonuç'!C39)+1,2)&REPT(\"*\",3)))","v":""},{"$f":"IF('MYO Sonuç'!D39=\"\",\"\",IF(ISERR(FIND(\" \",'MYO Sonuç'!D39))=TRUE,LEFT('MYO Sonuç'!D39,2)&REPT(\"*\",3),LEFT('MYO Sonuç'!D39,2)&REPT(\"*\",3)&\" \"&MID('MYO Sonuç'!D39,FIND(\" \",'MYO Sonuç'!D39)+1,2)&REPT(\"*\",3)))","v":""},{"$f":"IF('MYO Sonuç'!E39=\"\",\"\",'MYO Sonuç'!E39)","v":""},{"$f":"IF('MYO Sonuç'!F39=\"\",\"\",'MYO Sonuç'!F39)","v":""},{"$f":"IF('MYO Sonuç'!G39=\"\",\"\",'MYO Sonuç'!G39)","v":""},{"$f":"IF('MYO Sonuç'!H39=\"\",\"\",'MYO Sonuç'!H39)","v":""},{"$f":"IF('MYO Sonuç'!I39=\"\",\"\",'MYO Sonuç'!I39)","v":""},{"$f":"IF('MYO Sonuç'!J39=\"\",\"\",'MYO Sonuç'!J39)","v":""},{"$f":"IF('MYO Sonuç'!K39=\"\",\"\",'MYO Sonuç'!K39)","v":""},{"$f":"IF('MYO Sonuç'!L39=\"\",\"\",'MYO Sonuç'!L39)","v":""}]
[{"$f":"IF('MYO Sonuç'!A40=\"\",\"\",'MYO Sonuç'!A40)","v":""},{"$f":"IF('MYO Sonuç'!B40=\"\",\"\",LEFT('MYO Sonuç'!B40,3)&REPT(\"*\",4)&RIGHT('MYO Sonuç'!B40,2))","v":""},{"$f":"IF('MYO Sonuç'!C40=\"\",\"\",IF(ISERR(FIND(\" \",'MYO Sonuç'!C40))=TRUE,LEFT('MYO Sonuç'!C40,2)&REPT(\"*\",3),LEFT('MYO Sonuç'!C40,2)&REPT(\"*\",3)&\" \"&MID('MYO Sonuç'!C40,FIND(\" \",'MYO Sonuç'!C40)+1,2)&REPT(\"*\",3)))","v":""},{"$f":"IF('MYO Sonuç'!D40=\"\",\"\",IF(ISERR(FIND(\" \",'MYO Sonuç'!D40))=TRUE,LEFT('MYO Sonuç'!D40,2)&REPT(\"*\",3),LEFT('MYO Sonuç'!D40,2)&REPT(\"*\",3)&\" \"&MID('MYO Sonuç'!D40,FIND(\" \",'MYO Sonuç'!D40)+1,2)&REPT(\"*\",3)))","v":""},{"$f":"IF('MYO Sonuç'!E40=\"\",\"\",'MYO Sonuç'!E40)","v":""},{"$f":"IF('MYO Sonuç'!F40=\"\",\"\",'MYO Sonuç'!F40)","v":""},{"$f":"IF('MYO Sonuç'!G40=\"\",\"\",'MYO Sonuç'!G40)","v":""},{"$f":"IF('MYO Sonuç'!H40=\"\",\"\",'MYO Sonuç'!H40)","v":""},{"$f":"IF('MYO Sonuç'!I40=\"\",\"\",'MYO Sonuç'!I40)","v":""},{"$f":"IF('MYO Sonuç'!J40=\"\",\"\",'MYO Sonuç'!J40)","v":""},{"$f":"IF('MYO Sonuç'!K40=\"\",\"\",'MYO Sonuç'!K40)","v":""},{"$f":"IF('MYO Sonuç'!L40=\"\",\"\",'MYO Sonuç'!L40)","v":""}]
[{"$f":"IF('MYO Sonuç'!A41=\"\",\"\",'MYO Sonuç'!A41)","v":""},{"$f":"IF('MYO Sonuç'!B41=\"\",\"\",LEFT('MYO Sonuç'!B41,3)&REPT(\"*\",4)&RIGHT('MYO Sonuç'!B41,2))","v":""},{"$f":"IF('MYO Sonuç'!C41=\"\",\"\",IF(ISERR(FIND(\" \",'MYO Sonuç'!C41))=TRUE,LEFT('MYO Sonuç'!C41,2)&REPT(\"*\",3),LEFT('MYO Sonuç'!C41,2)&REPT(\"*\",3)&\" \"&MID('MYO Sonuç'!C41,FIND(\" \",'MYO Sonuç'!C41)+1,2)&REPT(\"*\",3)))","v":""},{"$f":"IF('MYO Sonuç'!D41=\"\",\"\",IF(ISERR(FIND(\" \",'MYO Sonuç'!D41))=TRUE,LEFT('MYO Sonuç'!D41,2)&REPT(\"*\",3),LEFT('MYO Sonuç'!D41,2)&REPT(\"*\",3)&\" \"&MID('MYO Sonuç'!D41,FIND(\" \",'MYO Sonuç'!D41)+1,2)&REPT(\"*\",3)))","v":""},{"$f":"IF('MYO Sonuç'!E41=\"\",\"\",'MYO Sonuç'!E41)","v":""},{"$f":"IF('MYO Sonuç'!F41=\"\",\"\",'MYO Sonuç'!F41)","v":""},{"$f":"IF('MYO Sonuç'!G41=\"\",\"\",'MYO Sonuç'!G41)","v":""},{"$f":"IF('MYO Sonuç'!H41=\"\",\"\",'MYO Sonuç'!H41)","v":""},{"$f":"IF('MYO Sonuç'!I41=\"\",\"\",'MYO Sonuç'!I41)","v":""},{"$f":"IF('MYO Sonuç'!J41=\"\",\"\",'MYO Sonuç'!J41)","v":""},{"$f":"IF('MYO Sonuç'!K41=\"\",\"\",'MYO Sonuç'!K41)","v":""},{"$f":"IF('MYO Sonuç'!L41=\"\",\"\",'MYO Sonuç'!L41)","v":""}]
[{"$f":"IF('MYO Sonuç'!A42=\"\",\"\",'MYO Sonuç'!A42)","v":""},{"$f":"IF('MYO Sonuç'!B42=\"\",\"\",LEFT('MYO Sonuç'!B42,3)&REPT(\"*\",4)&RIGHT('MYO Sonuç'!B42,2))","v":""},{"$f":"IF('MYO Sonuç'!C42=\"\",\"\",IF(ISERR(FIND(\" \",'MYO Sonuç'!C42))=TRUE,LEFT('MYO Sonuç'!C42,2)&REPT(\"*\",3),LEFT('MYO Sonuç'!C42,2)&REPT(\"*\",3)&\" \"&MID('MYO Sonuç'!C42,FIND(\" \",'MYO Sonuç'!C42)+1,2)&REPT(\"*\",3)))","v":""},{"$f":"IF('MYO Sonuç'!D42=\"\",\"\",IF(ISERR(FIND(\" \",'MYO Sonuç'!D42))=TRUE,LEFT('MYO Sonuç'!D42,2)&REPT(\"*\",3),LEFT('MYO Sonuç'!D42,2)&REPT(\"*\",3)&\" \"&MID('MYO Sonuç'!D42,FIND(\" \",'MYO Sonuç'!D42)+1,2)&REPT(\"*\",3)))","v":""},{"$f":"IF('MYO Sonuç'!E42=\"\",\"\",'MYO Sonuç'!E42)","v":""},{"$f":"IF('MYO Sonuç'!F42=\"\",\"\",'MYO Sonuç'!F42)","v":""},{"$f":"IF('MYO Sonuç'!G42=\"\",\"\",'MYO Sonuç'!G42)","v":""},{"$f":"IF('MYO Sonuç'!H42=\"\",\"\",'MYO Sonuç'!H42)","v":""},{"$f":"IF('MYO Sonuç'!I42=\"\",\"\",'MYO Sonuç'!I42)","v":""},{"$f":"IF('MYO Sonuç'!J42=\"\",\"\",'MYO Sonuç'!J42)","v":""},{"$f":"IF('MYO Sonuç'!K42=\"\",\"\",'MYO Sonuç'!K42)","v":""},{"$f":"IF('MYO Sonuç'!L42=\"\",\"\",'MYO Sonuç'!L42)","v":""}]
[{"$f":"IF('MYO Sonuç'!A43=\"\",\"\",'MYO Sonuç'!A43)","v":""},{"$f":"IF('MYO Sonuç'!B43=\"\",\"\",LEFT('MYO Sonuç'!B43,3)&REPT(\"*\",4)&RIGHT('MYO Sonuç'!B43,2))","v":""},{"$f":"IF('MYO Sonuç'!C43=\"\",\"\",IF(ISERR(FIND(\" \",'MYO Sonuç'!C43))=TRUE,LEFT('MYO Sonuç'!C43,2)&REPT(\"*\",3),LEFT('MYO Sonuç'!C43,2)&REPT(\"*\",3)&\" \"&MID('MYO Sonuç'!C43,FIND(\" \",'MYO Sonuç'!C43)+1,2)&REPT(\"*\",3)))","v":""},{"$f":"IF('MYO Sonuç'!D43=\"\",\"\",IF(ISERR(FIND(\" \",'MYO Sonuç'!D43))=TRUE,LEFT('MYO Sonuç'!D43,2)&REPT(\"*\",3),LEFT('MYO Sonuç'!D43,2)&REPT(\"*\",3)&\" \"&MID('MYO Sonuç'!D43,FIND(\" \",'MYO Sonuç'!D43)+1,2)&REPT(\"*\",3)))","v":""},{"$f":"IF('MYO Sonuç'!E43=\"\",\"\",'MYO Sonuç'!E43)","v":""},{"$f":"IF('MYO Sonuç'!F43=\"\",\"\",'MYO Sonuç'!F43)","v":""},{"$f":"IF('MYO Sonuç'!G43=\"\",\"\",'MYO Sonuç'!G43)","v":""},{"$f":"IF('MYO Sonuç'!H43=\"\",\"\",'MYO Sonuç'!H43)","v":""},{"$f":"IF('MYO Sonuç'!I43=\"\",\"\",'MYO Sonuç'!I43)","v":""},{"$f":"IF('MYO Sonuç'!J43=\"\",\"\",'MYO Sonuç'!J43)","v":""},{"$f":"IF('MYO Sonuç'!K43=\"\",\"\",'MYO Sonuç'!K43)","v":""},{"$f":"IF('MYO Sonuç'!L43=\"\",\"\",'MYO Sonuç'!L43)","v":""}]
[{"$f":"IF('MYO Sonuç'!A44=\"\",\"\",'MYO Sonuç'!A44)","v":""},{"$f":"IF('MYO Sonuç'!B44=\"\",\"\",LEFT('MYO Sonuç'!B44,3)&REPT(\"*\",4)&RIGHT('MYO Sonuç'!B44,2))","v":""},{"$f":"IF('MYO Sonuç'!C44=\"\",\"\",IF(ISERR(FIND(\" \",'MYO Sonuç'!C44))=TRUE,LEFT('MYO Sonuç'!C44,2)&REPT(\"*\",3),LEFT('MYO Sonuç'!C44,2)&REPT(\"*\",3)&\" \"&MID('MYO Sonuç'!C44,FIND(\" \",'MYO Sonuç'!C44)+1,2)&REPT(\"*\",3)))","v":""},{"$f":"IF('MYO Sonuç'!D44=\"\",\"\",IF(ISERR(FIND(\" \",'MYO Sonuç'!D44))=TRUE,LEFT('MYO Sonuç'!D44,2)&REPT(\"*\",3),LEFT('MYO Sonuç'!D44,2)&REPT(\"*\",3)&\" \"&MID('MYO Sonuç'!D44,FIND(\" \",'MYO Sonuç'!D44)+1,2)&REPT(\"*\",3)))","v":""},{"$f":"IF('MYO Sonuç'!E44=\"\",\"\",'MYO Sonuç'!E44)","v":""},{"$f":"IF('MYO Sonuç'!F44=\"\",\"\",'MYO Sonuç'!F44)","v":""},{"$f":"IF('MYO Sonuç'!G44=\"\",\"\",'MYO Sonuç'!G44)","v":""},{"$f":"IF('MYO Sonuç'!H44=\"\",\"\",'MYO Sonuç'!H44)","v":""},{"$f":"IF('MYO Sonuç'!I44=\"\",\"\",'MYO Sonuç'!I44)","v":""},{"$f":"IF('MYO Sonuç'!J44=\"\",\"\",'MYO Sonuç'!J44)","v":""},{"$f":"IF('MYO Sonuç'!K44=\"\",\"\",'MYO Sonuç'!K44)","v":""},{"$f":"IF('MYO Sonuç'!L44=\"\",\"\",'MYO Sonuç'!L44)","v":""}]
[{"$f":"IF('MYO Sonuç'!A45=\"\",\"\",'MYO Sonuç'!A45)","v":""},{"$f":"IF('MYO Sonuç'!B45=\"\",\"\",LEFT('MYO Sonuç'!B45,3)&REPT(\"*\",4)&RIGHT('MYO Sonuç'!B45,2))","v":""},{"$f":"IF('MYO Sonuç'!C45=\"\",\"\",IF(ISERR(FIND(\" \",'MYO Sonuç'!C45))=TRUE,LEFT('MYO Sonuç'!C45,2)&REPT(\"*\",3),LEFT('MYO Sonuç'!C45,2)&REPT(\"*\",3)&\" \"&MID('MYO Sonuç'!C45,FIND(\" \",'MYO Sonuç'!C45)+1,2)&REPT(\"*\",3)))","v":""},{"$f":"IF('MYO Sonuç'!D45=\"\",\"\",IF(ISERR(FIND(\" \",'MYO Sonuç'!D45))=TRUE,LEFT('MYO Sonuç'!D45,2)&REPT(\"*\",3),LEFT('MYO Sonuç'!D45,2)&REPT(\"*\",3)&\" \"&MID('MYO Sonuç'!D45,FIND(\" \",'MYO Sonuç'!D45)+1,2)&REPT(\"*\",3)))","v":""},{"$f":"IF('MYO Sonuç'!E45=\"\",\"\",'MYO Sonuç'!E45)","v":""},{"$f":"IF('MYO Sonuç'!F45=\"\",\"\",'MYO Sonuç'!F45)","v":""},{"$f":"IF('MYO Sonuç'!G45=\"\",\"\",'MYO Sonuç'!G45)","v":""},{"$f":"IF('MYO Sonuç'!H45=\"\",\"\",'MYO Sonuç'!H45)","v":""},{"$f":"IF('MYO Sonuç'!I45=\"\",\"\",'MYO Sonuç'!I45)","v":""},{"$f":"IF('MYO Sonuç'!J45=\"\",\"\",'MYO Sonuç'!J45)","v":""},{"$f":"IF('MYO Sonuç'!K45=\"\",\"\",'MYO Sonuç'!K45)","v":""},{"$f":"IF('MYO Sonuç'!L45=\"\",\"\",'MYO Sonuç'!L45)","v":""}]
[{"$f":"IF('MYO Sonuç'!A46=\"\",\"\",'MYO Sonuç'!A46)","v":""},{"$f":"IF('MYO Sonuç'!B46=\"\",\"\",LEFT('MYO Sonuç'!B46,3)&REPT(\"*\",4)&RIGHT('MYO Sonuç'!B46,2))","v":""},{"$f":"IF('MYO Sonuç'!C46=\"\",\"\",IF(ISERR(FIND(\" \",'MYO Sonuç'!C46))=TRUE,LEFT('MYO Sonuç'!C46,2)&REPT(\"*\",3),LEFT('MYO Sonuç'!C46,2)&REPT(\"*\",3)&\" \"&MID('MYO Sonuç'!C46,FIND(\" \",'MYO Sonuç'!C46)+1,2)&REPT(\"*\",3)))","v":""},{"$f":"IF('MYO Sonuç'!D46=\"\",\"\",IF(ISERR(FIND(\" \",'MYO Sonuç'!D46))=TRUE,LEFT('MYO Sonuç'!D46,2)&REPT(\"*\",3),LEFT('MYO Sonuç'!D46,2)&REPT(\"*\",3)&\" \"&MID('MYO Sonuç'!D46,FIND(\" \",'MYO Sonuç'!D46)+1,2)&REPT(\"*\",3)))","v":""},{"$f":"IF('MYO Sonuç'!E46=\"\",\"\",'MYO Sonuç'!E46)","v":""},{"$f":"IF('MYO Sonuç'!F46=\"\",\"\",'MYO Sonuç'!F46)","v":""},{"$f":"IF('MYO Sonuç'!G46=\"\",\"\",'MYO Sonuç'!G46)","v":""},{"$f":"IF('MYO Sonuç'!H46=\"\",\"\",'MYO Sonuç'!H46)","v":""},{"$f":"IF('MYO Sonuç'!I46=\"\",\"\",'MYO Sonuç'!I46)","v":""},{"$f":"IF('MYO Sonuç'!J46=\"\",\"\",'MYO Sonuç'!J46)","v":""},{"$f":"IF('MYO Sonuç'!K46=\"\",\"\",'MYO Sonuç'!K46)","v":""},{"$f":"IF('MYO Sonuç'!L46=\"\",\"\",'MYO Sonuç'!L46)","v":""}]
[{"$f":"IF('MYO Sonuç'!A47=\"\",\"\",'MYO Sonuç'!A47)","v":""},{"$f":"IF('MYO Sonuç'!B47=\"\",\"\",LEFT('MYO Sonuç'!B47,3)&REPT(\"*\",4)&RIGHT('MYO Sonuç'!B47,2))","v":""},{"$f":"IF('MYO Sonuç'!C47=\"\",\"\",IF(ISERR(FIND(\" \",'MYO Sonuç'!C47))=TRUE,LEFT('MYO Sonuç'!C47,2)&REPT(\"*\",3),LEFT('MYO Sonuç'!C47,2)&REPT(\"*\",3)&\" \"&MID('MYO Sonuç'!C47,FIND(\" \",'MYO Sonuç'!C47)+1,2)&REPT(\"*\",3)))","v":""},{"$f":"IF('MYO Sonuç'!D47=\"\",\"\",IF(ISERR(FIND(\" \",'MYO Sonuç'!D47))=TRUE,LEFT('MYO Sonuç'!D47,2)&REPT(\"*\",3),LEFT('MYO Sonuç'!D47,2)&REPT(\"*\",3)&\" \"&MID('MYO Sonuç'!D47,FIND(\" \",'MYO Sonuç'!D47)+1,2)&REPT(\"*\",3)))","v":""},{"$f":"IF('MYO Sonuç'!E47=\"\",\"\",'MYO Sonuç'!E47)","v":""},{"$f":"IF('MYO Sonuç'!F47=\"\",\"\",'MYO Sonuç'!F47)","v":""},{"$f":"IF('MYO Sonuç'!G47=\"\",\"\",'MYO Sonuç'!G47)","v":""},{"$f":"IF('MYO Sonuç'!H47=\"\",\"\",'MYO Sonuç'!H47)","v":""},{"$f":"IF('MYO Sonuç'!I47=\"\",\"\",'MYO Sonuç'!I47)","v":""},{"$f":"IF('MYO Sonuç'!J47=\"\",\"\",'MYO Sonuç'!J47)","v":""},{"$f":"IF('MYO Sonuç'!K47=\"\",\"\",'MYO Sonuç'!K47)","v":""},{"$f":"IF('MYO Sonuç'!L47=\"\",\"\",'MYO Sonuç'!L47)","v":""}]
[{"$f":"IF('MYO Sonuç'!A48=\"\",\"\",'MYO Sonuç'!A48)","v":""},{"$f":"IF('MYO Sonuç'!B48=\"\",\"\",LEFT('MYO Sonuç'!B48,3)&REPT(\"*\",4)&RIGHT('MYO Sonuç'!B48,2))","v":""},{"$f":"IF('MYO Sonuç'!C48=\"\",\"\",IF(ISERR(FIND(\" \",'MYO Sonuç'!C48))=TRUE,LEFT('MYO Sonuç'!C48,2)&REPT(\"*\",3),LEFT('MYO Sonuç'!C48,2)&REPT(\"*\",3)&\" \"&MID('MYO Sonuç'!C48,FIND(\" \",'MYO Sonuç'!C48)+1,2)&REPT(\"*\",3)))","v":""},{"$f":"IF('MYO Sonuç'!D48=\"\",\"\",IF(ISERR(FIND(\" \",'MYO Sonuç'!D48))=TRUE,LEFT('MYO Sonuç'!D48,2)&REPT(\"*\",3),LEFT('MYO Sonuç'!D48,2)&REPT(\"*\",3)&\" \"&MID('MYO Sonuç'!D48,FIND(\" \",'MYO Sonuç'!D48)+1,2)&REPT(\"*\",3)))","v":""},{"$f":"IF('MYO Sonuç'!E48=\"\",\"\",'MYO Sonuç'!E48)","v":""},{"$f":"IF('MYO Sonuç'!F48=\"\",\"\",'MYO Sonuç'!F48)","v":""},{"$f":"IF('MYO Sonuç'!G48=\"\",\"\",'MYO Sonuç'!G48)","v":""},{"$f":"IF('MYO Sonuç'!H48=\"\",\"\",'MYO Sonuç'!H48)","v":""},{"$f":"IF('MYO Sonuç'!I48=\"\",\"\",'MYO Sonuç'!I48)","v":""},{"$f":"IF('MYO Sonuç'!J48=\"\",\"\",'MYO Sonuç'!J48)","v":""},{"$f":"IF('MYO Sonuç'!K48=\"\",\"\",'MYO Sonuç'!K48)","v":""},{"$f":"IF('MYO Sonuç'!L48=\"\",\"\",'MYO Sonuç'!L48)","v":""}]
[{"$f":"IF('MYO Sonuç'!A49=\"\",\"\",'MYO Sonuç'!A49)","v":""},{"$f":"IF('MYO Sonuç'!B49=\"\",\"\",LEFT('MYO Sonuç'!B49,3)&REPT(\"*\",4)&RIGHT('MYO Sonuç'!B49,2))","v":""},{"$f":"IF('MYO Sonuç'!C49=\"\",\"\",IF(ISERR(FIND(\" \",'MYO Sonuç'!C49))=TRUE,LEFT('MYO Sonuç'!C49,2)&REPT(\"*\",3),LEFT('MYO Sonuç'!C49,2)&REPT(\"*\",3)&\" \"&MID('MYO Sonuç'!C49,FIND(\" \",'MYO Sonuç'!C49)+1,2)&REPT(\"*\",3)))","v":""},{"$f":"IF('MYO Sonuç'!D49=\"\",\"\",IF(ISERR(FIND(\" \",'MYO Sonuç'!D49))=TRUE,LEFT('MYO Sonuç'!D49,2)&REPT(\"*\",3),LEFT('MYO Sonuç'!D49,2)&REPT(\"*\",3)&\" \"&MID('MYO Sonuç'!D49,FIND(\" \",'MYO Sonuç'!D49)+1,2)&REPT(\"*\",3)))","v":""},{"$f":"IF('MYO Sonuç'!E49=\"\",\"\",'MYO Sonuç'!E49)","v":""},{"$f":"IF('MYO Sonuç'!F49=\"\",\"\",'MYO Sonuç'!F49)","v":""},{"$f":"IF('MYO Sonuç'!G49=\"\",\"\",'MYO Sonuç'!G49)","v":""},{"$f":"IF('MYO Sonuç'!H49=\"\",\"\",'MYO Sonuç'!H49)","v":""},{"$f":"IF('MYO Sonuç'!I49=\"\",\"\",'MYO Sonuç'!I49)","v":""},{"$f":"IF('MYO Sonuç'!J49=\"\",\"\",'MYO Sonuç'!J49)","v":""},{"$f":"IF('MYO Sonuç'!K49=\"\",\"\",'MYO Sonuç'!K49)","v":""},{"$f":"IF('MYO Sonuç'!L49=\"\",\"\",'MYO Sonuç'!L49)","v":""}]
[{"$f":"IF('MYO Sonuç'!A50=\"\",\"\",'MYO Sonuç'!A50)","v":""},{"$f":"IF('MYO Sonuç'!B50=\"\",\"\",LEFT('MYO Sonuç'!B50,3)&REPT(\"*\",4)&RIGHT('MYO Sonuç'!B50,2))","v":""},{"$f":"IF('MYO Sonuç'!C50=\"\",\"\",IF(ISERR(FIND(\" \",'MYO Sonuç'!C50))=TRUE,LEFT('MYO Sonuç'!C50,2)&REPT(\"*\",3),LEFT('MYO Sonuç'!C50,2)&REPT(\"*\",3)&\" \"&MID('MYO Sonuç'!C50,FIND(\" \",'MYO Sonuç'!C50)+1,2)&REPT(\"*\",3)))","v":""},{"$f":"IF('MYO Sonuç'!D50=\"\",\"\",IF(ISERR(FIND(\" \",'MYO Sonuç'!D50))=TRUE,LEFT('MYO Sonuç'!D50,2)&REPT(\"*\",3),LEFT('MYO Sonuç'!D50,2)&REPT(\"*\",3)&\" \"&MID('MYO Sonuç'!D50,FIND(\" \",'MYO Sonuç'!D50)+1,2)&REPT(\"*\",3)))","v":""},{"$f":"IF('MYO Sonuç'!E50=\"\",\"\",'MYO Sonuç'!E50)","v":""},{"$f":"IF('MYO Sonuç'!F50=\"\",\"\",'MYO Sonuç'!F50)","v":""},{"$f":"IF('MYO Sonuç'!G50=\"\",\"\",'MYO Sonuç'!G50)","v":""},{"$f":"IF('MYO Sonuç'!H50=\"\",\"\",'MYO Sonuç'!H50)","v":""},{"$f":"IF('MYO Sonuç'!I50=\"\",\"\",'MYO Sonuç'!I50)","v":""},{"$f":"IF('MYO Sonuç'!J50=\"\",\"\",'MYO Sonuç'!J50)","v":""},{"$f":"IF('MYO Sonuç'!K50=\"\",\"\",'MYO Sonuç'!K50)","v":""},{"$f":"IF('MYO Sonuç'!L50=\"\",\"\",'MYO Sonuç'!L50)","v":""}]
[{"$f":"IF('MYO Sonuç'!A51=\"\",\"\",'MYO Sonuç'!A51)","v":""},{"$f":"IF('MYO Sonuç'!B51=\"\",\"\",LEFT('MYO Sonuç'!B51,3)&REPT(\"*\",4)&RIGHT('MYO Sonuç'!B51,2))","v":""},{"$f":"IF('MYO Sonuç'!C51=\"\",\"\",IF(ISERR(FIND(\" \",'MYO Sonuç'!C51))=TRUE,LEFT('MYO Sonuç'!C51,2)&REPT(\"*\",3),LEFT('MYO Sonuç'!C51,2)&REPT(\"*\",3)&\" \"&MID('MYO Sonuç'!C51,FIND(\" \",'MYO Sonuç'!C51)+1,2)&REPT(\"*\",3)))","v":""},{"$f":"IF('MYO Sonuç'!D51=\"\",\"\",IF(ISERR(FIND(\" \",'MYO Sonuç'!D51))=TRUE,LEFT('MYO Sonuç'!D51,2)&REPT(\"*\",3),LEFT('MYO Sonuç'!D51,2)&REPT(\"*\",3)&\" \"&MID('MYO Sonuç'!D51,FIND(\" \",'MYO Sonuç'!D51)+1,2)&REPT(\"*\",3)))","v":""},{"$f":"IF('MYO Sonuç'!E51=\"\",\"\",'MYO Sonuç'!E51)","v":""},{"$f":"IF('MYO Sonuç'!F51=\"\",\"\",'MYO Sonuç'!F51)","v":""},{"$f":"IF('MYO Sonuç'!G51=\"\",\"\",'MYO Sonuç'!G51)","v":""},{"$f":"IF('MYO Sonuç'!H51=\"\",\"\",'MYO Sonuç'!H51)","v":""},{"$f":"IF('MYO Sonuç'!I51=\"\",\"\",'MYO Sonuç'!I51)","v":""},{"$f":"IF('MYO Sonuç'!J51=\"\",\"\",'MYO Sonuç'!J51)","v":""},{"$f":"IF('MYO Sonuç'!K51=\"\",\"\",'MYO Sonuç'!K51)","v":""},{"$f":"IF('MYO Sonuç'!L51=\"\",\"\",'MYO Sonuç'!L51)","v":""}]
[{"$f":"IF('MYO Sonuç'!A52=\"\",\"\",'MYO Sonuç'!A52)","v":""},{"$f":"IF('MYO Sonuç'!B52=\"\",\"\",LEFT('MYO Sonuç'!B52,3)&REPT(\"*\",4)&RIGHT('MYO Sonuç'!B52,2))","v":""},{"$f":"IF('MYO Sonuç'!C52=\"\",\"\",IF(ISERR(FIND(\" \",'MYO Sonuç'!C52))=TRUE,LEFT('MYO Sonuç'!C52,2)&REPT(\"*\",3),LEFT('MYO Sonuç'!C52,2)&REPT(\"*\",3)&\" \"&MID('MYO Sonuç'!C52,FIND(\" \",'MYO Sonuç'!C52)+1,2)&REPT(\"*\",3)))","v":""},{"$f":"IF('MYO Sonuç'!D52=\"\",\"\",IF(ISERR(FIND(\" \",'MYO Sonuç'!D52))=TRUE,LEFT('MYO Sonuç'!D52,2)&REPT(\"*\",3),LEFT('MYO Sonuç'!D52,2)&REPT(\"*\",3)&\" \"&MID('MYO Sonuç'!D52,FIND(\" \",'MYO Sonuç'!D52)+1,2)&REPT(\"*\",3)))","v":""},{"$f":"IF('MYO Sonuç'!E52=\"\",\"\",'MYO Sonuç'!E52)","v":""},{"$f":"IF('MYO Sonuç'!F52=\"\",\"\",'MYO Sonuç'!F52)","v":""},{"$f":"IF('MYO Sonuç'!G52=\"\",\"\",'MYO Sonuç'!G52)","v":""},{"$f":"IF('MYO Sonuç'!H52=\"\",\"\",'MYO Sonuç'!H52)","v":""},{"$f":"IF('MYO Sonuç'!I52=\"\",\"\",'MYO Sonuç'!I52)","v":""},{"$f":"IF('MYO Sonuç'!J52=\"\",\"\",'MYO Sonuç'!J52)","v":""},{"$f":"IF('MYO Sonuç'!K52=\"\",\"\",'MYO Sonuç'!K52)","v":""},{"$f":"IF('MYO Sonuç'!L52=\"\",\"\",'MYO Sonuç'!L52)","v":""}]
[{"$f":"IF('MYO Sonuç'!A53=\"\",\"\",'MYO Sonuç'!A53)","v":""},{"$f":"IF('MYO Sonuç'!B53=\"\",\"\",LEFT('MYO Sonuç'!B53,3)&REPT(\"*\",4)&RIGHT('MYO Sonuç'!B53,2))","v":""},{"$f":"IF('MYO Sonuç'!C53=\"\",\"\",IF(ISERR(FIND(\" \",'MYO Sonuç'!C53))=TRUE,LEFT('MYO Sonuç'!C53,2)&REPT(\"*\",3),LEFT('MYO Sonuç'!C53,2)&REPT(\"*\",3)&\" \"&MID('MYO Sonuç'!C53,FIND(\" \",'MYO Sonuç'!C53)+1,2)&REPT(\"*\",3)))","v":""},{"$f":"IF('MYO Sonuç'!D53=\"\",\"\",IF(ISERR(FIND(\" \",'MYO Sonuç'!D53))=TRUE,LEFT('MYO Sonuç'!D53,2)&REPT(\"*\",3),LEFT('MYO Sonuç'!D53,2)&REPT(\"*\",3)&\" \"&MID('MYO Sonuç'!D53,FIND(\" \",'MYO Sonuç'!D53)+1,2)&REPT(\"*\",3)))","v":""},{"$f":"IF('MYO Sonuç'!E53=\"\",\"\",'MYO Sonuç'!E53)","v":""},{"$f":"IF('MYO Sonuç'!F53=\"\",\"\",'MYO Sonuç'!F53)","v":""},{"$f":"IF('MYO Sonuç'!G53=\"\",\"\",'MYO Sonuç'!G53)","v":""},{"$f":"IF('MYO Sonuç'!H53=\"\",\"\",'MYO Sonuç'!H53)","v":""},{"$f":"IF('MYO Sonuç'!I53=\"\",\"\",'MYO Sonuç'!I53)","v":""},{"$f":"IF('MYO Sonuç'!J53=\"\",\"\",'MYO Sonuç'!J53)","v":""},{"$f":"IF('MYO Sonuç'!K53=\"\",\"\",'MYO Sonuç'!K53)","v":""},{"$f":"IF('MYO Sonuç'!L53=\"\",\"\",'MYO Sonuç'!L53)","v":""}]
[{"$f":"IF('MYO Sonuç'!A54=\"\",\"\",'MYO Sonuç'!A54)","v":""},{"$f":"IF('MYO Sonuç'!B54=\"\",\"\",LEFT('MYO Sonuç'!B54,3)&REPT(\"*\",4)&RIGHT('MYO Sonuç'!B54,2))","v":""},{"$f":"IF('MYO Sonuç'!C54=\"\",\"\",IF(ISERR(FIND(\" \",'MYO Sonuç'!C54))=TRUE,LEFT('MYO Sonuç'!C54,2)&REPT(\"*\",3),LEFT('MYO Sonuç'!C54,2)&REPT(\"*\",3)&\" \"&MID('MYO Sonuç'!C54,FIND(\" \",'MYO Sonuç'!C54)+1,2)&REPT(\"*\",3)))","v":""},{"$f":"IF('MYO Sonuç'!D54=\"\",\"\",IF(ISERR(FIND(\" \",'MYO Sonuç'!D54))=TRUE,LEFT('MYO Sonuç'!D54,2)&REPT(\"*\",3),LEFT('MYO Sonuç'!D54,2)&REPT(\"*\",3)&\" \"&MID('MYO Sonuç'!D54,FIND(\" \",'MYO Sonuç'!D54)+1,2)&REPT(\"*\",3)))","v":""},{"$f":"IF('MYO Sonuç'!E54=\"\",\"\",'MYO Sonuç'!E54)","v":""},{"$f":"IF('MYO Sonuç'!F54=\"\",\"\",'MYO Sonuç'!F54)","v":""},{"$f":"IF('MYO Sonuç'!G54=\"\",\"\",'MYO Sonuç'!G54)","v":""},{"$f":"IF('MYO Sonuç'!H54=\"\",\"\",'MYO Sonuç'!H54)","v":""},{"$f":"IF('MYO Sonuç'!I54=\"\",\"\",'MYO Sonuç'!I54)","v":""},{"$f":"IF('MYO Sonuç'!J54=\"\",\"\",'MYO Sonuç'!J54)","v":""},{"$f":"IF('MYO Sonuç'!K54=\"\",\"\",'MYO Sonuç'!K54)","v":""},{"$f":"IF('MYO Sonuç'!L54=\"\",\"\",'MYO Sonuç'!L54)","v":""}]
[{"$f":"IF('MYO Sonuç'!A55=\"\",\"\",'MYO Sonuç'!A55)","v":""},{"$f":"IF('MYO Sonuç'!B55=\"\",\"\",LEFT('MYO Sonuç'!B55,3)&REPT(\"*\",4)&RIGHT('MYO Sonuç'!B55,2))","v":""},{"$f":"IF('MYO Sonuç'!C55=\"\",\"\",IF(ISERR(FIND(\" \",'MYO Sonuç'!C55))=TRUE,LEFT('MYO Sonuç'!C55,2)&REPT(\"*\",3),LEFT('MYO Sonuç'!C55,2)&REPT(\"*\",3)&\" \"&MID('MYO Sonuç'!C55,FIND(\" \",'MYO Sonuç'!C55)+1,2)&REPT(\"*\",3)))","v":""},{"$f":"IF('MYO Sonuç'!D55=\"\",\"\",IF(ISERR(FIND(\" \",'MYO Sonuç'!D55))=TRUE,LEFT('MYO Sonuç'!D55,2)&REPT(\"*\",3),LEFT('MYO Sonuç'!D55,2)&REPT(\"*\",3)&\" \"&MID('MYO Sonuç'!D55,FIND(\" \",'MYO Sonuç'!D55)+1,2)&REPT(\"*\",3)))","v":""},{"$f":"IF('MYO Sonuç'!E55=\"\",\"\",'MYO Sonuç'!E55)","v":""},{"$f":"IF('MYO Sonuç'!F55=\"\",\"\",'MYO Sonuç'!F55)","v":""},{"$f":"IF('MYO Sonuç'!G55=\"\",\"\",'MYO Sonuç'!G55)","v":""},{"$f":"IF('MYO Sonuç'!H55=\"\",\"\",'MYO Sonuç'!H55)","v":""},{"$f":"IF('MYO Sonuç'!I55=\"\",\"\",'MYO Sonuç'!I55)","v":""},{"$f":"IF('MYO Sonuç'!J55=\"\",\"\",'MYO Sonuç'!J55)","v":""},{"$f":"IF('MYO Sonuç'!K55=\"\",\"\",'MYO Sonuç'!K55)","v":""},{"$f":"IF('MYO Sonuç'!L55=\"\",\"\",'MYO Sonuç'!L55)","v":""}]
[{"$f":"IF('MYO Sonuç'!A56=\"\",\"\",'MYO Sonuç'!A56)","v":""},{"$f":"IF('MYO Sonuç'!B56=\"\",\"\",LEFT('MYO Sonuç'!B56,3)&REPT(\"*\",4)&RIGHT('MYO Sonuç'!B56,2))","v":""},{"$f":"IF('MYO Sonuç'!C56=\"\",\"\",IF(ISERR(FIND(\" \",'MYO Sonuç'!C56))=TRUE,LEFT('MYO Sonuç'!C56,2)&REPT(\"*\",3),LEFT('MYO Sonuç'!C56,2)&REPT(\"*\",3)&\" \"&MID('MYO Sonuç'!C56,FIND(\" \",'MYO Sonuç'!C56)+1,2)&REPT(\"*\",3)))","v":""},{"$f":"IF('MYO Sonuç'!D56=\"\",\"\",IF(ISERR(FIND(\" \",'MYO Sonuç'!D56))=TRUE,LEFT('MYO Sonuç'!D56,2)&REPT(\"*\",3),LEFT('MYO Sonuç'!D56,2)&REPT(\"*\",3)&\" \"&MID('MYO Sonuç'!D56,FIND(\" \",'MYO Sonuç'!D56)+1,2)&REPT(\"*\",3)))","v":""},{"$f":"IF('MYO Sonuç'!E56=\"\",\"\",'MYO Sonuç'!E56)","v":""},{"$f":"IF('MYO Sonuç'!F56=\"\",\"\",'MYO Sonuç'!F56)","v":""},{"$f":"IF('MYO Sonuç'!G56=\"\",\"\",'MYO Sonuç'!G56)","v":""},{"$f":"IF('MYO Sonuç'!H56=\"\",\"\",'MYO Sonuç'!H56)","v":""},{"$f":"IF('MYO Sonuç'!I56=\"\",\"\",'MYO Sonuç'!I56)","v":""},{"$f":"IF('MYO Sonuç'!J56=\"\",\"\",'MYO Sonuç'!J56)","v":""},{"$f":"IF('MYO Sonuç'!K56=\"\",\"\",'MYO Sonuç'!K56)","v":""},{"$f":"IF('MYO Sonuç'!L56=\"\",\"\",'MYO Sonuç'!L56)","v":""}]
[{"$f":"IF('MYO Sonuç'!A57=\"\",\"\",'MYO Sonuç'!A57)","v":""},{"$f":"IF('MYO Sonuç'!B57=\"\",\"\",LEFT('MYO Sonuç'!B57,3)&REPT(\"*\",4)&RIGHT('MYO Sonuç'!B57,2))","v":""},{"$f":"IF('MYO Sonuç'!C57=\"\",\"\",IF(ISERR(FIND(\" \",'MYO Sonuç'!C57))=TRUE,LEFT('MYO Sonuç'!C57,2)&REPT(\"*\",3),LEFT('MYO Sonuç'!C57,2)&REPT(\"*\",3)&\" \"&MID('MYO Sonuç'!C57,FIND(\" \",'MYO Sonuç'!C57)+1,2)&REPT(\"*\",3)))","v":""},{"$f":"IF('MYO Sonuç'!D57=\"\",\"\",IF(ISERR(FIND(\" \",'MYO Sonuç'!D57))=TRUE,LEFT('MYO Sonuç'!D57,2)&REPT(\"*\",3),LEFT('MYO Sonuç'!D57,2)&REPT(\"*\",3)&\" \"&MID('MYO Sonuç'!D57,FIND(\" \",'MYO Sonuç'!D57)+1,2)&REPT(\"*\",3)))","v":""},{"$f":"IF('MYO Sonuç'!E57=\"\",\"\",'MYO Sonuç'!E57)","v":""},{"$f":"IF('MYO Sonuç'!F57=\"\",\"\",'MYO Sonuç'!F57)","v":""},{"$f":"IF('MYO Sonuç'!G57=\"\",\"\",'MYO Sonuç'!G57)","v":""},{"$f":"IF('MYO Sonuç'!H57=\"\",\"\",'MYO Sonuç'!H57)","v":""},{"$f":"IF('MYO Sonuç'!I57=\"\",\"\",'MYO Sonuç'!I57)","v":""},{"$f":"IF('MYO Sonuç'!J57=\"\",\"\",'MYO Sonuç'!J57)","v":""},{"$f":"IF('MYO Sonuç'!K57=\"\",\"\",'MYO Sonuç'!K57)","v":""},{"$f":"IF('MYO Sonuç'!L57=\"\",\"\",'MYO Sonuç'!L57)","v":""}]
[{"$f":"IF('MYO Sonuç'!A58=\"\",\"\",'MYO Sonuç'!A58)","v":""},{"$f":"IF('MYO Sonuç'!B58=\"\",\"\",LEFT('MYO Sonuç'!B58,3)&REPT(\"*\",4)&RIGHT('MYO Sonuç'!B58,2))","v":""},{"$f":"IF('MYO Sonuç'!C58=\"\",\"\",IF(ISERR(FIND(\" \",'MYO Sonuç'!C58))=TRUE,LEFT('MYO Sonuç'!C58,2)&REPT(\"*\",3),LEFT('MYO Sonuç'!C58,2)&REPT(\"*\",3)&\" \"&MID('MYO Sonuç'!C58,FIND(\" \",'MYO Sonuç'!C58)+1,2)&REPT(\"*\",3)))","v":""},{"$f":"IF('MYO Sonuç'!D58=\"\",\"\",IF(ISERR(FIND(\" \",'MYO Sonuç'!D58))=TRUE,LEFT('MYO Sonuç'!D58,2)&REPT(\"*\",3),LEFT('MYO Sonuç'!D58,2)&REPT(\"*\",3)&\" \"&MID('MYO Sonuç'!D58,FIND(\" \",'MYO Sonuç'!D58)+1,2)&REPT(\"*\",3)))","v":""},{"$f":"IF('MYO Sonuç'!E58=\"\",\"\",'MYO Sonuç'!E58)","v":""},{"$f":"IF('MYO Sonuç'!F58=\"\",\"\",'MYO Sonuç'!F58)","v":""},{"$f":"IF('MYO Sonuç'!G58=\"\",\"\",'MYO Sonuç'!G58)","v":""},{"$f":"IF('MYO Sonuç'!H58=\"\",\"\",'MYO Sonuç'!H58)","v":""},{"$f":"IF('MYO Sonuç'!I58=\"\",\"\",'MYO Sonuç'!I58)","v":""},{"$f":"IF('MYO Sonuç'!J58=\"\",\"\",'MYO Sonuç'!J58)","v":""},{"$f":"IF('MYO Sonuç'!K58=\"\",\"\",'MYO Sonuç'!K58)","v":""},{"$f":"IF('MYO Sonuç'!L58=\"\",\"\",'MYO Sonuç'!L58)","v":""}]
[{"$f":"IF('MYO Sonuç'!A59=\"\",\"\",'MYO Sonuç'!A59)","v":""},{"$f":"IF('MYO Sonuç'!B59=\"\",\"\",LEFT('MYO Sonuç'!B59,3)&REPT(\"*\",4)&RIGHT('MYO Sonuç'!B59,2))","v":""},{"$f":"IF('MYO Sonuç'!C59=\"\",\"\",IF(ISERR(FIND(\" \",'MYO Sonuç'!C59))=TRUE,LEFT('MYO Sonuç'!C59,2)&REPT(\"*\",3),LEFT('MYO Sonuç'!C59,2)&REPT(\"*\",3)&\" \"&MID('MYO Sonuç'!C59,FIND(\" \",'MYO Sonuç'!C59)+1,2)&REPT(\"*\",3)))","v":""},{"$f":"IF('MYO Sonuç'!D59=\"\",\"\",IF(ISERR(FIND(\" \",'MYO Sonuç'!D59))=TRUE,LEFT('MYO Sonuç'!D59,2)&REPT(\"*\",3),LEFT('MYO Sonuç'!D59,2)&REPT(\"*\",3)&\" \"&MID('MYO Sonuç'!D59,FIND(\" \",'MYO Sonuç'!D59)+1,2)&REPT(\"*\",3)))","v":""},{"$f":"IF('MYO Sonuç'!E59=\"\",\"\",'MYO Sonuç'!E59)","v":""},{"$f":"IF('MYO Sonuç'!F59=\"\",\"\",'MYO Sonuç'!F59)","v":""},{"$f":"IF('MYO Sonuç'!G59=\"\",\"\",'MYO Sonuç'!G59)","v":""},{"$f":"IF('MYO Sonuç'!H59=\"\",\"\",'MYO Sonuç'!H59)","v":""},{"$f":"IF('MYO Sonuç'!I59=\"\",\"\",'MYO Sonuç'!I59)","v":""},{"$f":"IF('MYO Sonuç'!J59=\"\",\"\",'MYO Sonuç'!J59)","v":""},{"$f":"IF('MYO Sonuç'!K59=\"\",\"\",'MYO Sonuç'!K59)","v":""},{"$f":"IF('MYO Sonuç'!L59=\"\",\"\",'MYO Sonuç'!L59)","v":""}]
[{"$f":"IF('MYO Sonuç'!A60=\"\",\"\",'MYO Sonuç'!A60)","v":""},{"$f":"IF('MYO Sonuç'!B60=\"\",\"\",LEFT('MYO Sonuç'!B60,3)&REPT(\"*\",4)&RIGHT('MYO Sonuç'!B60,2))","v":""},{"$f":"IF('MYO Sonuç'!C60=\"\",\"\",IF(ISERR(FIND(\" \",'MYO Sonuç'!C60))=TRUE,LEFT('MYO Sonuç'!C60,2)&REPT(\"*\",3),LEFT('MYO Sonuç'!C60,2)&REPT(\"*\",3)&\" \"&MID('MYO Sonuç'!C60,FIND(\" \",'MYO Sonuç'!C60)+1,2)&REPT(\"*\",3)))","v":""},{"$f":"IF('MYO Sonuç'!D60=\"\",\"\",IF(ISERR(FIND(\" \",'MYO Sonuç'!D60))=TRUE,LEFT('MYO Sonuç'!D60,2)&REPT(\"*\",3),LEFT('MYO Sonuç'!D60,2)&REPT(\"*\",3)&\" \"&MID('MYO Sonuç'!D60,FIND(\" \",'MYO Sonuç'!D60)+1,2)&REPT(\"*\",3)))","v":""},{"$f":"IF('MYO Sonuç'!E60=\"\",\"\",'MYO Sonuç'!E60)","v":""},{"$f":"IF('MYO Sonuç'!F60=\"\",\"\",'MYO Sonuç'!F60)","v":""},{"$f":"IF('MYO Sonuç'!G60=\"\",\"\",'MYO Sonuç'!G60)","v":""},{"$f":"IF('MYO Sonuç'!H60=\"\",\"\",'MYO Sonuç'!H60)","v":""},{"$f":"IF('MYO Sonuç'!I60=\"\",\"\",'MYO Sonuç'!I60)","v":""},{"$f":"IF('MYO Sonuç'!J60=\"\",\"\",'MYO Sonuç'!J60)","v":""},{"$f":"IF('MYO Sonuç'!K60=\"\",\"\",'MYO Sonuç'!K60)","v":""},{"$f":"IF('MYO Sonuç'!L60=\"\",\"\",'MYO Sonuç'!L60)","v":""}]
[{"$f":"IF('MYO Sonuç'!A61=\"\",\"\",'MYO Sonuç'!A61)","v":""},{"$f":"IF('MYO Sonuç'!B61=\"\",\"\",LEFT('MYO Sonuç'!B61,3)&REPT(\"*\",4)&RIGHT('MYO Sonuç'!B61,2))","v":""},{"$f":"IF('MYO Sonuç'!C61=\"\",\"\",IF(ISERR(FIND(\" \",'MYO Sonuç'!C61))=TRUE,LEFT('MYO Sonuç'!C61,2)&REPT(\"*\",3),LEFT('MYO Sonuç'!C61,2)&REPT(\"*\",3)&\" \"&MID('MYO Sonuç'!C61,FIND(\" \",'MYO Sonuç'!C61)+1,2)&REPT(\"*\",3)))","v":""},{"$f":"IF('MYO Sonuç'!D61=\"\",\"\",IF(ISERR(FIND(\" \",'MYO Sonuç'!D61))=TRUE,LEFT('MYO Sonuç'!D61,2)&REPT(\"*\",3),LEFT('MYO Sonuç'!D61,2)&REPT(\"*\",3)&\" \"&MID('MYO Sonuç'!D61,FIND(\" \",'MYO Sonuç'!D61)+1,2)&REPT(\"*\",3)))","v":""},{"$f":"IF('MYO Sonuç'!E61=\"\",\"\",'MYO Sonuç'!E61)","v":""},{"$f":"IF('MYO Sonuç'!F61=\"\",\"\",'MYO Sonuç'!F61)","v":""},{"$f":"IF('MYO Sonuç'!G61=\"\",\"\",'MYO Sonuç'!G61)","v":""},{"$f":"IF('MYO Sonuç'!H61=\"\",\"\",'MYO Sonuç'!H61)","v":""},{"$f":"IF('MYO Sonuç'!I61=\"\",\"\",'MYO Sonuç'!I61)","v":""},{"$f":"IF('MYO Sonuç'!J61=\"\",\"\",'MYO Sonuç'!J61)","v":""},{"$f":"IF('MYO Sonuç'!K61=\"\",\"\",'MYO Sonuç'!K61)","v":""},{"$f":"IF('MYO Sonuç'!L61=\"\",\"\",'MYO Sonuç'!L61)","v":""}]
[{"$f":"IF('MYO Sonuç'!A62=\"\",\"\",'MYO Sonuç'!A62)","v":""},{"$f":"IF('MYO Sonuç'!B62=\"\",\"\",LEFT('MYO Sonuç'!B62,3)&REPT(\"*\",4)&RIGHT('MYO Sonuç'!B62,2))","v":""},{"$f":"IF('MYO Sonuç'!C62=\"\",\"\",IF(ISERR(FIND(\" \",'MYO Sonuç'!C62))=TRUE,LEFT('MYO Sonuç'!C62,2)&REPT(\"*\",3),LEFT('MYO Sonuç'!C62,2)&REPT(\"*\",3)&\" \"&MID('MYO Sonuç'!C62,FIND(\" \",'MYO Sonuç'!C62)+1,2)&REPT(\"*\",3)))","v":""},{"$f":"IF('MYO Sonuç'!D62=\"\",\"\",IF(ISERR(FIND(\" \",'MYO Sonuç'!D62))=TRUE,LEFT('MYO Sonuç'!D62,2)&REPT(\"*\",3),LEFT('MYO Sonuç'!D62,2)&REPT(\"*\",3)&\" \"&MID('MYO Sonuç'!D62,FIND(\" \",'MYO Sonuç'!D62)+1,2)&REPT(\"*\",3)))","v":""},{"$f":"IF('MYO Sonuç'!E62=\"\",\"\",'MYO Sonuç'!E62)","v":""},{"$f":"IF('MYO Sonuç'!F62=\"\",\"\",'MYO Sonuç'!F62)","v":""},{"$f":"IF('MYO Sonuç'!G62=\"\",\"\",'MYO Sonuç'!G62)","v":""},{"$f":"IF('MYO Sonuç'!H62=\"\",\"\",'MYO Sonuç'!H62)","v":""},{"$f":"IF('MYO Sonuç'!I62=\"\",\"\",'MYO Sonuç'!I62)","v":""},{"$f":"IF('MYO Sonuç'!J62=\"\",\"\",'MYO Sonuç'!J62)","v":""},{"$f":"IF('MYO Sonuç'!K62=\"\",\"\",'MYO Sonuç'!K62)","v":""},{"$f":"IF('MYO Sonuç'!L62=\"\",\"\",'MYO Sonuç'!L62)","v":""}]
[{"$f":"IF('MYO Sonuç'!A63=\"\",\"\",'MYO Sonuç'!A63)","v":""},{"$f":"IF('MYO Sonuç'!B63=\"\",\"\",LEFT('MYO Sonuç'!B63,3)&REPT(\"*\",4)&RIGHT('MYO Sonuç'!B63,2))","v":""},{"$f":"IF('MYO Sonuç'!C63=\"\",\"\",IF(ISERR(FIND(\" \",'MYO Sonuç'!C63))=TRUE,LEFT('MYO Sonuç'!C63,2)&REPT(\"*\",3),LEFT('MYO Sonuç'!C63,2)&REPT(\"*\",3)&\" \"&MID('MYO Sonuç'!C63,FIND(\" \",'MYO Sonuç'!C63)+1,2)&REPT(\"*\",3)))","v":""},{"$f":"IF('MYO Sonuç'!D63=\"\",\"\",IF(ISERR(FIND(\" \",'MYO Sonuç'!D63))=TRUE,LEFT('MYO Sonuç'!D63,2)&REPT(\"*\",3),LEFT('MYO Sonuç'!D63,2)&REPT(\"*\",3)&\" \"&MID('MYO Sonuç'!D63,FIND(\" \",'MYO Sonuç'!D63)+1,2)&REPT(\"*\",3)))","v":""},{"$f":"IF('MYO Sonuç'!E63=\"\",\"\",'MYO Sonuç'!E63)","v":""},{"$f":"IF('MYO Sonuç'!F63=\"\",\"\",'MYO Sonuç'!F63)","v":""},{"$f":"IF('MYO Sonuç'!G63=\"\",\"\",'MYO Sonuç'!G63)","v":""},{"$f":"IF('MYO Sonuç'!H63=\"\",\"\",'MYO Sonuç'!H63)","v":""},{"$f":"IF('MYO Sonuç'!I63=\"\",\"\",'MYO Sonuç'!I63)","v":""},{"$f":"IF('MYO Sonuç'!J63=\"\",\"\",'MYO Sonuç'!J63)","v":""},{"$f":"IF('MYO Sonuç'!K63=\"\",\"\",'MYO Sonuç'!K63)","v":""},{"$f":"IF('MYO Sonuç'!L63=\"\",\"\",'MYO Sonuç'!L63)","v":""}]
[{"$f":"IF('MYO Sonuç'!A64=\"\",\"\",'MYO Sonuç'!A64)","v":""},{"$f":"IF('MYO Sonuç'!B64=\"\",\"\",LEFT('MYO Sonuç'!B64,3)&REPT(\"*\",4)&RIGHT('MYO Sonuç'!B64,2))","v":""},{"$f":"IF('MYO Sonuç'!C64=\"\",\"\",IF(ISERR(FIND(\" \",'MYO Sonuç'!C64))=TRUE,LEFT('MYO Sonuç'!C64,2)&REPT(\"*\",3),LEFT('MYO Sonuç'!C64,2)&REPT(\"*\",3)&\" \"&MID('MYO Sonuç'!C64,FIND(\" \",'MYO Sonuç'!C64)+1,2)&REPT(\"*\",3)))","v":""},{"$f":"IF('MYO Sonuç'!D64=\"\",\"\",IF(ISERR(FIND(\" \",'MYO Sonuç'!D64))=TRUE,LEFT('MYO Sonuç'!D64,2)&REPT(\"*\",3),LEFT('MYO Sonuç'!D64,2)&REPT(\"*\",3)&\" \"&MID('MYO Sonuç'!D64,FIND(\" \",'MYO Sonuç'!D64)+1,2)&REPT(\"*\",3)))","v":""},{"$f":"IF('MYO Sonuç'!E64=\"\",\"\",'MYO Sonuç'!E64)","v":""},{"$f":"IF('MYO Sonuç'!F64=\"\",\"\",'MYO Sonuç'!F64)","v":""},{"$f":"IF('MYO Sonuç'!G64=\"\",\"\",'MYO Sonuç'!G64)","v":""},{"$f":"IF('MYO Sonuç'!H64=\"\",\"\",'MYO Sonuç'!H64)","v":""},{"$f":"IF('MYO Sonuç'!I64=\"\",\"\",'MYO Sonuç'!I64)","v":""},{"$f":"IF('MYO Sonuç'!J64=\"\",\"\",'MYO Sonuç'!J64)","v":""},{"$f":"IF('MYO Sonuç'!K64=\"\",\"\",'MYO Sonuç'!K64)","v":""},{"$f":"IF('MYO Sonuç'!L64=\"\",\"\",'MYO Sonuç'!L64)","v":""}]
[{"$f":"IF('MYO Sonuç'!A65=\"\",\"\",'MYO Sonuç'!A65)","v":""},{"$f":"IF('MYO Sonuç'!B65=\"\",\"\",LEFT('MYO Sonuç'!B65,3)&REPT(\"*\",4)&RIGHT('MYO Sonuç'!B65,2))","v":""},{"$f":"IF('MYO Sonuç'!C65=\"\",\"\",IF(ISERR(FIND(\" \",'MYO Sonuç'!C65))=TRUE,LEFT('MYO Sonuç'!C65,2)&REPT(\"*\",3),LEFT('MYO Sonuç'!C65,2)&REPT(\"*\",3)&\" \"&MID('MYO Sonuç'!C65,FIND(\" \",'MYO Sonuç'!C65)+1,2)&REPT(\"*\",3)))","v":""},{"$f":"IF('MYO Sonuç'!D65=\"\",\"\",IF(ISERR(FIND(\" \",'MYO Sonuç'!D65))=TRUE,LEFT('MYO Sonuç'!D65,2)&REPT(\"*\",3),LEFT('MYO Sonuç'!D65,2)&REPT(\"*\",3)&\" \"&MID('MYO Sonuç'!D65,FIND(\" \",'MYO Sonuç'!D65)+1,2)&REPT(\"*\",3)))","v":""},{"$f":"IF('MYO Sonuç'!E65=\"\",\"\",'MYO Sonuç'!E65)","v":""},{"$f":"IF('MYO Sonuç'!F65=\"\",\"\",'MYO Sonuç'!F65)","v":""},{"$f":"IF('MYO Sonuç'!G65=\"\",\"\",'MYO Sonuç'!G65)","v":""},{"$f":"IF('MYO Sonuç'!H65=\"\",\"\",'MYO Sonuç'!H65)","v":""},{"$f":"IF('MYO Sonuç'!I65=\"\",\"\",'MYO Sonuç'!I65)","v":""},{"$f":"IF('MYO Sonuç'!J65=\"\",\"\",'MYO Sonuç'!J65)","v":""},{"$f":"IF('MYO Sonuç'!K65=\"\",\"\",'MYO Sonuç'!K65)","v":""},{"$f":"IF('MYO Sonuç'!L65=\"\",\"\",'MYO Sonuç'!L65)","v":""}]
[{"$f":"IF('MYO Sonuç'!A66=\"\",\"\",'MYO Sonuç'!A66)","v":""},{"$f":"IF('MYO Sonuç'!B66=\"\",\"\",LEFT('MYO Sonuç'!B66,3)&REPT(\"*\",4)&RIGHT('MYO Sonuç'!B66,2))","v":""},{"$f":"IF('MYO Sonuç'!C66=\"\",\"\",IF(ISERR(FIND(\" \",'MYO Sonuç'!C66))=TRUE,LEFT('MYO Sonuç'!C66,2)&REPT(\"*\",3),LEFT('MYO Sonuç'!C66,2)&REPT(\"*\",3)&\" \"&MID('MYO Sonuç'!C66,FIND(\" \",'MYO Sonuç'!C66)+1,2)&REPT(\"*\",3)))","v":""},{"$f":"IF('MYO Sonuç'!D66=\"\",\"\",IF(ISERR(FIND(\" \",'MYO Sonuç'!D66))=TRUE,LEFT('MYO Sonuç'!D66,2)&REPT(\"*\",3),LEFT('MYO Sonuç'!D66,2)&REPT(\"*\",3)&\" \"&MID('MYO Sonuç'!D66,FIND(\" \",'MYO Sonuç'!D66)+1,2)&REPT(\"*\",3)))","v":""},{"$f":"IF('MYO Sonuç'!E66=\"\",\"\",'MYO Sonuç'!E66)","v":""},{"$f":"IF('MYO Sonuç'!F66=\"\",\"\",'MYO Sonuç'!F66)","v":""},{"$f":"IF('MYO Sonuç'!G66=\"\",\"\",'MYO Sonuç'!G66)","v":""},{"$f":"IF('MYO Sonuç'!H66=\"\",\"\",'MYO Sonuç'!H66)","v":""},{"$f":"IF('MYO Sonuç'!I66=\"\",\"\",'MYO Sonuç'!I66)","v":""},{"$f":"IF('MYO Sonuç'!J66=\"\",\"\",'MYO Sonuç'!J66)","v":""},{"$f":"IF('MYO Sonuç'!K66=\"\",\"\",'MYO Sonuç'!K66)","v":""},{"$f":"IF('MYO Sonuç'!L66=\"\",\"\",'MYO Sonuç'!L66)","v":""}]
[{"$f":"IF('MYO Sonuç'!A67=\"\",\"\",'MYO Sonuç'!A67)","v":""},{"$f":"IF('MYO Sonuç'!B67=\"\",\"\",LEFT('MYO Sonuç'!B67,3)&REPT(\"*\",4)&RIGHT('MYO Sonuç'!B67,2))","v":""},{"$f":"IF('MYO Sonuç'!C67=\"\",\"\",IF(ISERR(FIND(\" \",'MYO Sonuç'!C67))=TRUE,LEFT('MYO Sonuç'!C67,2)&REPT(\"*\",3),LEFT('MYO Sonuç'!C67,2)&REPT(\"*\",3)&\" \"&MID('MYO Sonuç'!C67,FIND(\" \",'MYO Sonuç'!C67)+1,2)&REPT(\"*\",3)))","v":""},{"$f":"IF('MYO Sonuç'!D67=\"\",\"\",IF(ISERR(FIND(\" \",'MYO Sonuç'!D67))=TRUE,LEFT('MYO Sonuç'!D67,2)&REPT(\"*\",3),LEFT('MYO Sonuç'!D67,2)&REPT(\"*\",3)&\" \"&MID('MYO Sonuç'!D67,FIND(\" \",'MYO Sonuç'!D67)+1,2)&REPT(\"*\",3)))","v":""},{"$f":"IF('MYO Sonuç'!E67=\"\",\"\",'MYO Sonuç'!E67)","v":""},{"$f":"IF('MYO Sonuç'!F67=\"\",\"\",'MYO Sonuç'!F67)","v":""},{"$f":"IF('MYO Sonuç'!G67=\"\",\"\",'MYO Sonuç'!G67)","v":""},{"$f":"IF('MYO Sonuç'!H67=\"\",\"\",'MYO Sonuç'!H67)","v":""},{"$f":"IF('MYO Sonuç'!I67=\"\",\"\",'MYO Sonuç'!I67)","v":""},{"$f":"IF('MYO Sonuç'!J67=\"\",\"\",'MYO Sonuç'!J67)","v":""},{"$f":"IF('MYO Sonuç'!K67=\"\",\"\",'MYO Sonuç'!K67)","v":""},{"$f":"IF('MYO Sonuç'!L67=\"\",\"\",'MYO Sonuç'!L67)","v":""}]
[{"$f":"IF('MYO Sonuç'!A68=\"\",\"\",'MYO Sonuç'!A68)","v":""},{"$f":"IF('MYO Sonuç'!B68=\"\",\"\",LEFT('MYO Sonuç'!B68,3)&REPT(\"*\",4)&RIGHT('MYO Sonuç'!B68,2))","v":""},{"$f":"IF('MYO Sonuç'!C68=\"\",\"\",IF(ISERR(FIND(\" \",'MYO Sonuç'!C68))=TRUE,LEFT('MYO Sonuç'!C68,2)&REPT(\"*\",3),LEFT('MYO Sonuç'!C68,2)&REPT(\"*\",3)&\" \"&MID('MYO Sonuç'!C68,FIND(\" \",'MYO Sonuç'!C68)+1,2)&REPT(\"*\",3)))","v":""},{"$f":"IF('MYO Sonuç'!D68=\"\",\"\",IF(ISERR(FIND(\" \",'MYO Sonuç'!D68))=TRUE,LEFT('MYO Sonuç'!D68,2)&REPT(\"*\",3),LEFT('MYO Sonuç'!D68,2)&REPT(\"*\",3)&\" \"&MID('MYO Sonuç'!D68,FIND(\" \",'MYO Sonuç'!D68)+1,2)&REPT(\"*\",3)))","v":""},{"$f":"IF('MYO Sonuç'!E68=\"\",\"\",'MYO Sonuç'!E68)","v":""},{"$f":"IF('MYO Sonuç'!F68=\"\",\"\",'MYO Sonuç'!F68)","v":""},{"$f":"IF('MYO Sonuç'!G68=\"\",\"\",'MYO Sonuç'!G68)","v":""},{"$f":"IF('MYO Sonuç'!H68=\"\",\"\",'MYO Sonuç'!H68)","v":""},{"$f":"IF('MYO Sonuç'!I68=\"\",\"\",'MYO Sonuç'!I68)","v":""},{"$f":"IF('MYO Sonuç'!J68=\"\",\"\",'MYO Sonuç'!J68)","v":""},{"$f":"IF('MYO Sonuç'!K68=\"\",\"\",'MYO Sonuç'!K68)","v":""},{"$f":"IF('MYO Sonuç'!L68=\"\",\"\",'MYO Sonuç'!L68)","v":""}]
[{"$f":"IF('MYO Sonuç'!A69=\"\",\"\",'MYO Sonuç'!A69)","v":""},{"$f":"IF('MYO Sonuç'!B69=\"\",\"\",LEFT('MYO Sonuç'!B69,3)&REPT(\"*\",4)&RIGHT('MYO Sonuç'!B69,2))","v":""},{"$f":"IF('MYO Sonuç'!C69=\"\",\"\",IF(ISERR(FIND(\" \",'MYO Sonuç'!C69))=TRUE,LEFT('MYO Sonuç'!C69,2)&REPT(\"*\",3),LEFT('MYO Sonuç'!C69,2)&REPT(\"*\",3)&\" \"&MID('MYO Sonuç'!C69,FIND(\" \",'MYO Sonuç'!C69)+1,2)&REPT(\"*\",3)))","v":""},{"$f":"IF('MYO Sonuç'!D69=\"\",\"\",IF(ISERR(FIND(\" \",'MYO Sonuç'!D69))=TRUE,LEFT('MYO Sonuç'!D69,2)&REPT(\"*\",3),LEFT('MYO Sonuç'!D69,2)&REPT(\"*\",3)&\" \"&MID('MYO Sonuç'!D69,FIND(\" \",'MYO Sonuç'!D69)+1,2)&REPT(\"*\",3)))","v":""},{"$f":"IF('MYO Sonuç'!E69=\"\",\"\",'MYO Sonuç'!E69)","v":""},{"$f":"IF('MYO Sonuç'!F69=\"\",\"\",'MYO Sonuç'!F69)","v":""},{"$f":"IF('MYO Sonuç'!G69=\"\",\"\",'MYO Sonuç'!G69)","v":""},{"$f":"IF('MYO Sonuç'!H69=\"\",\"\",'MYO Sonuç'!H69)","v":""},{"$f":"IF('MYO Sonuç'!I69=\"\",\"\",'MYO Sonuç'!I69)","v":""},{"$f":"IF('MYO Sonuç'!J69=\"\",\"\",'MYO Sonuç'!J69)","v":""},{"$f":"IF('MYO Sonuç'!K69=\"\",\"\",'MYO Sonuç'!K69)","v":""},{"$f":"IF('MYO Sonuç'!L69=\"\",\"\",'MYO Sonuç'!L69)","v":""}]
[{"$f":"IF('MYO Sonuç'!A70=\"\",\"\",'MYO Sonuç'!A70)","v":""},{"$f":"IF('MYO Sonuç'!B70=\"\",\"\",LEFT('MYO Sonuç'!B70,3)&REPT(\"*\",4)&RIGHT('MYO Sonuç'!B70,2))","v":""},{"$f":"IF('MYO Sonuç'!C70=\"\",\"\",IF(ISERR(FIND(\" \",'MYO Sonuç'!C70))=TRUE,LEFT('MYO Sonuç'!C70,2)&REPT(\"*\",3),LEFT('MYO Sonuç'!C70,2)&REPT(\"*\",3)&\" \"&MID('MYO Sonuç'!C70,FIND(\" \",'MYO Sonuç'!C70)+1,2)&REPT(\"*\",3)))","v":""},{"$f":"IF('MYO Sonuç'!D70=\"\",\"\",IF(ISERR(FIND(\" \",'MYO Sonuç'!D70))=TRUE,LEFT('MYO Sonuç'!D70,2)&REPT(\"*\",3),LEFT('MYO Sonuç'!D70,2)&REPT(\"*\",3)&\" \"&MID('MYO Sonuç'!D70,FIND(\" \",'MYO Sonuç'!D70)+1,2)&REPT(\"*\",3)))","v":""},{"$f":"IF('MYO Sonuç'!E70=\"\",\"\",'MYO Sonuç'!E70)","v":""},{"$f":"IF('MYO Sonuç'!F70=\"\",\"\",'MYO Sonuç'!F70)","v":""},{"$f":"IF('MYO Sonuç'!G70=\"\",\"\",'MYO Sonuç'!G70)","v":""},{"$f":"IF('MYO Sonuç'!H70=\"\",\"\",'MYO Sonuç'!H70)","v":""},{"$f":"IF('MYO Sonuç'!I70=\"\",\"\",'MYO Sonuç'!I70)","v":""},{"$f":"IF('MYO Sonuç'!J70=\"\",\"\",'MYO Sonuç'!J70)","v":""},{"$f":"IF('MYO Sonuç'!K70=\"\",\"\",'MYO Sonuç'!K70)","v":""},{"$f":"IF('MYO Sonuç'!L70=\"\",\"\",'MYO Sonuç'!L70)","v":""}]
[{"$f":"IF('MYO Sonuç'!A71=\"\",\"\",'MYO Sonuç'!A71)","v":""},{"$f":"IF('MYO Sonuç'!B71=\"\",\"\",LEFT('MYO Sonuç'!B71,3)&REPT(\"*\",4)&RIGHT('MYO Sonuç'!B71,2))","v":""},{"$f":"IF('MYO Sonuç'!C71=\"\",\"\",IF(ISERR(FIND(\" \",'MYO Sonuç'!C71))=TRUE,LEFT('MYO Sonuç'!C71,2)&REPT(\"*\",3),LEFT('MYO Sonuç'!C71,2)&REPT(\"*\",3)&\" \"&MID('MYO Sonuç'!C71,FIND(\" \",'MYO Sonuç'!C71)+1,2)&REPT(\"*\",3)))","v":""},{"$f":"IF('MYO Sonuç'!D71=\"\",\"\",IF(ISERR(FIND(\" \",'MYO Sonuç'!D71))=TRUE,LEFT('MYO Sonuç'!D71,2)&REPT(\"*\",3),LEFT('MYO Sonuç'!D71,2)&REPT(\"*\",3)&\" \"&MID('MYO Sonuç'!D71,FIND(\" \",'MYO Sonuç'!D71)+1,2)&REPT(\"*\",3)))","v":""},{"$f":"IF('MYO Sonuç'!E71=\"\",\"\",'MYO Sonuç'!E71)","v":""},{"$f":"IF('MYO Sonuç'!F71=\"\",\"\",'MYO Sonuç'!F71)","v":""},{"$f":"IF('MYO Sonuç'!G71=\"\",\"\",'MYO Sonuç'!G71)","v":""},{"$f":"IF('MYO Sonuç'!H71=\"\",\"\",'MYO Sonuç'!H71)","v":""},{"$f":"IF('MYO Sonuç'!I71=\"\",\"\",'MYO Sonuç'!I71)","v":""},{"$f":"IF('MYO Sonuç'!J71=\"\",\"\",'MYO Sonuç'!J71)","v":""},{"$f":"IF('MYO Sonuç'!K71=\"\",\"\",'MYO Sonuç'!K71)","v":""},{"$f":"IF('MYO Sonuç'!L71=\"\",\"\",'MYO Sonuç'!L71)","v":""}]
[{"$f":"IF('MYO Sonuç'!A72=\"\",\"\",'MYO Sonuç'!A72)","v":""},{"$f":"IF('MYO Sonuç'!B72=\"\",\"\",LEFT('MYO Sonuç'!B72,3)&REPT(\"*\",4)&RIGHT('MYO Sonuç'!B72,2))","v":""},{"$f":"IF('MYO Sonuç'!C72=\"\",\"\",IF(ISERR(FIND(\" \",'MYO Sonuç'!C72))=TRUE,LEFT('MYO Sonuç'!C72,2)&REPT(\"*\",3),LEFT('MYO Sonuç'!C72,2)&REPT(\"*\",3)&\" \"&MID('MYO Sonuç'!C72,FIND(\" \",'MYO Sonuç'!C72)+1,2)&REPT(\"*\",3)))","v":""},{"$f":"IF('MYO Sonuç'!D72=\"\",\"\",IF(ISERR(FIND(\" \",'MYO Sonuç'!D72))=TRUE,LEFT('MYO Sonuç'!D72,2)&REPT(\"*\",3),LEFT('MYO Sonuç'!D72,2)&REPT(\"*\",3)&\" \"&MID('MYO Sonuç'!D72,FIND(\" \",'MYO Sonuç'!D72)+1,2)&REPT(\"*\",3)))","v":""},{"$f":"IF('MYO Sonuç'!E72=\"\",\"\",'MYO Sonuç'!E72)","v":""},{"$f":"IF('MYO Sonuç'!F72=\"\",\"\",'MYO Sonuç'!F72)","v":""},{"$f":"IF('MYO Sonuç'!G72=\"\",\"\",'MYO Sonuç'!G72)","v":""},{"$f":"IF('MYO Sonuç'!H72=\"\",\"\",'MYO Sonuç'!H72)","v":""},{"$f":"IF('MYO Sonuç'!I72=\"\",\"\",'MYO Sonuç'!I72)","v":""},{"$f":"IF('MYO Sonuç'!J72=\"\",\"\",'MYO Sonuç'!J72)","v":""},{"$f":"IF('MYO Sonuç'!K72=\"\",\"\",'MYO Sonuç'!K72)","v":""},{"$f":"IF('MYO Sonuç'!L72=\"\",\"\",'MYO Sonuç'!L72)","v":""}]
[{"$f":"IF('MYO Sonuç'!A73=\"\",\"\",'MYO Sonuç'!A73)","v":""},{"$f":"IF('MYO Sonuç'!B73=\"\",\"\",LEFT('MYO Sonuç'!B73,3)&REPT(\"*\",4)&RIGHT('MYO Sonuç'!B73,2))","v":""},{"$f":"IF('MYO Sonuç'!C73=\"\",\"\",IF(ISERR(FIND(\" \",'MYO Sonuç'!C73))=TRUE,LEFT('MYO Sonuç'!C73,2)&REPT(\"*\",3),LEFT('MYO Sonuç'!C73,2)&REPT(\"*\",3)&\" \"&MID('MYO Sonuç'!C73,FIND(\" \",'MYO Sonuç'!C73)+1,2)&REPT(\"*\",3)))","v":""},{"$f":"IF('MYO Sonuç'!D73=\"\",\"\",IF(ISERR(FIND(\" \",'MYO Sonuç'!D73))=TRUE,LEFT('MYO Sonuç'!D73,2)&REPT(\"*\",3),LEFT('MYO Sonuç'!D73,2)&REPT(\"*\",3)&\" \"&MID('MYO Sonuç'!D73,FIND(\" \",'MYO Sonuç'!D73)+1,2)&REPT(\"*\",3)))","v":""},{"$f":"IF('MYO Sonuç'!E73=\"\",\"\",'MYO Sonuç'!E73)","v":""},{"$f":"IF('MYO Sonuç'!F73=\"\",\"\",'MYO Sonuç'!F73)","v":""},{"$f":"IF('MYO Sonuç'!G73=\"\",\"\",'MYO Sonuç'!G73)","v":""},{"$f":"IF('MYO Sonuç'!H73=\"\",\"\",'MYO Sonuç'!H73)","v":""},{"$f":"IF('MYO Sonuç'!I73=\"\",\"\",'MYO Sonuç'!I73)","v":""},{"$f":"IF('MYO Sonuç'!J73=\"\",\"\",'MYO Sonuç'!J73)","v":""},{"$f":"IF('MYO Sonuç'!K73=\"\",\"\",'MYO Sonuç'!K73)","v":""},{"$f":"IF('MYO Sonuç'!L73=\"\",\"\",'MYO Sonuç'!L73)","v":""}]
[{"$f":"IF('MYO Sonuç'!A74=\"\",\"\",'MYO Sonuç'!A74)","v":""},{"$f":"IF('MYO Sonuç'!B74=\"\",\"\",LEFT('MYO Sonuç'!B74,3)&REPT(\"*\",4)&RIGHT('MYO Sonuç'!B74,2))","v":""},{"$f":"IF('MYO Sonuç'!C74=\"\",\"\",IF(ISERR(FIND(\" \",'MYO Sonuç'!C74))=TRUE,LEFT('MYO Sonuç'!C74,2)&REPT(\"*\",3),LEFT('MYO Sonuç'!C74,2)&REPT(\"*\",3)&\" \"&MID('MYO Sonuç'!C74,FIND(\" \",'MYO Sonuç'!C74)+1,2)&REPT(\"*\",3)))","v":""},{"$f":"IF('MYO Sonuç'!D74=\"\",\"\",IF(ISERR(FIND(\" \",'MYO Sonuç'!D74))=TRUE,LEFT('MYO Sonuç'!D74,2)&REPT(\"*\",3),LEFT('MYO Sonuç'!D74,2)&REPT(\"*\",3)&\" \"&MID('MYO Sonuç'!D74,FIND(\" \",'MYO Sonuç'!D74)+1,2)&REPT(\"*\",3)))","v":""},{"$f":"IF('MYO Sonuç'!E74=\"\",\"\",'MYO Sonuç'!E74)","v":""},{"$f":"IF('MYO Sonuç'!F74=\"\",\"\",'MYO Sonuç'!F74)","v":""},{"$f":"IF('MYO Sonuç'!G74=\"\",\"\",'MYO Sonuç'!G74)","v":""},{"$f":"IF('MYO Sonuç'!H74=\"\",\"\",'MYO Sonuç'!H74)","v":""},{"$f":"IF('MYO Sonuç'!I74=\"\",\"\",'MYO Sonuç'!I74)","v":""},{"$f":"IF('MYO Sonuç'!J74=\"\",\"\",'MYO Sonuç'!J74)","v":""},{"$f":"IF('MYO Sonuç'!K74=\"\",\"\",'MYO Sonuç'!K74)","v":""},{"$f":"IF('MYO Sonuç'!L74=\"\",\"\",'MYO Sonuç'!L74)","v":""}]
[{"$f":"IF('MYO Sonuç'!A75=\"\",\"\",'MYO Sonuç'!A75)","v":""},{"$f":"IF('MYO Sonuç'!B75=\"\",\"\",LEFT('MYO Sonuç'!B75,3)&REPT(\"*\",4)&RIGHT('MYO Sonuç'!B75,2))","v":""},{"$f":"IF('MYO Sonuç'!C75=\"\",\"\",IF(ISERR(FIND(\" \",'MYO Sonuç'!C75))=TRUE,LEFT('MYO Sonuç'!C75,2)&REPT(\"*\",3),LEFT('MYO Sonuç'!C75,2)&REPT(\"*\",3)&\" \"&MID('MYO Sonuç'!C75,FIND(\" \",'MYO Sonuç'!C75)+1,2)&REPT(\"*\",3)))","v":""},{"$f":"IF('MYO Sonuç'!D75=\"\",\"\",IF(ISERR(FIND(\" \",'MYO Sonuç'!D75))=TRUE,LEFT('MYO Sonuç'!D75,2)&REPT(\"*\",3),LEFT('MYO Sonuç'!D75,2)&REPT(\"*\",3)&\" \"&MID('MYO Sonuç'!D75,FIND(\" \",'MYO Sonuç'!D75)+1,2)&REPT(\"*\",3)))","v":""},{"$f":"IF('MYO Sonuç'!E75=\"\",\"\",'MYO Sonuç'!E75)","v":""},{"$f":"IF('MYO Sonuç'!F75=\"\",\"\",'MYO Sonuç'!F75)","v":""},{"$f":"IF('MYO Sonuç'!G75=\"\",\"\",'MYO Sonuç'!G75)","v":""},{"$f":"IF('MYO Sonuç'!H75=\"\",\"\",'MYO Sonuç'!H75)","v":""},{"$f":"IF('MYO Sonuç'!I75=\"\",\"\",'MYO Sonuç'!I75)","v":""},{"$f":"IF('MYO Sonuç'!J75=\"\",\"\",'MYO Sonuç'!J75)","v":""},{"$f":"IF('MYO Sonuç'!K75=\"\",\"\",'MYO Sonuç'!K75)","v":""},{"$f":"IF('MYO Sonuç'!L75=\"\",\"\",'MYO Sonuç'!L75)","v":""}]